{"text_format":"1","workbook":"xlsx","n_sheets":7,"sheets":["Einleitung","Szenarien","Maßnahmen","\"Walking Weights\"","Empfehlungen","Daten","Ergebnisse"],"not_rendered":{"charts":2,"images":7,"macros":1,"external_links":0,"defined_names":3,"comments":0,"pivot_tables":0},"unopened":[],"bounds":{"document_bytes":16777216,"sheet_cells":100000,"rows_first":2000,"rows_last":500,"rows_between":2000,"halvings":0,"cell_chars":16384,"cell_head_chars":4096},"cells_cut":0,"cells_raw":0,"read":"whole","date_system":"1900"}

{"sheet":"Einleitung","index":0,"n_rows":0,"n_cols":0,"rows_kept":0,"cut":false,"hidden":false,"merged":[]}

{"sheet":"Szenarien","index":1,"n_rows":39,"n_cols":35,"rows_kept":39,"cut":false,"hidden":false,"merged":[]}
[]
[]
[]
[]
[]
[]
[]
[]
[]
[]
[]
[]
[]
[]
[]
[]
[]
[]
[]
[]
[]
[]
[]
[]
[]
[]
[]
[]
[]
[]
[]
[]
[]
[]
[]
[]
[]
[]
[null,null,null,null,null,null,null,null,null,null,null,null,null,null,null,null,null,null,null,null,null,null,null,null,null,null,null,null,null,null,null,null,null,null," "]

{"sheet":"Maßnahmen","index":2,"n_rows":27,"n_cols":5,"rows_kept":27,"cut":false,"hidden":false,"merged":[]}
[]
[]
[]
[]
[]
[]
[]
[]
[null,null,null,"Maßnahme / Kriterium","Beschreibung"]
[null,null,null,{"$f":"Daten!$D2","v":"Investmentanteil urbane Gebiete"},"Der Anteil der Infrastrukturinvestitionen, der in urbane Siedlungsgebiete fließt. Ein hoher Wert ist allgemein wichtig für Transformationsprozesse und ein Katalysator für weitere Maßnahmen."]
[null,null,null,{"$f":"Daten!$D3","v":"Durchschnittliches Investment pro Kopf in Infrastruktur"},"Der Anteil der Investitionen, der pro Kopf für Infrastruktur aufgewendet wird. Eng verknüpft mit dem Investitionsanteil in urbane Gebiete und wie dieser ein Türöffner für weitere Innovationen."]
[null,null,null,{"$f":"Daten!$D4","v":"Qualität Parkmanagement"},"Bis zu einem Drittel des urbanen Verkehrs besteht aus Sucherkehr, sprich Fahrzeugen auf der Suche nach freien Plätzen. Anzeigetafeln, digitale Karten und verbaute Sensortechnik können dem entgegenwirken."]
[null,null,null,{"$f":"Daten!$D5","v":"Qualität ÖPNV"},"Eine leicht erhöhte, zeitlich aber flexible Taktung erlaubt eine höhere Auslastung der vorhandenen Kapazitäten."]
[null,null,null,{"$f":"Daten!$D6","v":"City Maut"},"Filterung der Verkehrsmodi durch Bepreisung der Nutzung von bestimmten Straßen oder sogar Quartieren."]
[null,null,null,{"$f":"Daten!$D7","v":"Parkpreis"},"Begrenzung des Autoverkehrs durch erhöhte Parkpreise."]
[null,null,null,{"$f":"Daten!$D8","v":"Fahrtkosten"},"Erhöhte Kraftstoffpreise sorgen für einen Rückgang des Autoverkehrs."]
[null,null,null,{"$f":"Daten!$D9","v":"CO2-Preis"},"Ein sektorenübergreifender CO2-Preis erhöht u.a. die Fahrtkosten für Verbrenner. "]
[null,null,null,{"$f":"Daten!$D10","v":"Internetabdeckung"},"Flächendeckende Verfügbarkeit von schnellem Internet sowie ein hoher Nutzungsgrad lassen digitale Geschäftsmodelle schneller skalieren und können so Innovation beschleunigen. Beispiele sind Rufbusse und Sharing-Dienste."]
[null,null,null,{"$f":"Daten!$D11","v":"Mietpreis-Index"}," Vergleichsgröße bezeichnet, welche sich auf die durchschnittliche Veränderung von Nettokaltmieten innerhalb eines Zeitrahmens bezieht."]
[null,null,null,{"$f":"Daten!$D12","v":"Wohnflächen"},"Die simulierte Gesamt-Wohnfläche für das Zieljahr 2030 (in Hektar) im Ruhrgebiet."]
[null,null,null,{"$f":"Daten!$D13","v":"Industrie-/Gewerbeflächen"},"Die simulierte Gesamt-Industriefläche für das Zieljahr 2030 (in Hektar) im Ruhrgebiet."]
[null,null,null,{"$f":"Daten!$D14","v":"Beschäftigte"},"Die simulierte Gesamtanzahl an Beschäftigten für das Zieljahr 2030 im Ruhrgebiet."]
[null,null,null,{"$f":"Daten!$D15","v":"Interkommunale Radwege"},"Radwege zwischen großen Siedlungsflächen (Städten im allgemeinen) existieren und werden genutzt. Im Ruhrgebiet ist das vorrangig der Radschnellweg."]
[null,null,null,{"$f":"Daten!$D16","v":"Erhöhte Fahrradsicherheit"},"Dazu gehören breitere Wege, sichtbare Fahrbahnmarkierungen oder aussreichende Parkmöglichkeiten."]
[null,null,null,{"$f":"Daten!$D17","v":"E-Bike-Ladepunkte-Netz"},"Ein Netzwerk an austauschbaren Batterien für E-Bikes wird entlang von wichtigen Hauptachsen aufgebaut, sodass eine durchgehend hohe Reichweite gewährleistet werden kann."]
[null,null,null,{"$f":"Daten!$D18","v":"\"Smart Card\""},"Theoretische digitale Lösung für regionen- und verkehrsträgerübergreifende Mobilität. Einmalige Anmeldung genügt für gesamtes Mobilitätsangebot, Buchung erfolgt ebenfalls hier."]
[null,null,null,{"$f":"Daten!$D19","v":"CO2 Mobilität"},"Elektrifizierung in Individualverkehr, in ÖPNV und der Logistik für schnelle Reduktion. Langfristig auch Neuverteilung des Modal Split durch Sharing und Rufbusse."]

{"sheet":"\"Walking Weights\"","index":3,"n_rows":34,"n_cols":15,"rows_kept":34,"cut":false,"hidden":false,"merged":[[33,9,33,11],[32,9,32,11],[31,9,31,11],[30,9,30,11],[29,9,29,11]]}
[]
[]
[]
[]
[null,null,"Maßnahme","Gewichtung in %"]
[null,null,{"$f":"Daten!$D2","v":"Investmentanteil urbane Gebiete"},6]
[null,null,{"$f":"Daten!$D3","v":"Durchschnittliches Investment pro Kopf in Infrastruktur"},{"$f":"100/COUNTA($C$6:$C$23)","v":5.5555555555555554}]
[null,null,{"$f":"Daten!$D4","v":"Qualität Parkmanagement"},5.5555555555555554]
[null,null,{"$f":"Daten!$D5","v":"Qualität ÖPNV"},5.5555555555555554]
[null,null,{"$f":"Daten!$D6","v":"City Maut"},5.5555555555555554]
[null,null,{"$f":"Daten!$D7","v":"Parkpreis"},5.5555555555555554]
[null,null,{"$f":"Daten!$D8","v":"Fahrtkosten"},5.5555555555555554]
[null,null,{"$f":"Daten!$D9","v":"CO2-Preis"},5.5555555555555554,null,null,null,null,null,null,null,{"$f":"Ergebnis","v":"Smart City"},"Healthy City","Urban Sprawl","Business as usual"]
[null,null,{"$f":"Daten!$D10","v":"Internetabdeckung"},5.5555555555555554,null,null,null,null,null,null,null,0.26702910112429473,0.38481502304177129,3.1268445662765154E-2,-0.58549235409840095]
[null,null,{"$f":"Daten!$D11","v":"Mietpreis-Index"},5.5555555555555554]
[null,null,{"$f":"Daten!$D12","v":"Wohnflächen"},5.5555555555555554]
[null,null,{"$f":"Daten!$D13","v":"Industrie-/Gewerbeflächen"},5.5555555555555554]
[null,null,{"$f":"Daten!$D14","v":"Beschäftigte"},5.5555555555555554]
[null,null,{"$f":"Daten!$D15","v":"Interkommunale Radwege"},5.5555555555555554]
[null,null,{"$f":"Daten!$D16","v":"Erhöhte Fahrradsicherheit"},5.5555555555555554]
[null,null,{"$f":"Daten!$D17","v":"E-Bike-Ladepunkte-Netz"},5.5555555555555554]
[null,null,{"$f":"Daten!$D18","v":"\"Smart Card\""},5.5555555555555554]
[null,null,{"$f":"Daten!$D19","v":"CO2 Mobilität"},5.5555555555555554]
[null,null,"Summe (muss 100 ergeben)",{"$f":"ROUND(SUM(D6:D23),0)","v":100}]
[]
[null,null,null,null,null,null,null,null,{"$f":"Empfehlungen!A5","v":"Folgendes Szenario wird bei Ihrer Gewichtung bevorzugt:"}]
[null,null,null,null,null,null,null,null,null,{"$f":"INDEX(Daten!H23:K23,MATCH(MAX(Daten!H24:K24),Daten!H24:K24,0))","v":"Healthy City"}]
[null,null,null,null,null,null,null,null,{"$f":"Empfehlungen!A7","v":"In diesem Szenario sind besonders folgende Maßnahmen stark vertreten:"}]
[]
[null,null,null,null,null,null,null,null,{"$f":"Empfehlungen!B7","v":1},{"$f":"Empfehlungen!C7","v":"Parkpreis"},null,null,{"$f":"Empfehlungen!D7","v":"Begrenzung des Autoverkehrs durch erhöhte Parkpreise."}]
[null,null,null,null,null,null,null,null,{"$f":"Empfehlungen!B8","v":2},{"$f":"Empfehlungen!C8","v":"Durchschnittliches Investment pro Kopf in Infrastruktur"},null,null,{"$f":"Empfehlungen!D8","v":"Der Anteil der Investitionen, der pro Kopf für Infrastruktur aufgewendet wird. Eng verknüpft mit dem Investitionsanteil in urbane Gebiete und wie dieser ein Türöffner für weitere Innovationen."}]
[null,null,null,null,null,null,null,null,{"$f":"Empfehlungen!B9","v":3},{"$f":"Empfehlungen!C9","v":"City Maut"},null,null,{"$f":"Empfehlungen!D9","v":"Filterung der Verkehrsmodi durch Bepreisung der Nutzung von bestimmten Straßen oder sogar Quartieren."}]
[null,null,null,null,null,null,null,null,{"$f":"Empfehlungen!B10","v":4},{"$f":"Empfehlungen!C10","v":"CO2 Mobilität"},null,null,{"$f":"Empfehlungen!D10","v":"Elektrifizierung in Individualverkehr, in ÖPNV und der Logistik für schnelle Reduktion. Langfristig auch Neuverteilung des Modal Split durch Sharing und Rufbusse."}]
[null,null,null,null,null,null,null,null,{"$f":"Empfehlungen!B11","v":5},{"$f":"Empfehlungen!C11","v":"Mietpreis-Index"},null,null,{"$f":"Empfehlungen!D11","v":" Vergleichsgröße bezeichnet, welche sich auf die durchschnittliche Veränderung von Nettokaltmieten innerhalb eines Zeitrahmens bezieht."}]

{"sheet":"Empfehlungen","index":4,"n_rows":11,"n_cols":4,"rows_kept":11,"cut":false,"hidden":true,"merged":[]}
[]
[]
[]
[]
["Folgendes Szenario wird bei Ihrer Gewichtung bevorzugt:",null,{"$f":"INDEX(Daten!H23:K23,MATCH(MAX(Daten!H24:K24),Daten!H24:K24,0))","v":"Healthy City"}]
[]
["In diesem Szenario sind besonders folgende Maßnahmen stark vertreten:",1,{"$f":"IF($C$5=Tabelle3[[#Headers],[Smart City]],INDEX(Tabelle2[Kriterium],_xlfn.XMATCH(LARGE(Tabelle3[Smart City],B7),Tabelle3[Smart City])),IF($C$5=Tabelle3[[#Headers],[Healthy City]],INDEX(Tabelle2[Kriterium],_xlfn.XMATCH(LARGE(Tabelle3[Healthy City],B7),Tabelle3[Healthy City])),IF($C$5=Tabelle3[[#Headers],[Urban Sprawl]],INDEX(Tabelle2[Kriterium],_xlfn.XMATCH(LARGE(Tabelle3[Urban Sprawl],B7),Tabelle3[Urban Sprawl])),IF($C$5=Tabelle3[[#Headers],[Business as usual]],INDEX(Tabelle2[Kriterium],_xlfn.XMATCH(LARGE(Tabelle3[Business as usual],B7),Tabelle3[Business as usual]))))))","v":"Parkpreis"},{"$f":"_xlfn.XLOOKUP(Empfehlungen!C7,Maßnahmen!$D$10:D$27,Maßnahmen!E$10:E$27)","v":"Begrenzung des Autoverkehrs durch erhöhte Parkpreise."}]
[null,2,{"$f":"IF($C$5=Tabelle3[[#Headers],[Smart City]],INDEX(Tabelle2[Kriterium],_xlfn.XMATCH(LARGE(Tabelle3[Smart City],B8),Tabelle3[Smart City])),IF($C$5=Tabelle3[[#Headers],[Healthy City]],INDEX(Tabelle2[Kriterium],_xlfn.XMATCH(LARGE(Tabelle3[Healthy City],B8),Tabelle3[Healthy City])),IF($C$5=Tabelle3[[#Headers],[Urban Sprawl]],INDEX(Tabelle2[Kriterium],_xlfn.XMATCH(LARGE(Tabelle3[Urban Sprawl],B8),Tabelle3[Urban Sprawl])),IF($C$5=Tabelle3[[#Headers],[Business as usual]],INDEX(Tabelle2[Kriterium],_xlfn.XMATCH(LARGE(Tabelle3[Business as usual],B8),Tabelle3[Business as usual]))))))","v":"Durchschnittliches Investment pro Kopf in Infrastruktur"},{"$f":"_xlfn.XLOOKUP(Empfehlungen!C8,Maßnahmen!$D$10:D$27,Maßnahmen!E$10:E$27)","v":"Der Anteil der Investitionen, der pro Kopf für Infrastruktur aufgewendet wird. Eng verknüpft mit dem Investitionsanteil in urbane Gebiete und wie dieser ein Türöffner für weitere Innovationen."}]
[null,3,{"$f":"IF($C$5=Tabelle3[[#Headers],[Smart City]],INDEX(Tabelle2[Kriterium],_xlfn.XMATCH(LARGE(Tabelle3[Smart City],B9),Tabelle3[Smart City])),IF($C$5=Tabelle3[[#Headers],[Healthy City]],INDEX(Tabelle2[Kriterium],_xlfn.XMATCH(LARGE(Tabelle3[Healthy City],B9),Tabelle3[Healthy City])),IF($C$5=Tabelle3[[#Headers],[Urban Sprawl]],INDEX(Tabelle2[Kriterium],_xlfn.XMATCH(LARGE(Tabelle3[Urban Sprawl],B9),Tabelle3[Urban Sprawl])),IF($C$5=Tabelle3[[#Headers],[Business as usual]],INDEX(Tabelle2[Kriterium],_xlfn.XMATCH(LARGE(Tabelle3[Business as usual],B9),Tabelle3[Business as usual]))))))","v":"City Maut"},{"$f":"_xlfn.XLOOKUP(Empfehlungen!C9,Maßnahmen!$D$10:D$27,Maßnahmen!E$10:E$27)","v":"Filterung der Verkehrsmodi durch Bepreisung der Nutzung von bestimmten Straßen oder sogar Quartieren."}]
[null,4,{"$f":"IF($C$5=Tabelle3[[#Headers],[Smart City]],INDEX(Tabelle2[Kriterium],_xlfn.XMATCH(LARGE(Tabelle3[Smart City],B10),Tabelle3[Smart City])),IF($C$5=Tabelle3[[#Headers],[Healthy City]],INDEX(Tabelle2[Kriterium],_xlfn.XMATCH(LARGE(Tabelle3[Healthy City],B10),Tabelle3[Healthy City])),IF($C$5=Tabelle3[[#Headers],[Urban Sprawl]],INDEX(Tabelle2[Kriterium],_xlfn.XMATCH(LARGE(Tabelle3[Urban Sprawl],B10),Tabelle3[Urban Sprawl])),IF($C$5=Tabelle3[[#Headers],[Business as usual]],INDEX(Tabelle2[Kriterium],_xlfn.XMATCH(LARGE(Tabelle3[Business as usual],B10),Tabelle3[Business as usual]))))))","v":"CO2 Mobilität"},{"$f":"_xlfn.XLOOKUP(Empfehlungen!C10,Maßnahmen!$D$10:D$27,Maßnahmen!E$10:E$27)","v":"Elektrifizierung in Individualverkehr, in ÖPNV und der Logistik für schnelle Reduktion. Langfristig auch Neuverteilung des Modal Split durch Sharing und Rufbusse."}]
[null,5,{"$f":"IF($C$5=Tabelle3[[#Headers],[Smart City]],INDEX(Tabelle2[Kriterium],_xlfn.XMATCH(LARGE(Tabelle3[Smart City],B11),Tabelle3[Smart City],-1)),IF($C$5=Tabelle3[[#Headers],[Healthy City]],INDEX(Tabelle2[Kriterium],_xlfn.XMATCH(LARGE(Tabelle3[Healthy City],B11),Tabelle3[Healthy City])),IF($C$5=Tabelle3[[#Headers],[Urban Sprawl]],INDEX(Tabelle2[Kriterium],_xlfn.XMATCH(LARGE(Tabelle3[Urban Sprawl],B11),Tabelle3[Urban Sprawl])),IF($C$5=Tabelle3[[#Headers],[Business as usual]],INDEX(Tabelle2[Kriterium],_xlfn.XMATCH(LARGE(Tabelle3[Business as usual],B11),Tabelle3[Business as usual]))))))","v":"Mietpreis-Index"},{"$f":"_xlfn.XLOOKUP(Empfehlungen!C11,Maßnahmen!$D$10:D$27,Maßnahmen!E$10:E$27)","v":" Vergleichsgröße bezeichnet, welche sich auf die durchschnittliche Veränderung von Nettokaltmieten innerhalb eines Zeitrahmens bezieht."}]

{"sheet":"Daten","index":5,"n_rows":48,"n_cols":30,"rows_kept":48,"cut":false,"hidden":false,"merged":[[19,7,21,10],[28,12,44,13],[22,6,23,6]]}
[null,null,null,"Kriterium","Gewicht","min/max","Einheit","Smart City","Healthy City","Urban Sprawl","Business as usual","Präferenzfunktion","q-Wert (Indifferenz)","p-Wert (Präferenz)","d1-Wert SC","d2-Wert SC2","d3-Wert SC2","Smart City Summe","d1-Wert HC","d2-Wert HC","d3-Wert HC","Healthy City Summe","d1-Wert US","d2-Wert US","d3-Wert US","Urban Sprawl Summe","d1-Wert Bau","d2-Wert Bau","d3-Wert Bau","Business as usual Summe"]
[null,null,null,"Investmentanteil urbane Gebiete",{"$f":"('\"Walking Weights\"'!D6)/100","v":0.06},"max","%",80,80,50,40,"Typ 5",15,40,{"$f":"IF(Tabelle2[[#This Row],[min/max]]=\"min\",-1*IF(Tabelle2[[#This Row],[Smart City]]-Tabelle2[[#This Row],[Healthy City]]<0,-1*IF(ABS(Tabelle2[[#This Row],[Smart City]]-Tabelle2[[#This Row],[Healthy City]])<Tabelle2[[#This Row],[q-Wert (Indifferenz)]], 0,IF(ABS(Tabelle2[[#This Row],[Smart City]]-Tabelle2[[#This Row],[Healthy City]])>Tabelle2[[#This Row],[p-Wert (Präferenz)]],1,IF(AND(ABS(Tabelle2[[#This Row],[Smart City]]-Tabelle2[[#This Row],[Healthy City]])<=Tabelle2[[#This Row],[p-Wert (Präferenz)]],ABS(Tabelle2[[#This Row],[Smart City]]-Tabelle2[[#This Row],[Healthy City]])>=Tabelle2[[#This Row],[q-Wert (Indifferenz)]]),((ABS(Tabelle2[[#This Row],[Smart City]]-Tabelle2[[#This Row],[Healthy City]])-Tabelle2[[#This Row],[q-Wert (Indifferenz)]])/(Tabelle2[[#This Row],[p-Wert (Präferenz)]]-Tabelle2[[#This Row],[q-Wert (Indifferenz)]]))))),IF(ABS(Tabelle2[[#This Row],[Smart City]]-Tabelle2[[#This Row],[Healthy City]])<Tabelle2[[#This Row],[q-Wert (Indifferenz)]], 0,IF(ABS(Tabelle2[[#This Row],[Smart City]]-Tabelle2[[#This Row],[Healthy City]])>Tabelle2[[#This Row],[p-Wert (Präferenz)]],1,IF(AND(ABS(Tabelle2[[#This Row],[Smart City]]-Tabelle2[[#This Row],[Healthy City]])<=Tabelle2[[#This Row],[p-Wert (Präferenz)]],ABS(Tabelle2[[#This Row],[Smart City]]-Tabelle2[[#This Row],[Healthy City]])>=Tabelle2[[#This Row],[q-Wert (Indifferenz)]]),((ABS(Tabelle2[[#This Row],[Smart City]]-Tabelle2[[#This Row],[Healthy City]])-Tabelle2[[#This Row],[q-Wert (Indifferenz)]])/(Tabelle2[[#This Row],[p-Wert (Präferenz)]]-Tabelle2[[#This Row],[q-Wert (Indifferenz)]])))))),IF(Tabelle2[[#This Row],[Smart City]]-Tabelle2[[#This Row],[Healthy City]]<0,-1*IF(ABS(Tabelle2[[#This Row],[Smart City]]-Tabelle2[[#This Row],[Healthy City]])<Tabelle2[[#This Row],[q-Wert (Indifferenz)]], 0,IF(ABS(Tabelle2[[#This Row],[Smart City]]-Tabelle2[[#This Row],[Healthy City]])>Tabelle2[[#This Row],[p-Wert (Präferenz)]],1,IF(AND(ABS(Tabelle2[[#This Row],[Smart City]]-Tabelle2[[#This Row],[Healthy City]])<=Tabelle2[[#This Row],[p-Wert (Präferenz)]],ABS(Tabelle2[[#This Row],[Smart City]]-Tabelle2[[#This Row],[Healthy City]])>=Tabelle2[[#This Row],[q-Wert (Indifferenz)]]),((ABS(Tabelle2[[#This Row],[Smart City]]-Tabelle2[[#This Row],[Healthy City]])-Tabelle2[[#This Row],[q-Wert (Indifferenz)]])/(Tabelle2[[#This Row],[p-Wert (Präferenz)]]-Tabelle2[[#This Row],[q-Wert (Indifferenz)]]))))),IF(ABS(Tabelle2[[#This Row],[Smart City]]-Tabelle2[[#This Row],[Healthy City]])<Tabelle2[[#This Row],[q-Wert (Indifferenz)]], 0,IF(ABS(Tabelle2[[#This Row],[Smart City]]-Tabelle2[[#This Row],[Healthy City]])>Tabelle2[[#This Row],[p-Wert (Präferenz)]],1,IF(AND(ABS(Tabelle2[[#This Row],[Smart City]]-Tabelle2[[#This Row],[Healthy City]])<=Tabelle2[[#This Row],[p-Wert (Präferenz)]],ABS(Tabelle2[[#This Row],[Smart City]]-Tabelle2[[#This Row],[Healthy City]])>=Tabelle2[[#This Row],[q-Wert (Indifferenz)]]),((ABS(Tabelle2[[#This Row],[Smart City]]-Tabelle2[[#This Row],[Healthy City]])-Tabelle2[[#This Row],[q-Wert (Indifferenz)]])/(Tabelle2[[#This Row],[p-Wert (Präferenz)]]-Tabelle2[[#This Row],[q-Wert (Indifferenz)]])))))))","v":0},{"$f":"IF(Tabelle2[[#This Row],[min/max]]=\"min\",-1*IF(Tabelle2[[#This Row],[Smart City]]-Tabelle2[[#This Row],[Urban Sprawl]]<0,-1*IF(ABS(Tabelle2[[#This Row],[Smart City]]-Tabelle2[[#This Row],[Urban Sprawl]])<Tabelle2[[#This Row],[q-Wert (Indifferenz)]], 0,IF(ABS(Tabelle2[[#This Row],[Smart City]]-Tabelle2[[#This Row],[Urban Sprawl]])>Tabelle2[[#This Row],[p-Wert (Präferenz)]],1,IF(AND(ABS(Tabelle2[[#This Row],[Smart City]]-Tabelle2[[#This Row],[Urban Sprawl]])<=Tabelle2[[#This Row],[p-Wert (Präferenz)]],ABS(Tabelle2[[#This Row],[Smart City]]-Tabelle2[[#This Row],[Urban Sprawl]])>=Tabelle2[[#This Row],[q-Wert (Indifferenz)]]),((ABS(Tabelle2[[#This Row],[Smart City]]-Tabelle2[[#This Row],[Urban Sprawl]])-Tabelle2[[#This Row],[q-Wert (Indifferenz)]])/(Tabelle2[[#This Row],[p-Wert (Präferenz)]]-Tabelle2[[#This Row],[q-Wert (Indifferenz)]]))))),IF(ABS(Tabelle2[[#This Row],[Smart City]]-Tabelle2[[#This Row],[Urban Sprawl]])<Tabelle2[[#This Row],[q-Wert (Indifferenz)]], 0,IF(ABS(Tabelle2[[#This Row],[Smart City]]-Tabelle2[[#This Row],[Urban Sprawl]])>Tabelle2[[#This Row],[p-Wert (Präferenz)]],1,IF(AND(ABS(Tabelle2[[#This Row],[Smart City]]-Tabelle2[[#This Row],[Urban Sprawl]])<=Tabelle2[[#This Row],[p-Wert (Präferenz)]],ABS(Tabelle2[[#This Row],[Smart City]]-Tabelle2[[#This Row],[Urban Sprawl]])>=Tabelle2[[#This Row],[q-Wert (Indifferenz)]]),((ABS(Tabelle2[[#This Row],[Smart City]]-Tabelle2[[#This Row],[Urban Sprawl]])-Tabelle2[[#This Row],[q-Wert (Indifferenz)]])/(Tabelle2[[#This Row],[p-Wert (Präferenz)]]-Tabelle2[[#This Row],[q-Wert (Indifferenz)]])))))),IF(Tabelle2[[#This Row],[Smart City]]-Tabelle2[[#This Row],[Urban Sprawl]]<0,-1*IF(ABS(Tabelle2[[#This Row],[Smart City]]-Tabelle2[[#This Row],[Urban Sprawl]])<Tabelle2[[#This Row],[q-Wert (Indifferenz)]], 0,IF(ABS(Tabelle2[[#This Row],[Smart City]]-Tabelle2[[#This Row],[Urban Sprawl]])>Tabelle2[[#This Row],[p-Wert (Präferenz)]],1,IF(AND(ABS(Tabelle2[[#This Row],[Smart City]]-Tabelle2[[#This Row],[Urban Sprawl]])<=Tabelle2[[#This Row],[p-Wert (Präferenz)]],ABS(Tabelle2[[#This Row],[Smart City]]-Tabelle2[[#This Row],[Urban Sprawl]])>=Tabelle2[[#This Row],[q-Wert (Indifferenz)]]),((ABS(Tabelle2[[#This Row],[Smart City]]-Tabelle2[[#This Row],[Urban Sprawl]])-Tabelle2[[#This Row],[q-Wert (Indifferenz)]])/(Tabelle2[[#This Row],[p-Wert (Präferenz)]]-Tabelle2[[#This Row],[q-Wert (Indifferenz)]]))))),IF(ABS(Tabelle2[[#This Row],[Smart City]]-Tabelle2[[#This Row],[Urban Sprawl]])<Tabelle2[[#This Row],[q-Wert (Indifferenz)]], 0,IF(ABS(Tabelle2[[#This Row],[Smart City]]-Tabelle2[[#This Row],[Urban Sprawl]])>Tabelle2[[#This Row],[p-Wert (Präferenz)]],1,IF(AND(ABS(Tabelle2[[#This Row],[Smart City]]-Tabelle2[[#This Row],[Urban Sprawl]])<=Tabelle2[[#This Row],[p-Wert (Präferenz)]],ABS(Tabelle2[[#This Row],[Smart City]]-Tabelle2[[#This Row],[Urban Sprawl]])>=Tabelle2[[#This Row],[q-Wert (Indifferenz)]]),((ABS(Tabelle2[[#This Row],[Smart City]]-Tabelle2[[#This Row],[Urban Sprawl]])-Tabelle2[[#This Row],[q-Wert (Indifferenz)]])/(Tabelle2[[#This Row],[p-Wert (Präferenz)]]-Tabelle2[[#This Row],[q-Wert (Indifferenz)]])))))))","v":0.6},{"$f":"IF(Tabelle2[[#This Row],[min/max]]=\"min\",-1*IF(Tabelle2[[#This Row],[Smart City]]-Tabelle2[[#This Row],[Business as usual]]<0,-1*IF(ABS(Tabelle2[[#This Row],[Smart City]]-Tabelle2[[#This Row],[Business as usual]])<Tabelle2[[#This Row],[q-Wert (Indifferenz)]], 0,IF(ABS(Tabelle2[[#This Row],[Smart City]]-Tabelle2[[#This Row],[Business as usual]])>Tabelle2[[#This Row],[p-Wert (Präferenz)]],1,IF(AND(ABS(Tabelle2[[#This Row],[Smart City]]-Tabelle2[[#This Row],[Business as usual]])<=Tabelle2[[#This Row],[p-Wert (Präferenz)]],ABS(Tabelle2[[#This Row],[Smart City]]-Tabelle2[[#This Row],[Business as usual]])>=Tabelle2[[#This Row],[q-Wert (Indifferenz)]]),((ABS(Tabelle2[[#This Row],[Smart City]]-Tabelle2[[#This Row],[Business as usual]])-Tabelle2[[#This Row],[q-Wert (Indifferenz)]])/(Tabelle2[[#This Row],[p-Wert (Präferenz)]]-Tabelle2[[#This Row],[q-Wert (Indifferenz)]]))))),IF(ABS(Tabelle2[[#This Row],[Smart City]]-Tabelle2[[#This Row],[Business as usual]])<Tabelle2[[#This Row],[q-Wert (Indifferenz)]], 0,IF(ABS(Tabelle2[[#This Row],[Smart City]]-Tabelle2[[#This Row],[Business as usual]])>Tabelle2[[#This Row],[p-Wert (Präferenz)]],1,IF(AND(ABS(Tabelle2[[#This Row],[Smart City]]-Tabelle2[[#This Row],[Business as usual]])<=Tabelle2[[#This Row],[p-Wert (Präferenz)]],ABS(Tabelle2[[#This Row],[Smart City]]-Tabelle2[[#This Row],[Business as usual]])>=Tabelle2[[#This Row],[q-Wert (Indifferenz)]]),((ABS(Tabelle2[[#This Row],[Smart City]]-Tabelle2[[#This Row],[Business as usual]])-Tabelle2[[#This Row],[q-Wert (Indifferenz)]])/(Tabelle2[[#This Row],[p-Wert (Präferenz)]]-Tabelle2[[#This Row],[q-Wert (Indifferenz)]])))))),IF(Tabelle2[[#This Row],[Smart City]]-Tabelle2[[#This Row],[Business as usual]]<0,-1*IF(ABS(Tabelle2[[#This Row],[Smart City]]-Tabelle2[[#This Row],[Business as usual]])<Tabelle2[[#This Row],[q-Wert (Indifferenz)]], 0,IF(ABS(Tabelle2[[#This Row],[Smart City]]-Tabelle2[[#This Row],[Business as usual]])>Tabelle2[[#This Row],[p-Wert (Präferenz)]],1,IF(AND(ABS(Tabelle2[[#This Row],[Smart City]]-Tabelle2[[#This Row],[Business as usual]])<=Tabelle2[[#This Row],[p-Wert (Präferenz)]],ABS(Tabelle2[[#This Row],[Smart City]]-Tabelle2[[#This Row],[Business as usual]])>=Tabelle2[[#This Row],[q-Wert (Indifferenz)]]),((ABS(Tabelle2[[#This Row],[Smart City]]-Tabelle2[[#This Row],[Business as usual]])-Tabelle2[[#This Row],[q-Wert (Indifferenz)]])/(Tabelle2[[#This Row],[p-Wert (Präferenz)]]-Tabelle2[[#This Row],[q-Wert (Indifferenz)]]))))),IF(ABS(Tabelle2[[#This Row],[Smart City]]-Tabelle2[[#This Row],[Business as usual]])<Tabelle2[[#This Row],[q-Wert (Indifferenz)]], 0,IF(ABS(Tabelle2[[#This Row],[Smart City]]-Tabelle2[[#This Row],[Business as usual]])>Tabelle2[[#This Row],[p-Wert (Präferenz)]],1,IF(AND(ABS(Tabelle2[[#This Row],[Smart City]]-Tabelle2[[#This Row],[Business as usual]])<=Tabelle2[[#This Row],[p-Wert (Präferenz)]],ABS(Tabelle2[[#This Row],[Smart City]]-Tabelle2[[#This Row],[Business as usual]])>=Tabelle2[[#This Row],[q-Wert (Indifferenz)]]),((ABS(Tabelle2[[#This Row],[Smart City]]-Tabelle2[[#This Row],[Business as usual]])-Tabelle2[[#This Row],[q-Wert (Indifferenz)]])/(Tabelle2[[#This Row],[p-Wert (Präferenz)]]-Tabelle2[[#This Row],[q-Wert (Indifferenz)]])))))))","v":1},null,{"$f":"IF(Tabelle2[[#This Row],[min/max]]=\"min\",-1*IF(Tabelle2[[#This Row],[Healthy City]]-Tabelle2[[#This Row],[Smart City]]<0,-1*IF(ABS(Tabelle2[[#This Row],[Healthy City]]-Tabelle2[[#This Row],[Smart City]])<Tabelle2[[#This Row],[q-Wert (Indifferenz)]], 0,IF(ABS(Tabelle2[[#This Row],[Healthy City]]-Tabelle2[[#This Row],[Smart City]])>Tabelle2[[#This Row],[p-Wert (Präferenz)]],1,IF(AND(ABS(Tabelle2[[#This Row],[Healthy City]]-Tabelle2[[#This Row],[Smart City]])<=Tabelle2[[#This Row],[p-Wert (Präferenz)]],ABS(Tabelle2[[#This Row],[Healthy City]]-Tabelle2[[#This Row],[Smart City]])>=Tabelle2[[#This Row],[q-Wert (Indifferenz)]]),((ABS(Tabelle2[[#This Row],[Healthy City]]-Tabelle2[[#This Row],[Smart City]])-Tabelle2[[#This Row],[q-Wert (Indifferenz)]])/(Tabelle2[[#This Row],[p-Wert (Präferenz)]]-Tabelle2[[#This Row],[q-Wert (Indifferenz)]]))))),IF(ABS(Tabelle2[[#This Row],[Healthy City]]-Tabelle2[[#This Row],[Smart City]])<Tabelle2[[#This Row],[q-Wert (Indifferenz)]], 0,IF(ABS(Tabelle2[[#This Row],[Healthy City]]-Tabelle2[[#This Row],[Smart City]])>Tabelle2[[#This Row],[p-Wert (Präferenz)]],1,IF(AND(ABS(Tabelle2[[#This Row],[Healthy City]]-Tabelle2[[#This Row],[Smart City]])<=Tabelle2[[#This Row],[p-Wert (Präferenz)]],ABS(Tabelle2[[#This Row],[Healthy City]]-Tabelle2[[#This Row],[Smart City]])>=Tabelle2[[#This Row],[q-Wert (Indifferenz)]]),((ABS(Tabelle2[[#This Row],[Healthy City]]-Tabelle2[[#This Row],[Smart City]])-Tabelle2[[#This Row],[q-Wert (Indifferenz)]])/(Tabelle2[[#This Row],[p-Wert (Präferenz)]]-Tabelle2[[#This Row],[q-Wert (Indifferenz)]])))))),IF(Tabelle2[[#This Row],[Healthy City]]-Tabelle2[[#This Row],[Smart City]]<0,-1*IF(ABS(Tabelle2[[#This Row],[Healthy City]]-Tabelle2[[#This Row],[Smart City]])<Tabelle2[[#This Row],[q-Wert (Indifferenz)]], 0,IF(ABS(Tabelle2[[#This Row],[Healthy City]]-Tabelle2[[#This Row],[Smart City]])>Tabelle2[[#This Row],[p-Wert (Präferenz)]],1,IF(AND(ABS(Tabelle2[[#This Row],[Healthy City]]-Tabelle2[[#This Row],[Smart City]])<=Tabelle2[[#This Row],[p-Wert (Präferenz)]],ABS(Tabelle2[[#This Row],[Healthy City]]-Tabelle2[[#This Row],[Smart City]])>=Tabelle2[[#This Row],[q-Wert (Indifferenz)]]),((ABS(Tabelle2[[#This Row],[Healthy City]]-Tabelle2[[#This Row],[Smart City]])-Tabelle2[[#This Row],[q-Wert (Indifferenz)]])/(Tabelle2[[#This Row],[p-Wert (Präferenz)]]-Tabelle2[[#This Row],[q-Wert (Indifferenz)]]))))),IF(ABS(Tabelle2[[#This Row],[Healthy City]]-Tabelle2[[#This Row],[Smart City]])<Tabelle2[[#This Row],[q-Wert (Indifferenz)]], 0,IF(ABS(Tabelle2[[#This Row],[Healthy City]]-Tabelle2[[#This Row],[Smart City]])>Tabelle2[[#This Row],[p-Wert (Präferenz)]],1,IF(AND(ABS(Tabelle2[[#This Row],[Healthy City]]-Tabelle2[[#This Row],[Smart City]])<=Tabelle2[[#This Row],[p-Wert (Präferenz)]],ABS(Tabelle2[[#This Row],[Healthy City]]-Tabelle2[[#This Row],[Smart City]])>=Tabelle2[[#This Row],[q-Wert (Indifferenz)]]),((ABS(Tabelle2[[#This Row],[Healthy City]]-Tabelle2[[#This Row],[Smart City]])-Tabelle2[[#This Row],[q-Wert (Indifferenz)]])/(Tabelle2[[#This Row],[p-Wert (Präferenz)]]-Tabelle2[[#This Row],[q-Wert (Indifferenz)]])))))))","v":0},{"$f":"IF(Tabelle2[[#This Row],[min/max]]=\"min\",-1*IF(Tabelle2[[#This Row],[Healthy City]]-Tabelle2[[#This Row],[Urban Sprawl]]<0,-1*IF(ABS(Tabelle2[[#This Row],[Healthy City]]-Tabelle2[[#This Row],[Urban Sprawl]])<Tabelle2[[#This Row],[q-Wert (Indifferenz)]], 0,IF(ABS(Tabelle2[[#This Row],[Healthy City]]-Tabelle2[[#This Row],[Urban Sprawl]])>Tabelle2[[#This Row],[p-Wert (Präferenz)]],1,IF(AND(ABS(Tabelle2[[#This Row],[Healthy City]]-Tabelle2[[#This Row],[Urban Sprawl]])<=Tabelle2[[#This Row],[p-Wert (Präferenz)]],ABS(Tabelle2[[#This Row],[Healthy City]]-Tabelle2[[#This Row],[Urban Sprawl]])>=Tabelle2[[#This Row],[q-Wert (Indifferenz)]]),((ABS(Tabelle2[[#This Row],[Healthy City]]-Tabelle2[[#This Row],[Urban Sprawl]])-Tabelle2[[#This Row],[q-Wert (Indifferenz)]])/(Tabelle2[[#This Row],[p-Wert (Präferenz)]]-Tabelle2[[#This Row],[q-Wert (Indifferenz)]]))))),IF(ABS(Tabelle2[[#This Row],[Healthy City]]-Tabelle2[[#This Row],[Urban Sprawl]])<Tabelle2[[#This Row],[q-Wert (Indifferenz)]], 0,IF(ABS(Tabelle2[[#This Row],[Healthy City]]-Tabelle2[[#This Row],[Urban Sprawl]])>Tabelle2[[#This Row],[p-Wert (Präferenz)]],1,IF(AND(ABS(Tabelle2[[#This Row],[Healthy City]]-Tabelle2[[#This Row],[Urban Sprawl]])<=Tabelle2[[#This Row],[p-Wert (Präferenz)]],ABS(Tabelle2[[#This Row],[Healthy City]]-Tabelle2[[#This Row],[Urban Sprawl]])>=Tabelle2[[#This Row],[q-Wert (Indifferenz)]]),((ABS(Tabelle2[[#This Row],[Healthy City]]-Tabelle2[[#This Row],[Urban Sprawl]])-Tabelle2[[#This Row],[q-Wert (Indifferenz)]])/(Tabelle2[[#This Row],[p-Wert (Präferenz)]]-Tabelle2[[#This Row],[q-Wert (Indifferenz)]])))))),IF(Tabelle2[[#This Row],[Healthy City]]-Tabelle2[[#This Row],[Urban Sprawl]]<0,-1*IF(ABS(Tabelle2[[#This Row],[Healthy City]]-Tabelle2[[#This Row],[Urban Sprawl]])<Tabelle2[[#This Row],[q-Wert (Indifferenz)]], 0,IF(ABS(Tabelle2[[#This Row],[Healthy City]]-Tabelle2[[#This Row],[Urban Sprawl]])>Tabelle2[[#This Row],[p-Wert (Präferenz)]],1,IF(AND(ABS(Tabelle2[[#This Row],[Healthy City]]-Tabelle2[[#This Row],[Urban Sprawl]])<=Tabelle2[[#This Row],[p-Wert (Präferenz)]],ABS(Tabelle2[[#This Row],[Healthy City]]-Tabelle2[[#This Row],[Urban Sprawl]])>=Tabelle2[[#This Row],[q-Wert (Indifferenz)]]),((ABS(Tabelle2[[#This Row],[Healthy City]]-Tabelle2[[#This Row],[Urban Sprawl]])-Tabelle2[[#This Row],[q-Wert (Indifferenz)]])/(Tabelle2[[#This Row],[p-Wert (Präferenz)]]-Tabelle2[[#This Row],[q-Wert (Indifferenz)]]))))),IF(ABS(Tabelle2[[#This Row],[Healthy City]]-Tabelle2[[#This Row],[Urban Sprawl]])<Tabelle2[[#This Row],[q-Wert (Indifferenz)]], 0,IF(ABS(Tabelle2[[#This Row],[Healthy City]]-Tabelle2[[#This Row],[Urban Sprawl]])>Tabelle2[[#This Row],[p-Wert (Präferenz)]],1,IF(AND(ABS(Tabelle2[[#This Row],[Healthy City]]-Tabelle2[[#This Row],[Urban Sprawl]])<=Tabelle2[[#This Row],[p-Wert (Präferenz)]],ABS(Tabelle2[[#This Row],[Healthy City]]-Tabelle2[[#This Row],[Urban Sprawl]])>=Tabelle2[[#This Row],[q-Wert (Indifferenz)]]),((ABS(Tabelle2[[#This Row],[Healthy City]]-Tabelle2[[#This Row],[Urban Sprawl]])-Tabelle2[[#This Row],[q-Wert (Indifferenz)]])/(Tabelle2[[#This Row],[p-Wert (Präferenz)]]-Tabelle2[[#This Row],[q-Wert (Indifferenz)]])))))))","v":0.6},{"$f":"IF(Tabelle2[[#This Row],[min/max]]=\"min\",-1*IF(Tabelle2[[#This Row],[Healthy City]]-Tabelle2[[#This Row],[Business as usual]]<0,-1*IF(ABS(Tabelle2[[#This Row],[Healthy City]]-Tabelle2[[#This Row],[Business as usual]])<Tabelle2[[#This Row],[q-Wert (Indifferenz)]], 0,IF(ABS(Tabelle2[[#This Row],[Healthy City]]-Tabelle2[[#This Row],[Business as usual]])>Tabelle2[[#This Row],[p-Wert (Präferenz)]],1,IF(AND(ABS(Tabelle2[[#This Row],[Healthy City]]-Tabelle2[[#This Row],[Business as usual]])<=Tabelle2[[#This Row],[p-Wert (Präferenz)]],ABS(Tabelle2[[#This Row],[Healthy City]]-Tabelle2[[#This Row],[Business as usual]])>=Tabelle2[[#This Row],[q-Wert (Indifferenz)]]),((ABS(Tabelle2[[#This Row],[Healthy City]]-Tabelle2[[#This Row],[Business as usual]])-Tabelle2[[#This Row],[q-Wert (Indifferenz)]])/(Tabelle2[[#This Row],[p-Wert (Präferenz)]]-Tabelle2[[#This Row],[q-Wert (Indifferenz)]]))))),IF(ABS(Tabelle2[[#This Row],[Healthy City]]-Tabelle2[[#This Row],[Business as usual]])<Tabelle2[[#This Row],[q-Wert (Indifferenz)]], 0,IF(ABS(Tabelle2[[#This Row],[Healthy City]]-Tabelle2[[#This Row],[Business as usual]])>Tabelle2[[#This Row],[p-Wert (Präferenz)]],1,IF(AND(ABS(Tabelle2[[#This Row],[Healthy City]]-Tabelle2[[#This Row],[Business as usual]])<=Tabelle2[[#This Row],[p-Wert (Präferenz)]],ABS(Tabelle2[[#This Row],[Healthy City]]-Tabelle2[[#This Row],[Business as usual]])>=Tabelle2[[#This Row],[q-Wert (Indifferenz)]]),((ABS(Tabelle2[[#This Row],[Healthy City]]-Tabelle2[[#This Row],[Business as usual]])-Tabelle2[[#This Row],[q-Wert (Indifferenz)]])/(Tabelle2[[#This Row],[p-Wert (Präferenz)]]-Tabelle2[[#This Row],[q-Wert (Indifferenz)]])))))),IF(Tabelle2[[#This Row],[Healthy City]]-Tabelle2[[#This Row],[Business as usual]]<0,-1*IF(ABS(Tabelle2[[#This Row],[Healthy City]]-Tabelle2[[#This Row],[Business as usual]])<Tabelle2[[#This Row],[q-Wert (Indifferenz)]], 0,IF(ABS(Tabelle2[[#This Row],[Healthy City]]-Tabelle2[[#This Row],[Business as usual]])>Tabelle2[[#This Row],[p-Wert (Präferenz)]],1,IF(AND(ABS(Tabelle2[[#This Row],[Healthy City]]-Tabelle2[[#This Row],[Business as usual]])<=Tabelle2[[#This Row],[p-Wert (Präferenz)]],ABS(Tabelle2[[#This Row],[Healthy City]]-Tabelle2[[#This Row],[Business as usual]])>=Tabelle2[[#This Row],[q-Wert (Indifferenz)]]),((ABS(Tabelle2[[#This Row],[Healthy City]]-Tabelle2[[#This Row],[Business as usual]])-Tabelle2[[#This Row],[q-Wert (Indifferenz)]])/(Tabelle2[[#This Row],[p-Wert (Präferenz)]]-Tabelle2[[#This Row],[q-Wert (Indifferenz)]]))))),IF(ABS(Tabelle2[[#This Row],[Healthy City]]-Tabelle2[[#This Row],[Business as usual]])<Tabelle2[[#This Row],[q-Wert (Indifferenz)]], 0,IF(ABS(Tabelle2[[#This Row],[Healthy City]]-Tabelle2[[#This Row],[Business as usual]])>Tabelle2[[#This Row],[p-Wert (Präferenz)]],1,IF(AND(ABS(Tabelle2[[#This Row],[Healthy City]]-Tabelle2[[#This Row],[Business as usual]])<=Tabelle2[[#This Row],[p-Wert (Präferenz)]],ABS(Tabelle2[[#This Row],[Healthy City]]-Tabelle2[[#This Row],[Business as usual]])>=Tabelle2[[#This Row],[q-Wert (Indifferenz)]]),((ABS(Tabelle2[[#This Row],[Healthy City]]-Tabelle2[[#This Row],[Business as usual]])-Tabelle2[[#This Row],[q-Wert (Indifferenz)]])/(Tabelle2[[#This Row],[p-Wert (Präferenz)]]-Tabelle2[[#This Row],[q-Wert (Indifferenz)]])))))))","v":1},null,{"$f":"IF(Tabelle2[[#This Row],[min/max]]=\"min\",-1*IF(Tabelle2[[#This Row],[Urban Sprawl]]-Tabelle2[[#This Row],[Smart City]]<0,-1*IF(ABS(Tabelle2[[#This Row],[Urban Sprawl]]-Tabelle2[[#This Row],[Smart City]])<Tabelle2[[#This Row],[q-Wert (Indifferenz)]], 0,IF(ABS(Tabelle2[[#This Row],[Urban Sprawl]]-Tabelle2[[#This Row],[Smart City]])>Tabelle2[[#This Row],[p-Wert (Präferenz)]],1,IF(AND(ABS(Tabelle2[[#This Row],[Urban Sprawl]]-Tabelle2[[#This Row],[Smart City]])<=Tabelle2[[#This Row],[p-Wert (Präferenz)]],ABS(Tabelle2[[#This Row],[Urban Sprawl]]-Tabelle2[[#This Row],[Smart City]])>=Tabelle2[[#This Row],[q-Wert (Indifferenz)]]),((ABS(Tabelle2[[#This Row],[Urban Sprawl]]-Tabelle2[[#This Row],[Smart City]])-Tabelle2[[#This Row],[q-Wert (Indifferenz)]])/(Tabelle2[[#This Row],[p-Wert (Präferenz)]]-Tabelle2[[#This Row],[q-Wert (Indifferenz)]]))))),IF(ABS(Tabelle2[[#This Row],[Urban Sprawl]]-Tabelle2[[#This Row],[Smart City]])<Tabelle2[[#This Row],[q-Wert (Indifferenz)]], 0,IF(ABS(Tabelle2[[#This Row],[Urban Sprawl]]-Tabelle2[[#This Row],[Smart City]])>Tabelle2[[#This Row],[p-Wert (Präferenz)]],1,IF(AND(ABS(Tabelle2[[#This Row],[Urban Sprawl]]-Tabelle2[[#This Row],[Smart City]])<=Tabelle2[[#This Row],[p-Wert (Präferenz)]],ABS(Tabelle2[[#This Row],[Urban Sprawl]]-Tabelle2[[#This Row],[Smart City]])>=Tabelle2[[#This Row],[q-Wert (Indifferenz)]]),((ABS(Tabelle2[[#This Row],[Urban Sprawl]]-Tabelle2[[#This Row],[Smart City]])-Tabelle2[[#This Row],[q-Wert (Indifferenz)]])/(Tabelle2[[#This Row],[p-Wert (Präferenz)]]-Tabelle2[[#This Row],[q-Wert (Indifferenz)]])))))),IF(Tabelle2[[#This Row],[Urban Sprawl]]-Tabelle2[[#This Row],[Smart City]]<0,-1*IF(ABS(Tabelle2[[#This Row],[Urban Sprawl]]-Tabelle2[[#This Row],[Smart City]])<Tabelle2[[#This Row],[q-Wert (Indifferenz)]], 0,IF(ABS(Tabelle2[[#This Row],[Urban Sprawl]]-Tabelle2[[#This Row],[Smart City]])>Tabelle2[[#This Row],[p-Wert (Präferenz)]],1,IF(AND(ABS(Tabelle2[[#This Row],[Urban Sprawl]]-Tabelle2[[#This Row],[Smart City]])<=Tabelle2[[#This Row],[p-Wert (Präferenz)]],ABS(Tabelle2[[#This Row],[Urban Sprawl]]-Tabelle2[[#This Row],[Smart City]])>=Tabelle2[[#This Row],[q-Wert (Indifferenz)]]),((ABS(Tabelle2[[#This Row],[Urban Sprawl]]-Tabelle2[[#This Row],[Smart City]])-Tabelle2[[#This Row],[q-Wert (Indifferenz)]])/(Tabelle2[[#This Row],[p-Wert (Präferenz)]]-Tabelle2[[#This Row],[q-Wert (Indifferenz)]]))))),IF(ABS(Tabelle2[[#This Row],[Urban Sprawl]]-Tabelle2[[#This Row],[Smart City]])<Tabelle2[[#This Row],[q-Wert (Indifferenz)]], 0,IF(ABS(Tabelle2[[#This Row],[Urban Sprawl]]-Tabelle2[[#This Row],[Smart City]])>Tabelle2[[#This Row],[p-Wert (Präferenz)]],1,IF(AND(ABS(Tabelle2[[#This Row],[Urban Sprawl]]-Tabelle2[[#This Row],[Smart City]])<=Tabelle2[[#This Row],[p-Wert (Präferenz)]],ABS(Tabelle2[[#This Row],[Urban Sprawl]]-Tabelle2[[#This Row],[Smart City]])>=Tabelle2[[#This Row],[q-Wert (Indifferenz)]]),((ABS(Tabelle2[[#This Row],[Urban Sprawl]]-Tabelle2[[#This Row],[Smart City]])-Tabelle2[[#This Row],[q-Wert (Indifferenz)]])/(Tabelle2[[#This Row],[p-Wert (Präferenz)]]-Tabelle2[[#This Row],[q-Wert (Indifferenz)]])))))))","v":-0.6},{"$f":"IF(Tabelle2[[#This Row],[min/max]]=\"min\",-1*IF(Tabelle2[[#This Row],[Urban Sprawl]]-Tabelle2[[#This Row],[Healthy City]]<0,-1*IF(ABS(Tabelle2[[#This Row],[Urban Sprawl]]-Tabelle2[[#This Row],[Healthy City]])<Tabelle2[[#This Row],[q-Wert (Indifferenz)]], 0,IF(ABS(Tabelle2[[#This Row],[Urban Sprawl]]-Tabelle2[[#This Row],[Healthy City]])>Tabelle2[[#This Row],[p-Wert (Präferenz)]],1,IF(AND(ABS(Tabelle2[[#This Row],[Urban Sprawl]]-Tabelle2[[#This Row],[Healthy City]])<=Tabelle2[[#This Row],[p-Wert (Präferenz)]],ABS(Tabelle2[[#This Row],[Urban Sprawl]]-Tabelle2[[#This Row],[Healthy City]])>=Tabelle2[[#This Row],[q-Wert (Indifferenz)]]),((ABS(Tabelle2[[#This Row],[Urban Sprawl]]-Tabelle2[[#This Row],[Healthy City]])-Tabelle2[[#This Row],[q-Wert (Indifferenz)]])/(Tabelle2[[#This Row],[p-Wert (Präferenz)]]-Tabelle2[[#This Row],[q-Wert (Indifferenz)]]))))),IF(ABS(Tabelle2[[#This Row],[Urban Sprawl]]-Tabelle2[[#This Row],[Healthy City]])<Tabelle2[[#This Row],[q-Wert (Indifferenz)]], 0,IF(ABS(Tabelle2[[#This Row],[Urban Sprawl]]-Tabelle2[[#This Row],[Healthy City]])>Tabelle2[[#This Row],[p-Wert (Präferenz)]],1,IF(AND(ABS(Tabelle2[[#This Row],[Urban Sprawl]]-Tabelle2[[#This Row],[Healthy City]])<=Tabelle2[[#This Row],[p-Wert (Präferenz)]],ABS(Tabelle2[[#This Row],[Urban Sprawl]]-Tabelle2[[#This Row],[Healthy City]])>=Tabelle2[[#This Row],[q-Wert (Indifferenz)]]),((ABS(Tabelle2[[#This Row],[Urban Sprawl]]-Tabelle2[[#This Row],[Healthy City]])-Tabelle2[[#This Row],[q-Wert (Indifferenz)]])/(Tabelle2[[#This Row],[p-Wert (Präferenz)]]-Tabelle2[[#This Row],[q-Wert (Indifferenz)]])))))),IF(Tabelle2[[#This Row],[Urban Sprawl]]-Tabelle2[[#This Row],[Healthy City]]<0,-1*IF(ABS(Tabelle2[[#This Row],[Urban Sprawl]]-Tabelle2[[#This Row],[Healthy City]])<Tabelle2[[#This Row],[q-Wert (Indifferenz)]], 0,IF(ABS(Tabelle2[[#This Row],[Urban Sprawl]]-Tabelle2[[#This Row],[Healthy City]])>Tabelle2[[#This Row],[p-Wert (Präferenz)]],1,IF(AND(ABS(Tabelle2[[#This Row],[Urban Sprawl]]-Tabelle2[[#This Row],[Healthy City]])<=Tabelle2[[#This Row],[p-Wert (Präferenz)]],ABS(Tabelle2[[#This Row],[Urban Sprawl]]-Tabelle2[[#This Row],[Healthy City]])>=Tabelle2[[#This Row],[q-Wert (Indifferenz)]]),((ABS(Tabelle2[[#This Row],[Urban Sprawl]]-Tabelle2[[#This Row],[Healthy City]])-Tabelle2[[#This Row],[q-Wert (Indifferenz)]])/(Tabelle2[[#This Row],[p-Wert (Präferenz)]]-Tabelle2[[#This Row],[q-Wert (Indifferenz)]]))))),IF(ABS(Tabelle2[[#This Row],[Urban Sprawl]]-Tabelle2[[#This Row],[Healthy City]])<Tabelle2[[#This Row],[q-Wert (Indifferenz)]], 0,IF(ABS(Tabelle2[[#This Row],[Urban Sprawl]]-Tabelle2[[#This Row],[Healthy City]])>Tabelle2[[#This Row],[p-Wert (Präferenz)]],1,IF(AND(ABS(Tabelle2[[#This Row],[Urban Sprawl]]-Tabelle2[[#This Row],[Healthy City]])<=Tabelle2[[#This Row],[p-Wert (Präferenz)]],ABS(Tabelle2[[#This Row],[Urban Sprawl]]-Tabelle2[[#This Row],[Healthy City]])>=Tabelle2[[#This Row],[q-Wert (Indifferenz)]]),((ABS(Tabelle2[[#This Row],[Urban Sprawl]]-Tabelle2[[#This Row],[Healthy City]])-Tabelle2[[#This Row],[q-Wert (Indifferenz)]])/(Tabelle2[[#This Row],[p-Wert (Präferenz)]]-Tabelle2[[#This Row],[q-Wert (Indifferenz)]])))))))","v":-0.6},{"$f":"IF(Tabelle2[[#This Row],[min/max]]=\"min\",-1*IF(Tabelle2[[#This Row],[Urban Sprawl]]-Tabelle2[[#This Row],[Business as usual]]<0,-1*IF(ABS(Tabelle2[[#This Row],[Urban Sprawl]]-Tabelle2[[#This Row],[Business as usual]])<Tabelle2[[#This Row],[q-Wert (Indifferenz)]], 0,IF(ABS(Tabelle2[[#This Row],[Urban Sprawl]]-Tabelle2[[#This Row],[Business as usual]])>Tabelle2[[#This Row],[p-Wert (Präferenz)]],1,IF(AND(ABS(Tabelle2[[#This Row],[Urban Sprawl]]-Tabelle2[[#This Row],[Business as usual]])<=Tabelle2[[#This Row],[p-Wert (Präferenz)]],ABS(Tabelle2[[#This Row],[Urban Sprawl]]-Tabelle2[[#This Row],[Business as usual]])>=Tabelle2[[#This Row],[q-Wert (Indifferenz)]]),((ABS(Tabelle2[[#This Row],[Urban Sprawl]]-Tabelle2[[#This Row],[Business as usual]])-Tabelle2[[#This Row],[q-Wert (Indifferenz)]])/(Tabelle2[[#This Row],[p-Wert (Präferenz)]]-Tabelle2[[#This Row],[q-Wert (Indifferenz)]]))))),IF(ABS(Tabelle2[[#This Row],[Urban Sprawl]]-Tabelle2[[#This Row],[Business as usual]])<Tabelle2[[#This Row],[q-Wert (Indifferenz)]], 0,IF(ABS(Tabelle2[[#This Row],[Urban Sprawl]]-Tabelle2[[#This Row],[Business as usual]])>Tabelle2[[#This Row],[p-Wert (Präferenz)]],1,IF(AND(ABS(Tabelle2[[#This Row],[Urban Sprawl]]-Tabelle2[[#This Row],[Business as usual]])<=Tabelle2[[#This Row],[p-Wert (Präferenz)]],ABS(Tabelle2[[#This Row],[Urban Sprawl]]-Tabelle2[[#This Row],[Business as usual]])>=Tabelle2[[#This Row],[q-Wert (Indifferenz)]]),((ABS(Tabelle2[[#This Row],[Urban Sprawl]]-Tabelle2[[#This Row],[Business as usual]])-Tabelle2[[#This Row],[q-Wert (Indifferenz)]])/(Tabelle2[[#This Row],[p-Wert (Präferenz)]]-Tabelle2[[#This Row],[q-Wert (Indifferenz)]])))))),IF(Tabelle2[[#This Row],[Urban Sprawl]]-Tabelle2[[#This Row],[Business as usual]]<0,-1*IF(ABS(Tabelle2[[#This Row],[Urban Sprawl]]-Tabelle2[[#This Row],[Business as usual]])<Tabelle2[[#This Row],[q-Wert (Indifferenz)]], 0,IF(ABS(Tabelle2[[#This Row],[Urban Sprawl]]-Tabelle2[[#This Row],[Business as usual]])>Tabelle2[[#This Row],[p-Wert (Präferenz)]],1,IF(AND(ABS(Tabelle2[[#This Row],[Urban Sprawl]]-Tabelle2[[#This Row],[Business as usual]])<=Tabelle2[[#This Row],[p-Wert (Präferenz)]],ABS(Tabelle2[[#This Row],[Urban Sprawl]]-Tabelle2[[#This Row],[Business as usual]])>=Tabelle2[[#This Row],[q-Wert (Indifferenz)]]),((ABS(Tabelle2[[#This Row],[Urban Sprawl]]-Tabelle2[[#This Row],[Business as usual]])-Tabelle2[[#This Row],[q-Wert (Indifferenz)]])/(Tabelle2[[#This Row],[p-Wert (Präferenz)]]-Tabelle2[[#This Row],[q-Wert (Indifferenz)]]))))),IF(ABS(Tabelle2[[#This Row],[Urban Sprawl]]-Tabelle2[[#This Row],[Business as usual]])<Tabelle2[[#This Row],[q-Wert (Indifferenz)]], 0,IF(ABS(Tabelle2[[#This Row],[Urban Sprawl]]-Tabelle2[[#This Row],[Business as usual]])>Tabelle2[[#This Row],[p-Wert (Präferenz)]],1,IF(AND(ABS(Tabelle2[[#This Row],[Urban Sprawl]]-Tabelle2[[#This Row],[Business as usual]])<=Tabelle2[[#This Row],[p-Wert (Präferenz)]],ABS(Tabelle2[[#This Row],[Urban Sprawl]]-Tabelle2[[#This Row],[Business as usual]])>=Tabelle2[[#This Row],[q-Wert (Indifferenz)]]),((ABS(Tabelle2[[#This Row],[Urban Sprawl]]-Tabelle2[[#This Row],[Business as usual]])-Tabelle2[[#This Row],[q-Wert (Indifferenz)]])/(Tabelle2[[#This Row],[p-Wert (Präferenz)]]-Tabelle2[[#This Row],[q-Wert (Indifferenz)]])))))))","v":0},null,{"$f":"IF(Tabelle2[[#This Row],[min/max]]=\"min\",-1*IF(Tabelle2[[#This Row],[Business as usual]]-Tabelle2[[#This Row],[Smart City]]<0,-1*IF(ABS(Tabelle2[[#This Row],[Business as usual]]-Tabelle2[[#This Row],[Smart City]])<Tabelle2[[#This Row],[q-Wert (Indifferenz)]], 0,IF(ABS(Tabelle2[[#This Row],[Business as usual]]-Tabelle2[[#This Row],[Smart City]])>Tabelle2[[#This Row],[p-Wert (Präferenz)]],1,IF(AND(ABS(Tabelle2[[#This Row],[Business as usual]]-Tabelle2[[#This Row],[Smart City]])<=Tabelle2[[#This Row],[p-Wert (Präferenz)]],ABS(Tabelle2[[#This Row],[Business as usual]]-Tabelle2[[#This Row],[Smart City]])>=Tabelle2[[#This Row],[q-Wert (Indifferenz)]]),((ABS(Tabelle2[[#This Row],[Business as usual]]-Tabelle2[[#This Row],[Smart City]])-Tabelle2[[#This Row],[q-Wert (Indifferenz)]])/(Tabelle2[[#This Row],[p-Wert (Präferenz)]]-Tabelle2[[#This Row],[q-Wert (Indifferenz)]]))))),IF(ABS(Tabelle2[[#This Row],[Business as usual]]-Tabelle2[[#This Row],[Smart City]])<Tabelle2[[#This Row],[q-Wert (Indifferenz)]], 0,IF(ABS(Tabelle2[[#This Row],[Business as usual]]-Tabelle2[[#This Row],[Smart City]])>Tabelle2[[#This Row],[p-Wert (Präferenz)]],1,IF(AND(ABS(Tabelle2[[#This Row],[Business as usual]]-Tabelle2[[#This Row],[Smart City]])<=Tabelle2[[#This Row],[p-Wert (Präferenz)]],ABS(Tabelle2[[#This Row],[Business as usual]]-Tabelle2[[#This Row],[Smart City]])>=Tabelle2[[#This Row],[q-Wert (Indifferenz)]]),((ABS(Tabelle2[[#This Row],[Business as usual]]-Tabelle2[[#This Row],[Smart City]])-Tabelle2[[#This Row],[q-Wert (Indifferenz)]])/(Tabelle2[[#This Row],[p-Wert (Präferenz)]]-Tabelle2[[#This Row],[q-Wert (Indifferenz)]])))))),IF(Tabelle2[[#This Row],[Business as usual]]-Tabelle2[[#This Row],[Smart City]]<0,-1*IF(ABS(Tabelle2[[#This Row],[Business as usual]]-Tabelle2[[#This Row],[Smart City]])<Tabelle2[[#This Row],[q-Wert (Indifferenz)]], 0,IF(ABS(Tabelle2[[#This Row],[Business as usual]]-Tabelle2[[#This Row],[Smart City]])>Tabelle2[[#This Row],[p-Wert (Präferenz)]],1,IF(AND(ABS(Tabelle2[[#This Row],[Business as usual]]-Tabelle2[[#This Row],[Smart City]])<=Tabelle2[[#This Row],[p-Wert (Präferenz)]],ABS(Tabelle2[[#This Row],[Business as usual]]-Tabelle2[[#This Row],[Smart City]])>=Tabelle2[[#This Row],[q-Wert (Indifferenz)]]),((ABS(Tabelle2[[#This Row],[Business as usual]]-Tabelle2[[#This Row],[Smart City]])-Tabelle2[[#This Row],[q-Wert (Indifferenz)]])/(Tabelle2[[#This Row],[p-Wert (Präferenz)]]-Tabelle2[[#This Row],[q-Wert (Indifferenz)]]))))),IF(ABS(Tabelle2[[#This Row],[Business as usual]]-Tabelle2[[#This Row],[Smart City]])<Tabelle2[[#This Row],[q-Wert (Indifferenz)]], 0,IF(ABS(Tabelle2[[#This Row],[Business as usual]]-Tabelle2[[#This Row],[Smart City]])>Tabelle2[[#This Row],[p-Wert (Präferenz)]],1,IF(AND(ABS(Tabelle2[[#This Row],[Business as usual]]-Tabelle2[[#This Row],[Smart City]])<=Tabelle2[[#This Row],[p-Wert (Präferenz)]],ABS(Tabelle2[[#This Row],[Business as usual]]-Tabelle2[[#This Row],[Smart City]])>=Tabelle2[[#This Row],[q-Wert (Indifferenz)]]),((ABS(Tabelle2[[#This Row],[Business as usual]]-Tabelle2[[#This Row],[Smart City]])-Tabelle2[[#This Row],[q-Wert (Indifferenz)]])/(Tabelle2[[#This Row],[p-Wert (Präferenz)]]-Tabelle2[[#This Row],[q-Wert (Indifferenz)]])))))))","v":-1},{"$f":"IF(Tabelle2[[#This Row],[min/max]]=\"min\",-1*IF(Tabelle2[[#This Row],[Business as usual]]-Tabelle2[[#This Row],[Healthy City]]<0,-1*IF(ABS(Tabelle2[[#This Row],[Business as usual]]-Tabelle2[[#This Row],[Healthy City]])<Tabelle2[[#This Row],[q-Wert (Indifferenz)]], 0,IF(ABS(Tabelle2[[#This Row],[Business as usual]]-Tabelle2[[#This Row],[Healthy City]])>Tabelle2[[#This Row],[p-Wert (Präferenz)]],1,IF(AND(ABS(Tabelle2[[#This Row],[Business as usual]]-Tabelle2[[#This Row],[Healthy City]])<=Tabelle2[[#This Row],[p-Wert (Präferenz)]],ABS(Tabelle2[[#This Row],[Business as usual]]-Tabelle2[[#This Row],[Healthy City]])>=Tabelle2[[#This Row],[q-Wert (Indifferenz)]]),((ABS(Tabelle2[[#This Row],[Business as usual]]-Tabelle2[[#This Row],[Healthy City]])-Tabelle2[[#This Row],[q-Wert (Indifferenz)]])/(Tabelle2[[#This Row],[p-Wert (Präferenz)]]-Tabelle2[[#This Row],[q-Wert (Indifferenz)]]))))),IF(ABS(Tabelle2[[#This Row],[Business as usual]]-Tabelle2[[#This Row],[Healthy City]])<Tabelle2[[#This Row],[q-Wert (Indifferenz)]], 0,IF(ABS(Tabelle2[[#This Row],[Business as usual]]-Tabelle2[[#This Row],[Healthy City]])>Tabelle2[[#This Row],[p-Wert (Präferenz)]],1,IF(AND(ABS(Tabelle2[[#This Row],[Business as usual]]-Tabelle2[[#This Row],[Healthy City]])<=Tabelle2[[#This Row],[p-Wert (Präferenz)]],ABS(Tabelle2[[#This Row],[Business as usual]]-Tabelle2[[#This Row],[Healthy City]])>=Tabelle2[[#This Row],[q-Wert (Indifferenz)]]),((ABS(Tabelle2[[#This Row],[Business as usual]]-Tabelle2[[#This Row],[Healthy City]])-Tabelle2[[#This Row],[q-Wert (Indifferenz)]])/(Tabelle2[[#This Row],[p-Wert (Präferenz)]]-Tabelle2[[#This Row],[q-Wert (Indifferenz)]])))))),IF(Tabelle2[[#This Row],[Business as usual]]-Tabelle2[[#This Row],[Healthy City]]<0,-1*IF(ABS(Tabelle2[[#This Row],[Business as usual]]-Tabelle2[[#This Row],[Healthy City]])<Tabelle2[[#This Row],[q-Wert (Indifferenz)]], 0,IF(ABS(Tabelle2[[#This Row],[Business as usual]]-Tabelle2[[#This Row],[Healthy City]])>Tabelle2[[#This Row],[p-Wert (Präferenz)]],1,IF(AND(ABS(Tabelle2[[#This Row],[Business as usual]]-Tabelle2[[#This Row],[Healthy City]])<=Tabelle2[[#This Row],[p-Wert (Präferenz)]],ABS(Tabelle2[[#This Row],[Business as usual]]-Tabelle2[[#This Row],[Healthy City]])>=Tabelle2[[#This Row],[q-Wert (Indifferenz)]]),((ABS(Tabelle2[[#This Row],[Business as usual]]-Tabelle2[[#This Row],[Healthy City]])-Tabelle2[[#This Row],[q-Wert (Indifferenz)]])/(Tabelle2[[#This Row],[p-Wert (Präferenz)]]-Tabelle2[[#This Row],[q-Wert (Indifferenz)]]))))),IF(ABS(Tabelle2[[#This Row],[Business as usual]]-Tabelle2[[#This Row],[Healthy City]])<Tabelle2[[#This Row],[q-Wert (Indifferenz)]], 0,IF(ABS(Tabelle2[[#This Row],[Business as usual]]-Tabelle2[[#This Row],[Healthy City]])>Tabelle2[[#This Row],[p-Wert (Präferenz)]],1,IF(AND(ABS(Tabelle2[[#This Row],[Business as usual]]-Tabelle2[[#This Row],[Healthy City]])<=Tabelle2[[#This Row],[p-Wert (Präferenz)]],ABS(Tabelle2[[#This Row],[Business as usual]]-Tabelle2[[#This Row],[Healthy City]])>=Tabelle2[[#This Row],[q-Wert (Indifferenz)]]),((ABS(Tabelle2[[#This Row],[Business as usual]]-Tabelle2[[#This Row],[Healthy City]])-Tabelle2[[#This Row],[q-Wert (Indifferenz)]])/(Tabelle2[[#This Row],[p-Wert (Präferenz)]]-Tabelle2[[#This Row],[q-Wert (Indifferenz)]])))))))","v":-1},{"$f":"IF(Tabelle2[[#This Row],[min/max]]=\"min\",-1*IF(Tabelle2[[#This Row],[Business as usual]]-Tabelle2[[#This Row],[Urban Sprawl]]<0,-1*IF(ABS(Tabelle2[[#This Row],[Business as usual]]-Tabelle2[[#This Row],[Urban Sprawl]])<Tabelle2[[#This Row],[q-Wert (Indifferenz)]], 0,IF(ABS(Tabelle2[[#This Row],[Business as usual]]-Tabelle2[[#This Row],[Urban Sprawl]])>Tabelle2[[#This Row],[p-Wert (Präferenz)]],1,IF(AND(ABS(Tabelle2[[#This Row],[Business as usual]]-Tabelle2[[#This Row],[Urban Sprawl]])<=Tabelle2[[#This Row],[p-Wert (Präferenz)]],ABS(Tabelle2[[#This Row],[Business as usual]]-Tabelle2[[#This Row],[Urban Sprawl]])>=Tabelle2[[#This Row],[q-Wert (Indifferenz)]]),((ABS(Tabelle2[[#This Row],[Business as usual]]-Tabelle2[[#This Row],[Urban Sprawl]])-Tabelle2[[#This Row],[q-Wert (Indifferenz)]])/(Tabelle2[[#This Row],[p-Wert (Präferenz)]]-Tabelle2[[#This Row],[q-Wert (Indifferenz)]]))))),IF(ABS(Tabelle2[[#This Row],[Business as usual]]-Tabelle2[[#This Row],[Urban Sprawl]])<Tabelle2[[#This Row],[q-Wert (Indifferenz)]], 0,IF(ABS(Tabelle2[[#This Row],[Business as usual]]-Tabelle2[[#This Row],[Urban Sprawl]])>Tabelle2[[#This Row],[p-Wert (Präferenz)]],1,IF(AND(ABS(Tabelle2[[#This Row],[Business as usual]]-Tabelle2[[#This Row],[Urban Sprawl]])<=Tabelle2[[#This Row],[p-Wert (Präferenz)]],ABS(Tabelle2[[#This Row],[Business as usual]]-Tabelle2[[#This Row],[Urban Sprawl]])>=Tabelle2[[#This Row],[q-Wert (Indifferenz)]]),((ABS(Tabelle2[[#This Row],[Business as usual]]-Tabelle2[[#This Row],[Urban Sprawl]])-Tabelle2[[#This Row],[q-Wert (Indifferenz)]])/(Tabelle2[[#This Row],[p-Wert (Präferenz)]]-Tabelle2[[#This Row],[q-Wert (Indifferenz)]])))))),IF(Tabelle2[[#This Row],[Business as usual]]-Tabelle2[[#This Row],[Urban Sprawl]]<0,-1*IF(ABS(Tabelle2[[#This Row],[Business as usual]]-Tabelle2[[#This Row],[Urban Sprawl]])<Tabelle2[[#This Row],[q-Wert (Indifferenz)]], 0,IF(ABS(Tabelle2[[#This Row],[Business as usual]]-Tabelle2[[#This Row],[Urban Sprawl]])>Tabelle2[[#This Row],[p-Wert (Präferenz)]],1,IF(AND(ABS(Tabelle2[[#This Row],[Business as usual]]-Tabelle2[[#This Row],[Urban Sprawl]])<=Tabelle2[[#This Row],[p-Wert (Präferenz)]],ABS(Tabelle2[[#This Row],[Business as usual]]-Tabelle2[[#This Row],[Urban Sprawl]])>=Tabelle2[[#This Row],[q-Wert (Indifferenz)]]),((ABS(Tabelle2[[#This Row],[Business as usual]]-Tabelle2[[#This Row],[Urban Sprawl]])-Tabelle2[[#This Row],[q-Wert (Indifferenz)]])/(Tabelle2[[#This Row],[p-Wert (Präferenz)]]-Tabelle2[[#This Row],[q-Wert (Indifferenz)]]))))),IF(ABS(Tabelle2[[#This Row],[Business as usual]]-Tabelle2[[#This Row],[Urban Sprawl]])<Tabelle2[[#This Row],[q-Wert (Indifferenz)]], 0,IF(ABS(Tabelle2[[#This Row],[Business as usual]]-Tabelle2[[#This Row],[Urban Sprawl]])>Tabelle2[[#This Row],[p-Wert (Präferenz)]],1,IF(AND(ABS(Tabelle2[[#This Row],[Business as usual]]-Tabelle2[[#This Row],[Urban Sprawl]])<=Tabelle2[[#This Row],[p-Wert (Präferenz)]],ABS(Tabelle2[[#This Row],[Business as usual]]-Tabelle2[[#This Row],[Urban Sprawl]])>=Tabelle2[[#This Row],[q-Wert (Indifferenz)]]),((ABS(Tabelle2[[#This Row],[Business as usual]]-Tabelle2[[#This Row],[Urban Sprawl]])-Tabelle2[[#This Row],[q-Wert (Indifferenz)]])/(Tabelle2[[#This Row],[p-Wert (Präferenz)]]-Tabelle2[[#This Row],[q-Wert (Indifferenz)]])))))))","v":0}]
[null,null,null,"Durchschnittliches Investment pro Kopf in Infrastruktur",{"$f":"('\"Walking Weights\"'!D7)/100","v":5.5555555555555552E-2},"max","€/Person",3000,5000,1000,1000,"Typ 5",1374,3708,{"$f":"IF(Tabelle2[[#This Row],[min/max]]=\"min\",-1*IF(Tabelle2[[#This Row],[Smart City]]-Tabelle2[[#This Row],[Healthy City]]<0,-1*IF(ABS(Tabelle2[[#This Row],[Smart City]]-Tabelle2[[#This Row],[Healthy City]])<Tabelle2[[#This Row],[q-Wert (Indifferenz)]], 0,IF(ABS(Tabelle2[[#This Row],[Smart City]]-Tabelle2[[#This Row],[Healthy City]])>Tabelle2[[#This Row],[p-Wert (Präferenz)]],1,IF(AND(ABS(Tabelle2[[#This Row],[Smart City]]-Tabelle2[[#This Row],[Healthy City]])<=Tabelle2[[#This Row],[p-Wert (Präferenz)]],ABS(Tabelle2[[#This Row],[Smart City]]-Tabelle2[[#This Row],[Healthy City]])>=Tabelle2[[#This Row],[q-Wert (Indifferenz)]]),((ABS(Tabelle2[[#This Row],[Smart City]]-Tabelle2[[#This Row],[Healthy City]])-Tabelle2[[#This Row],[q-Wert (Indifferenz)]])/(Tabelle2[[#This Row],[p-Wert (Präferenz)]]-Tabelle2[[#This Row],[q-Wert (Indifferenz)]]))))),IF(ABS(Tabelle2[[#This Row],[Smart City]]-Tabelle2[[#This Row],[Healthy City]])<Tabelle2[[#This Row],[q-Wert (Indifferenz)]], 0,IF(ABS(Tabelle2[[#This Row],[Smart City]]-Tabelle2[[#This Row],[Healthy City]])>Tabelle2[[#This Row],[p-Wert (Präferenz)]],1,IF(AND(ABS(Tabelle2[[#This Row],[Smart City]]-Tabelle2[[#This Row],[Healthy City]])<=Tabelle2[[#This Row],[p-Wert (Präferenz)]],ABS(Tabelle2[[#This Row],[Smart City]]-Tabelle2[[#This Row],[Healthy City]])>=Tabelle2[[#This Row],[q-Wert (Indifferenz)]]),((ABS(Tabelle2[[#This Row],[Smart City]]-Tabelle2[[#This Row],[Healthy City]])-Tabelle2[[#This Row],[q-Wert (Indifferenz)]])/(Tabelle2[[#This Row],[p-Wert (Präferenz)]]-Tabelle2[[#This Row],[q-Wert (Indifferenz)]])))))),IF(Tabelle2[[#This Row],[Smart City]]-Tabelle2[[#This Row],[Healthy City]]<0,-1*IF(ABS(Tabelle2[[#This Row],[Smart City]]-Tabelle2[[#This Row],[Healthy City]])<Tabelle2[[#This Row],[q-Wert (Indifferenz)]], 0,IF(ABS(Tabelle2[[#This Row],[Smart City]]-Tabelle2[[#This Row],[Healthy City]])>Tabelle2[[#This Row],[p-Wert (Präferenz)]],1,IF(AND(ABS(Tabelle2[[#This Row],[Smart City]]-Tabelle2[[#This Row],[Healthy City]])<=Tabelle2[[#This Row],[p-Wert (Präferenz)]],ABS(Tabelle2[[#This Row],[Smart City]]-Tabelle2[[#This Row],[Healthy City]])>=Tabelle2[[#This Row],[q-Wert (Indifferenz)]]),((ABS(Tabelle2[[#This Row],[Smart City]]-Tabelle2[[#This Row],[Healthy City]])-Tabelle2[[#This Row],[q-Wert (Indifferenz)]])/(Tabelle2[[#This Row],[p-Wert (Präferenz)]]-Tabelle2[[#This Row],[q-Wert (Indifferenz)]]))))),IF(ABS(Tabelle2[[#This Row],[Smart City]]-Tabelle2[[#This Row],[Healthy City]])<Tabelle2[[#This Row],[q-Wert (Indifferenz)]], 0,IF(ABS(Tabelle2[[#This Row],[Smart City]]-Tabelle2[[#This Row],[Healthy City]])>Tabelle2[[#This Row],[p-Wert (Präferenz)]],1,IF(AND(ABS(Tabelle2[[#This Row],[Smart City]]-Tabelle2[[#This Row],[Healthy City]])<=Tabelle2[[#This Row],[p-Wert (Präferenz)]],ABS(Tabelle2[[#This Row],[Smart City]]-Tabelle2[[#This Row],[Healthy City]])>=Tabelle2[[#This Row],[q-Wert (Indifferenz)]]),((ABS(Tabelle2[[#This Row],[Smart City]]-Tabelle2[[#This Row],[Healthy City]])-Tabelle2[[#This Row],[q-Wert (Indifferenz)]])/(Tabelle2[[#This Row],[p-Wert (Präferenz)]]-Tabelle2[[#This Row],[q-Wert (Indifferenz)]])))))))","v":-0.26820908311910885},{"$f":"IF(Tabelle2[[#This Row],[min/max]]=\"min\",-1*IF(Tabelle2[[#This Row],[Smart City]]-Tabelle2[[#This Row],[Urban Sprawl]]<0,-1*IF(ABS(Tabelle2[[#This Row],[Smart City]]-Tabelle2[[#This Row],[Urban Sprawl]])<Tabelle2[[#This Row],[q-Wert (Indifferenz)]], 0,IF(ABS(Tabelle2[[#This Row],[Smart City]]-Tabelle2[[#This Row],[Urban Sprawl]])>Tabelle2[[#This Row],[p-Wert (Präferenz)]],1,IF(AND(ABS(Tabelle2[[#This Row],[Smart City]]-Tabelle2[[#This Row],[Urban Sprawl]])<=Tabelle2[[#This Row],[p-Wert (Präferenz)]],ABS(Tabelle2[[#This Row],[Smart City]]-Tabelle2[[#This Row],[Urban Sprawl]])>=Tabelle2[[#This Row],[q-Wert (Indifferenz)]]),((ABS(Tabelle2[[#This Row],[Smart City]]-Tabelle2[[#This Row],[Urban Sprawl]])-Tabelle2[[#This Row],[q-Wert (Indifferenz)]])/(Tabelle2[[#This Row],[p-Wert (Präferenz)]]-Tabelle2[[#This Row],[q-Wert (Indifferenz)]]))))),IF(ABS(Tabelle2[[#This Row],[Smart City]]-Tabelle2[[#This Row],[Urban Sprawl]])<Tabelle2[[#This Row],[q-Wert (Indifferenz)]], 0,IF(ABS(Tabelle2[[#This Row],[Smart City]]-Tabelle2[[#This Row],[Urban Sprawl]])>Tabelle2[[#This Row],[p-Wert (Präferenz)]],1,IF(AND(ABS(Tabelle2[[#This Row],[Smart City]]-Tabelle2[[#This Row],[Urban Sprawl]])<=Tabelle2[[#This Row],[p-Wert (Präferenz)]],ABS(Tabelle2[[#This Row],[Smart City]]-Tabelle2[[#This Row],[Urban Sprawl]])>=Tabelle2[[#This Row],[q-Wert (Indifferenz)]]),((ABS(Tabelle2[[#This Row],[Smart City]]-Tabelle2[[#This Row],[Urban Sprawl]])-Tabelle2[[#This Row],[q-Wert (Indifferenz)]])/(Tabelle2[[#This Row],[p-Wert (Präferenz)]]-Tabelle2[[#This Row],[q-Wert (Indifferenz)]])))))),IF(Tabelle2[[#This Row],[Smart City]]-Tabelle2[[#This Row],[Urban Sprawl]]<0,-1*IF(ABS(Tabelle2[[#This Row],[Smart City]]-Tabelle2[[#This Row],[Urban Sprawl]])<Tabelle2[[#This Row],[q-Wert (Indifferenz)]], 0,IF(ABS(Tabelle2[[#This Row],[Smart City]]-Tabelle2[[#This Row],[Urban Sprawl]])>Tabelle2[[#This Row],[p-Wert (Präferenz)]],1,IF(AND(ABS(Tabelle2[[#This Row],[Smart City]]-Tabelle2[[#This Row],[Urban Sprawl]])<=Tabelle2[[#This Row],[p-Wert (Präferenz)]],ABS(Tabelle2[[#This Row],[Smart City]]-Tabelle2[[#This Row],[Urban Sprawl]])>=Tabelle2[[#This Row],[q-Wert (Indifferenz)]]),((ABS(Tabelle2[[#This Row],[Smart City]]-Tabelle2[[#This Row],[Urban Sprawl]])-Tabelle2[[#This Row],[q-Wert (Indifferenz)]])/(Tabelle2[[#This Row],[p-Wert (Präferenz)]]-Tabelle2[[#This Row],[q-Wert (Indifferenz)]]))))),IF(ABS(Tabelle2[[#This Row],[Smart City]]-Tabelle2[[#This Row],[Urban Sprawl]])<Tabelle2[[#This Row],[q-Wert (Indifferenz)]], 0,IF(ABS(Tabelle2[[#This Row],[Smart City]]-Tabelle2[[#This Row],[Urban Sprawl]])>Tabelle2[[#This Row],[p-Wert (Präferenz)]],1,IF(AND(ABS(Tabelle2[[#This Row],[Smart City]]-Tabelle2[[#This Row],[Urban Sprawl]])<=Tabelle2[[#This Row],[p-Wert (Präferenz)]],ABS(Tabelle2[[#This Row],[Smart City]]-Tabelle2[[#This Row],[Urban Sprawl]])>=Tabelle2[[#This Row],[q-Wert (Indifferenz)]]),((ABS(Tabelle2[[#This Row],[Smart City]]-Tabelle2[[#This Row],[Urban Sprawl]])-Tabelle2[[#This Row],[q-Wert (Indifferenz)]])/(Tabelle2[[#This Row],[p-Wert (Präferenz)]]-Tabelle2[[#This Row],[q-Wert (Indifferenz)]])))))))","v":0.26820908311910885},{"$f":"IF(Tabelle2[[#This Row],[min/max]]=\"min\",-1*IF(Tabelle2[[#This Row],[Smart City]]-Tabelle2[[#This Row],[Business as usual]]<0,-1*IF(ABS(Tabelle2[[#This Row],[Smart City]]-Tabelle2[[#This Row],[Business as usual]])<Tabelle2[[#This Row],[q-Wert (Indifferenz)]], 0,IF(ABS(Tabelle2[[#This Row],[Smart City]]-Tabelle2[[#This Row],[Business as usual]])>Tabelle2[[#This Row],[p-Wert (Präferenz)]],1,IF(AND(ABS(Tabelle2[[#This Row],[Smart City]]-Tabelle2[[#This Row],[Business as usual]])<=Tabelle2[[#This Row],[p-Wert (Präferenz)]],ABS(Tabelle2[[#This Row],[Smart City]]-Tabelle2[[#This Row],[Business as usual]])>=Tabelle2[[#This Row],[q-Wert (Indifferenz)]]),((ABS(Tabelle2[[#This Row],[Smart City]]-Tabelle2[[#This Row],[Business as usual]])-Tabelle2[[#This Row],[q-Wert (Indifferenz)]])/(Tabelle2[[#This Row],[p-Wert (Präferenz)]]-Tabelle2[[#This Row],[q-Wert (Indifferenz)]]))))),IF(ABS(Tabelle2[[#This Row],[Smart City]]-Tabelle2[[#This Row],[Business as usual]])<Tabelle2[[#This Row],[q-Wert (Indifferenz)]], 0,IF(ABS(Tabelle2[[#This Row],[Smart City]]-Tabelle2[[#This Row],[Business as usual]])>Tabelle2[[#This Row],[p-Wert (Präferenz)]],1,IF(AND(ABS(Tabelle2[[#This Row],[Smart City]]-Tabelle2[[#This Row],[Business as usual]])<=Tabelle2[[#This Row],[p-Wert (Präferenz)]],ABS(Tabelle2[[#This Row],[Smart City]]-Tabelle2[[#This Row],[Business as usual]])>=Tabelle2[[#This Row],[q-Wert (Indifferenz)]]),((ABS(Tabelle2[[#This Row],[Smart City]]-Tabelle2[[#This Row],[Business as usual]])-Tabelle2[[#This Row],[q-Wert (Indifferenz)]])/(Tabelle2[[#This Row],[p-Wert (Präferenz)]]-Tabelle2[[#This Row],[q-Wert (Indifferenz)]])))))),IF(Tabelle2[[#This Row],[Smart City]]-Tabelle2[[#This Row],[Business as usual]]<0,-1*IF(ABS(Tabelle2[[#This Row],[Smart City]]-Tabelle2[[#This Row],[Business as usual]])<Tabelle2[[#This Row],[q-Wert (Indifferenz)]], 0,IF(ABS(Tabelle2[[#This Row],[Smart City]]-Tabelle2[[#This Row],[Business as usual]])>Tabelle2[[#This Row],[p-Wert (Präferenz)]],1,IF(AND(ABS(Tabelle2[[#This Row],[Smart City]]-Tabelle2[[#This Row],[Business as usual]])<=Tabelle2[[#This Row],[p-Wert (Präferenz)]],ABS(Tabelle2[[#This Row],[Smart City]]-Tabelle2[[#This Row],[Business as usual]])>=Tabelle2[[#This Row],[q-Wert (Indifferenz)]]),((ABS(Tabelle2[[#This Row],[Smart City]]-Tabelle2[[#This Row],[Business as usual]])-Tabelle2[[#This Row],[q-Wert (Indifferenz)]])/(Tabelle2[[#This Row],[p-Wert (Präferenz)]]-Tabelle2[[#This Row],[q-Wert (Indifferenz)]]))))),IF(ABS(Tabelle2[[#This Row],[Smart City]]-Tabelle2[[#This Row],[Business as usual]])<Tabelle2[[#This Row],[q-Wert (Indifferenz)]], 0,IF(ABS(Tabelle2[[#This Row],[Smart City]]-Tabelle2[[#This Row],[Business as usual]])>Tabelle2[[#This Row],[p-Wert (Präferenz)]],1,IF(AND(ABS(Tabelle2[[#This Row],[Smart City]]-Tabelle2[[#This Row],[Business as usual]])<=Tabelle2[[#This Row],[p-Wert (Präferenz)]],ABS(Tabelle2[[#This Row],[Smart City]]-Tabelle2[[#This Row],[Business as usual]])>=Tabelle2[[#This Row],[q-Wert (Indifferenz)]]),((ABS(Tabelle2[[#This Row],[Smart City]]-Tabelle2[[#This Row],[Business as usual]])-Tabelle2[[#This Row],[q-Wert (Indifferenz)]])/(Tabelle2[[#This Row],[p-Wert (Präferenz)]]-Tabelle2[[#This Row],[q-Wert (Indifferenz)]])))))))","v":0.26820908311910885},null,{"$f":"IF(Tabelle2[[#This Row],[min/max]]=\"min\",-1*IF(Tabelle2[[#This Row],[Healthy City]]-Tabelle2[[#This Row],[Smart City]]<0,-1*IF(ABS(Tabelle2[[#This Row],[Healthy City]]-Tabelle2[[#This Row],[Smart City]])<Tabelle2[[#This Row],[q-Wert (Indifferenz)]], 0,IF(ABS(Tabelle2[[#This Row],[Healthy City]]-Tabelle2[[#This Row],[Smart City]])>Tabelle2[[#This Row],[p-Wert (Präferenz)]],1,IF(AND(ABS(Tabelle2[[#This Row],[Healthy City]]-Tabelle2[[#This Row],[Smart City]])<=Tabelle2[[#This Row],[p-Wert (Präferenz)]],ABS(Tabelle2[[#This Row],[Healthy City]]-Tabelle2[[#This Row],[Smart City]])>=Tabelle2[[#This Row],[q-Wert (Indifferenz)]]),((ABS(Tabelle2[[#This Row],[Healthy City]]-Tabelle2[[#This Row],[Smart City]])-Tabelle2[[#This Row],[q-Wert (Indifferenz)]])/(Tabelle2[[#This Row],[p-Wert (Präferenz)]]-Tabelle2[[#This Row],[q-Wert (Indifferenz)]]))))),IF(ABS(Tabelle2[[#This Row],[Healthy City]]-Tabelle2[[#This Row],[Smart City]])<Tabelle2[[#This Row],[q-Wert (Indifferenz)]], 0,IF(ABS(Tabelle2[[#This Row],[Healthy City]]-Tabelle2[[#This Row],[Smart City]])>Tabelle2[[#This Row],[p-Wert (Präferenz)]],1,IF(AND(ABS(Tabelle2[[#This Row],[Healthy City]]-Tabelle2[[#This Row],[Smart City]])<=Tabelle2[[#This Row],[p-Wert (Präferenz)]],ABS(Tabelle2[[#This Row],[Healthy City]]-Tabelle2[[#This Row],[Smart City]])>=Tabelle2[[#This Row],[q-Wert (Indifferenz)]]),((ABS(Tabelle2[[#This Row],[Healthy City]]-Tabelle2[[#This Row],[Smart City]])-Tabelle2[[#This Row],[q-Wert (Indifferenz)]])/(Tabelle2[[#This Row],[p-Wert (Präferenz)]]-Tabelle2[[#This Row],[q-Wert (Indifferenz)]])))))),IF(Tabelle2[[#This Row],[Healthy City]]-Tabelle2[[#This Row],[Smart City]]<0,-1*IF(ABS(Tabelle2[[#This Row],[Healthy City]]-Tabelle2[[#This Row],[Smart City]])<Tabelle2[[#This Row],[q-Wert (Indifferenz)]], 0,IF(ABS(Tabelle2[[#This Row],[Healthy City]]-Tabelle2[[#This Row],[Smart City]])>Tabelle2[[#This Row],[p-Wert (Präferenz)]],1,IF(AND(ABS(Tabelle2[[#This Row],[Healthy City]]-Tabelle2[[#This Row],[Smart City]])<=Tabelle2[[#This Row],[p-Wert (Präferenz)]],ABS(Tabelle2[[#This Row],[Healthy City]]-Tabelle2[[#This Row],[Smart City]])>=Tabelle2[[#This Row],[q-Wert (Indifferenz)]]),((ABS(Tabelle2[[#This Row],[Healthy City]]-Tabelle2[[#This Row],[Smart City]])-Tabelle2[[#This Row],[q-Wert (Indifferenz)]])/(Tabelle2[[#This Row],[p-Wert (Präferenz)]]-Tabelle2[[#This Row],[q-Wert (Indifferenz)]]))))),IF(ABS(Tabelle2[[#This Row],[Healthy City]]-Tabelle2[[#This Row],[Smart City]])<Tabelle2[[#This Row],[q-Wert (Indifferenz)]], 0,IF(ABS(Tabelle2[[#This Row],[Healthy City]]-Tabelle2[[#This Row],[Smart City]])>Tabelle2[[#This Row],[p-Wert (Präferenz)]],1,IF(AND(ABS(Tabelle2[[#This Row],[Healthy City]]-Tabelle2[[#This Row],[Smart City]])<=Tabelle2[[#This Row],[p-Wert (Präferenz)]],ABS(Tabelle2[[#This Row],[Healthy City]]-Tabelle2[[#This Row],[Smart City]])>=Tabelle2[[#This Row],[q-Wert (Indifferenz)]]),((ABS(Tabelle2[[#This Row],[Healthy City]]-Tabelle2[[#This Row],[Smart City]])-Tabelle2[[#This Row],[q-Wert (Indifferenz)]])/(Tabelle2[[#This Row],[p-Wert (Präferenz)]]-Tabelle2[[#This Row],[q-Wert (Indifferenz)]])))))))","v":0.26820908311910885},{"$f":"IF(Tabelle2[[#This Row],[min/max]]=\"min\",-1*IF(Tabelle2[[#This Row],[Healthy City]]-Tabelle2[[#This Row],[Urban Sprawl]]<0,-1*IF(ABS(Tabelle2[[#This Row],[Healthy City]]-Tabelle2[[#This Row],[Urban Sprawl]])<Tabelle2[[#This Row],[q-Wert (Indifferenz)]], 0,IF(ABS(Tabelle2[[#This Row],[Healthy City]]-Tabelle2[[#This Row],[Urban Sprawl]])>Tabelle2[[#This Row],[p-Wert (Präferenz)]],1,IF(AND(ABS(Tabelle2[[#This Row],[Healthy City]]-Tabelle2[[#This Row],[Urban Sprawl]])<=Tabelle2[[#This Row],[p-Wert (Präferenz)]],ABS(Tabelle2[[#This Row],[Healthy City]]-Tabelle2[[#This Row],[Urban Sprawl]])>=Tabelle2[[#This Row],[q-Wert (Indifferenz)]]),((ABS(Tabelle2[[#This Row],[Healthy City]]-Tabelle2[[#This Row],[Urban Sprawl]])-Tabelle2[[#This Row],[q-Wert (Indifferenz)]])/(Tabelle2[[#This Row],[p-Wert (Präferenz)]]-Tabelle2[[#This Row],[q-Wert (Indifferenz)]]))))),IF(ABS(Tabelle2[[#This Row],[Healthy City]]-Tabelle2[[#This Row],[Urban Sprawl]])<Tabelle2[[#This Row],[q-Wert (Indifferenz)]], 0,IF(ABS(Tabelle2[[#This Row],[Healthy City]]-Tabelle2[[#This Row],[Urban Sprawl]])>Tabelle2[[#This Row],[p-Wert (Präferenz)]],1,IF(AND(ABS(Tabelle2[[#This Row],[Healthy City]]-Tabelle2[[#This Row],[Urban Sprawl]])<=Tabelle2[[#This Row],[p-Wert (Präferenz)]],ABS(Tabelle2[[#This Row],[Healthy City]]-Tabelle2[[#This Row],[Urban Sprawl]])>=Tabelle2[[#This Row],[q-Wert (Indifferenz)]]),((ABS(Tabelle2[[#This Row],[Healthy City]]-Tabelle2[[#This Row],[Urban Sprawl]])-Tabelle2[[#This Row],[q-Wert (Indifferenz)]])/(Tabelle2[[#This Row],[p-Wert (Präferenz)]]-Tabelle2[[#This Row],[q-Wert (Indifferenz)]])))))),IF(Tabelle2[[#This Row],[Healthy City]]-Tabelle2[[#This Row],[Urban Sprawl]]<0,-1*IF(ABS(Tabelle2[[#This Row],[Healthy City]]-Tabelle2[[#This Row],[Urban Sprawl]])<Tabelle2[[#This Row],[q-Wert (Indifferenz)]], 0,IF(ABS(Tabelle2[[#This Row],[Healthy City]]-Tabelle2[[#This Row],[Urban Sprawl]])>Tabelle2[[#This Row],[p-Wert (Präferenz)]],1,IF(AND(ABS(Tabelle2[[#This Row],[Healthy City]]-Tabelle2[[#This Row],[Urban Sprawl]])<=Tabelle2[[#This Row],[p-Wert (Präferenz)]],ABS(Tabelle2[[#This Row],[Healthy City]]-Tabelle2[[#This Row],[Urban Sprawl]])>=Tabelle2[[#This Row],[q-Wert (Indifferenz)]]),((ABS(Tabelle2[[#This Row],[Healthy City]]-Tabelle2[[#This Row],[Urban Sprawl]])-Tabelle2[[#This Row],[q-Wert (Indifferenz)]])/(Tabelle2[[#This Row],[p-Wert (Präferenz)]]-Tabelle2[[#This Row],[q-Wert (Indifferenz)]]))))),IF(ABS(Tabelle2[[#This Row],[Healthy City]]-Tabelle2[[#This Row],[Urban Sprawl]])<Tabelle2[[#This Row],[q-Wert (Indifferenz)]], 0,IF(ABS(Tabelle2[[#This Row],[Healthy City]]-Tabelle2[[#This Row],[Urban Sprawl]])>Tabelle2[[#This Row],[p-Wert (Präferenz)]],1,IF(AND(ABS(Tabelle2[[#This Row],[Healthy City]]-Tabelle2[[#This Row],[Urban Sprawl]])<=Tabelle2[[#This Row],[p-Wert (Präferenz)]],ABS(Tabelle2[[#This Row],[Healthy City]]-Tabelle2[[#This Row],[Urban Sprawl]])>=Tabelle2[[#This Row],[q-Wert (Indifferenz)]]),((ABS(Tabelle2[[#This Row],[Healthy City]]-Tabelle2[[#This Row],[Urban Sprawl]])-Tabelle2[[#This Row],[q-Wert (Indifferenz)]])/(Tabelle2[[#This Row],[p-Wert (Präferenz)]]-Tabelle2[[#This Row],[q-Wert (Indifferenz)]])))))))","v":1},{"$f":"IF(Tabelle2[[#This Row],[min/max]]=\"min\",-1*IF(Tabelle2[[#This Row],[Healthy City]]-Tabelle2[[#This Row],[Business as usual]]<0,-1*IF(ABS(Tabelle2[[#This Row],[Healthy City]]-Tabelle2[[#This Row],[Business as usual]])<Tabelle2[[#This Row],[q-Wert (Indifferenz)]], 0,IF(ABS(Tabelle2[[#This Row],[Healthy City]]-Tabelle2[[#This Row],[Business as usual]])>Tabelle2[[#This Row],[p-Wert (Präferenz)]],1,IF(AND(ABS(Tabelle2[[#This Row],[Healthy City]]-Tabelle2[[#This Row],[Business as usual]])<=Tabelle2[[#This Row],[p-Wert (Präferenz)]],ABS(Tabelle2[[#This Row],[Healthy City]]-Tabelle2[[#This Row],[Business as usual]])>=Tabelle2[[#This Row],[q-Wert (Indifferenz)]]),((ABS(Tabelle2[[#This Row],[Healthy City]]-Tabelle2[[#This Row],[Business as usual]])-Tabelle2[[#This Row],[q-Wert (Indifferenz)]])/(Tabelle2[[#This Row],[p-Wert (Präferenz)]]-Tabelle2[[#This Row],[q-Wert (Indifferenz)]]))))),IF(ABS(Tabelle2[[#This Row],[Healthy City]]-Tabelle2[[#This Row],[Business as usual]])<Tabelle2[[#This Row],[q-Wert (Indifferenz)]], 0,IF(ABS(Tabelle2[[#This Row],[Healthy City]]-Tabelle2[[#This Row],[Business as usual]])>Tabelle2[[#This Row],[p-Wert (Präferenz)]],1,IF(AND(ABS(Tabelle2[[#This Row],[Healthy City]]-Tabelle2[[#This Row],[Business as usual]])<=Tabelle2[[#This Row],[p-Wert (Präferenz)]],ABS(Tabelle2[[#This Row],[Healthy City]]-Tabelle2[[#This Row],[Business as usual]])>=Tabelle2[[#This Row],[q-Wert (Indifferenz)]]),((ABS(Tabelle2[[#This Row],[Healthy City]]-Tabelle2[[#This Row],[Business as usual]])-Tabelle2[[#This Row],[q-Wert (Indifferenz)]])/(Tabelle2[[#This Row],[p-Wert (Präferenz)]]-Tabelle2[[#This Row],[q-Wert (Indifferenz)]])))))),IF(Tabelle2[[#This Row],[Healthy City]]-Tabelle2[[#This Row],[Business as usual]]<0,-1*IF(ABS(Tabelle2[[#This Row],[Healthy City]]-Tabelle2[[#This Row],[Business as usual]])<Tabelle2[[#This Row],[q-Wert (Indifferenz)]], 0,IF(ABS(Tabelle2[[#This Row],[Healthy City]]-Tabelle2[[#This Row],[Business as usual]])>Tabelle2[[#This Row],[p-Wert (Präferenz)]],1,IF(AND(ABS(Tabelle2[[#This Row],[Healthy City]]-Tabelle2[[#This Row],[Business as usual]])<=Tabelle2[[#This Row],[p-Wert (Präferenz)]],ABS(Tabelle2[[#This Row],[Healthy City]]-Tabelle2[[#This Row],[Business as usual]])>=Tabelle2[[#This Row],[q-Wert (Indifferenz)]]),((ABS(Tabelle2[[#This Row],[Healthy City]]-Tabelle2[[#This Row],[Business as usual]])-Tabelle2[[#This Row],[q-Wert (Indifferenz)]])/(Tabelle2[[#This Row],[p-Wert (Präferenz)]]-Tabelle2[[#This Row],[q-Wert (Indifferenz)]]))))),IF(ABS(Tabelle2[[#This Row],[Healthy City]]-Tabelle2[[#This Row],[Business as usual]])<Tabelle2[[#This Row],[q-Wert (Indifferenz)]], 0,IF(ABS(Tabelle2[[#This Row],[Healthy City]]-Tabelle2[[#This Row],[Business as usual]])>Tabelle2[[#This Row],[p-Wert (Präferenz)]],1,IF(AND(ABS(Tabelle2[[#This Row],[Healthy City]]-Tabelle2[[#This Row],[Business as usual]])<=Tabelle2[[#This Row],[p-Wert (Präferenz)]],ABS(Tabelle2[[#This Row],[Healthy City]]-Tabelle2[[#This Row],[Business as usual]])>=Tabelle2[[#This Row],[q-Wert (Indifferenz)]]),((ABS(Tabelle2[[#This Row],[Healthy City]]-Tabelle2[[#This Row],[Business as usual]])-Tabelle2[[#This Row],[q-Wert (Indifferenz)]])/(Tabelle2[[#This Row],[p-Wert (Präferenz)]]-Tabelle2[[#This Row],[q-Wert (Indifferenz)]])))))))","v":1},null,{"$f":"IF(Tabelle2[[#This Row],[min/max]]=\"min\",-1*IF(Tabelle2[[#This Row],[Urban Sprawl]]-Tabelle2[[#This Row],[Smart City]]<0,-1*IF(ABS(Tabelle2[[#This Row],[Urban Sprawl]]-Tabelle2[[#This Row],[Smart City]])<Tabelle2[[#This Row],[q-Wert (Indifferenz)]], 0,IF(ABS(Tabelle2[[#This Row],[Urban Sprawl]]-Tabelle2[[#This Row],[Smart City]])>Tabelle2[[#This Row],[p-Wert (Präferenz)]],1,IF(AND(ABS(Tabelle2[[#This Row],[Urban Sprawl]]-Tabelle2[[#This Row],[Smart City]])<=Tabelle2[[#This Row],[p-Wert (Präferenz)]],ABS(Tabelle2[[#This Row],[Urban Sprawl]]-Tabelle2[[#This Row],[Smart City]])>=Tabelle2[[#This Row],[q-Wert (Indifferenz)]]),((ABS(Tabelle2[[#This Row],[Urban Sprawl]]-Tabelle2[[#This Row],[Smart City]])-Tabelle2[[#This Row],[q-Wert (Indifferenz)]])/(Tabelle2[[#This Row],[p-Wert (Präferenz)]]-Tabelle2[[#This Row],[q-Wert (Indifferenz)]]))))),IF(ABS(Tabelle2[[#This Row],[Urban Sprawl]]-Tabelle2[[#This Row],[Smart City]])<Tabelle2[[#This Row],[q-Wert (Indifferenz)]], 0,IF(ABS(Tabelle2[[#This Row],[Urban Sprawl]]-Tabelle2[[#This Row],[Smart City]])>Tabelle2[[#This Row],[p-Wert (Präferenz)]],1,IF(AND(ABS(Tabelle2[[#This Row],[Urban Sprawl]]-Tabelle2[[#This Row],[Smart City]])<=Tabelle2[[#This Row],[p-Wert (Präferenz)]],ABS(Tabelle2[[#This Row],[Urban Sprawl]]-Tabelle2[[#This Row],[Smart City]])>=Tabelle2[[#This Row],[q-Wert (Indifferenz)]]),((ABS(Tabelle2[[#This Row],[Urban Sprawl]]-Tabelle2[[#This Row],[Smart City]])-Tabelle2[[#This Row],[q-Wert (Indifferenz)]])/(Tabelle2[[#This Row],[p-Wert (Präferenz)]]-Tabelle2[[#This Row],[q-Wert (Indifferenz)]])))))),IF(Tabelle2[[#This Row],[Urban Sprawl]]-Tabelle2[[#This Row],[Smart City]]<0,-1*IF(ABS(Tabelle2[[#This Row],[Urban Sprawl]]-Tabelle2[[#This Row],[Smart City]])<Tabelle2[[#This Row],[q-Wert (Indifferenz)]], 0,IF(ABS(Tabelle2[[#This Row],[Urban Sprawl]]-Tabelle2[[#This Row],[Smart City]])>Tabelle2[[#This Row],[p-Wert (Präferenz)]],1,IF(AND(ABS(Tabelle2[[#This Row],[Urban Sprawl]]-Tabelle2[[#This Row],[Smart City]])<=Tabelle2[[#This Row],[p-Wert (Präferenz)]],ABS(Tabelle2[[#This Row],[Urban Sprawl]]-Tabelle2[[#This Row],[Smart City]])>=Tabelle2[[#This Row],[q-Wert (Indifferenz)]]),((ABS(Tabelle2[[#This Row],[Urban Sprawl]]-Tabelle2[[#This Row],[Smart City]])-Tabelle2[[#This Row],[q-Wert (Indifferenz)]])/(Tabelle2[[#This Row],[p-Wert (Präferenz)]]-Tabelle2[[#This Row],[q-Wert (Indifferenz)]]))))),IF(ABS(Tabelle2[[#This Row],[Urban Sprawl]]-Tabelle2[[#This Row],[Smart City]])<Tabelle2[[#This Row],[q-Wert (Indifferenz)]], 0,IF(ABS(Tabelle2[[#This Row],[Urban Sprawl]]-Tabelle2[[#This Row],[Smart City]])>Tabelle2[[#This Row],[p-Wert (Präferenz)]],1,IF(AND(ABS(Tabelle2[[#This Row],[Urban Sprawl]]-Tabelle2[[#This Row],[Smart City]])<=Tabelle2[[#This Row],[p-Wert (Präferenz)]],ABS(Tabelle2[[#This Row],[Urban Sprawl]]-Tabelle2[[#This Row],[Smart City]])>=Tabelle2[[#This Row],[q-Wert (Indifferenz)]]),((ABS(Tabelle2[[#This Row],[Urban Sprawl]]-Tabelle2[[#This Row],[Smart City]])-Tabelle2[[#This Row],[q-Wert (Indifferenz)]])/(Tabelle2[[#This Row],[p-Wert (Präferenz)]]-Tabelle2[[#This Row],[q-Wert (Indifferenz)]])))))))","v":-0.26820908311910885},{"$f":"IF(Tabelle2[[#This Row],[min/max]]=\"min\",-1*IF(Tabelle2[[#This Row],[Urban Sprawl]]-Tabelle2[[#This Row],[Healthy City]]<0,-1*IF(ABS(Tabelle2[[#This Row],[Urban Sprawl]]-Tabelle2[[#This Row],[Healthy City]])<Tabelle2[[#This Row],[q-Wert (Indifferenz)]], 0,IF(ABS(Tabelle2[[#This Row],[Urban Sprawl]]-Tabelle2[[#This Row],[Healthy City]])>Tabelle2[[#This Row],[p-Wert (Präferenz)]],1,IF(AND(ABS(Tabelle2[[#This Row],[Urban Sprawl]]-Tabelle2[[#This Row],[Healthy City]])<=Tabelle2[[#This Row],[p-Wert (Präferenz)]],ABS(Tabelle2[[#This Row],[Urban Sprawl]]-Tabelle2[[#This Row],[Healthy City]])>=Tabelle2[[#This Row],[q-Wert (Indifferenz)]]),((ABS(Tabelle2[[#This Row],[Urban Sprawl]]-Tabelle2[[#This Row],[Healthy City]])-Tabelle2[[#This Row],[q-Wert (Indifferenz)]])/(Tabelle2[[#This Row],[p-Wert (Präferenz)]]-Tabelle2[[#This Row],[q-Wert (Indifferenz)]]))))),IF(ABS(Tabelle2[[#This Row],[Urban Sprawl]]-Tabelle2[[#This Row],[Healthy City]])<Tabelle2[[#This Row],[q-Wert (Indifferenz)]], 0,IF(ABS(Tabelle2[[#This Row],[Urban Sprawl]]-Tabelle2[[#This Row],[Healthy City]])>Tabelle2[[#This Row],[p-Wert (Präferenz)]],1,IF(AND(ABS(Tabelle2[[#This Row],[Urban Sprawl]]-Tabelle2[[#This Row],[Healthy City]])<=Tabelle2[[#This Row],[p-Wert (Präferenz)]],ABS(Tabelle2[[#This Row],[Urban Sprawl]]-Tabelle2[[#This Row],[Healthy City]])>=Tabelle2[[#This Row],[q-Wert (Indifferenz)]]),((ABS(Tabelle2[[#This Row],[Urban Sprawl]]-Tabelle2[[#This Row],[Healthy City]])-Tabelle2[[#This Row],[q-Wert (Indifferenz)]])/(Tabelle2[[#This Row],[p-Wert (Präferenz)]]-Tabelle2[[#This Row],[q-Wert (Indifferenz)]])))))),IF(Tabelle2[[#This Row],[Urban Sprawl]]-Tabelle2[[#This Row],[Healthy City]]<0,-1*IF(ABS(Tabelle2[[#This Row],[Urban Sprawl]]-Tabelle2[[#This Row],[Healthy City]])<Tabelle2[[#This Row],[q-Wert (Indifferenz)]], 0,IF(ABS(Tabelle2[[#This Row],[Urban Sprawl]]-Tabelle2[[#This Row],[Healthy City]])>Tabelle2[[#This Row],[p-Wert (Präferenz)]],1,IF(AND(ABS(Tabelle2[[#This Row],[Urban Sprawl]]-Tabelle2[[#This Row],[Healthy City]])<=Tabelle2[[#This Row],[p-Wert (Präferenz)]],ABS(Tabelle2[[#This Row],[Urban Sprawl]]-Tabelle2[[#This Row],[Healthy City]])>=Tabelle2[[#This Row],[q-Wert (Indifferenz)]]),((ABS(Tabelle2[[#This Row],[Urban Sprawl]]-Tabelle2[[#This Row],[Healthy City]])-Tabelle2[[#This Row],[q-Wert (Indifferenz)]])/(Tabelle2[[#This Row],[p-Wert (Präferenz)]]-Tabelle2[[#This Row],[q-Wert (Indifferenz)]]))))),IF(ABS(Tabelle2[[#This Row],[Urban Sprawl]]-Tabelle2[[#This Row],[Healthy City]])<Tabelle2[[#This Row],[q-Wert (Indifferenz)]], 0,IF(ABS(Tabelle2[[#This Row],[Urban Sprawl]]-Tabelle2[[#This Row],[Healthy City]])>Tabelle2[[#This Row],[p-Wert (Präferenz)]],1,IF(AND(ABS(Tabelle2[[#This Row],[Urban Sprawl]]-Tabelle2[[#This Row],[Healthy City]])<=Tabelle2[[#This Row],[p-Wert (Präferenz)]],ABS(Tabelle2[[#This Row],[Urban Sprawl]]-Tabelle2[[#This Row],[Healthy City]])>=Tabelle2[[#This Row],[q-Wert (Indifferenz)]]),((ABS(Tabelle2[[#This Row],[Urban Sprawl]]-Tabelle2[[#This Row],[Healthy City]])-Tabelle2[[#This Row],[q-Wert (Indifferenz)]])/(Tabelle2[[#This Row],[p-Wert (Präferenz)]]-Tabelle2[[#This Row],[q-Wert (Indifferenz)]])))))))","v":-1},{"$f":"IF(Tabelle2[[#This Row],[min/max]]=\"min\",-1*IF(Tabelle2[[#This Row],[Urban Sprawl]]-Tabelle2[[#This Row],[Business as usual]]<0,-1*IF(ABS(Tabelle2[[#This Row],[Urban Sprawl]]-Tabelle2[[#This Row],[Business as usual]])<Tabelle2[[#This Row],[q-Wert (Indifferenz)]], 0,IF(ABS(Tabelle2[[#This Row],[Urban Sprawl]]-Tabelle2[[#This Row],[Business as usual]])>Tabelle2[[#This Row],[p-Wert (Präferenz)]],1,IF(AND(ABS(Tabelle2[[#This Row],[Urban Sprawl]]-Tabelle2[[#This Row],[Business as usual]])<=Tabelle2[[#This Row],[p-Wert (Präferenz)]],ABS(Tabelle2[[#This Row],[Urban Sprawl]]-Tabelle2[[#This Row],[Business as usual]])>=Tabelle2[[#This Row],[q-Wert (Indifferenz)]]),((ABS(Tabelle2[[#This Row],[Urban Sprawl]]-Tabelle2[[#This Row],[Business as usual]])-Tabelle2[[#This Row],[q-Wert (Indifferenz)]])/(Tabelle2[[#This Row],[p-Wert (Präferenz)]]-Tabelle2[[#This Row],[q-Wert (Indifferenz)]]))))),IF(ABS(Tabelle2[[#This Row],[Urban Sprawl]]-Tabelle2[[#This Row],[Business as usual]])<Tabelle2[[#This Row],[q-Wert (Indifferenz)]], 0,IF(ABS(Tabelle2[[#This Row],[Urban Sprawl]]-Tabelle2[[#This Row],[Business as usual]])>Tabelle2[[#This Row],[p-Wert (Präferenz)]],1,IF(AND(ABS(Tabelle2[[#This Row],[Urban Sprawl]]-Tabelle2[[#This Row],[Business as usual]])<=Tabelle2[[#This Row],[p-Wert (Präferenz)]],ABS(Tabelle2[[#This Row],[Urban Sprawl]]-Tabelle2[[#This Row],[Business as usual]])>=Tabelle2[[#This Row],[q-Wert (Indifferenz)]]),((ABS(Tabelle2[[#This Row],[Urban Sprawl]]-Tabelle2[[#This Row],[Business as usual]])-Tabelle2[[#This Row],[q-Wert (Indifferenz)]])/(Tabelle2[[#This Row],[p-Wert (Präferenz)]]-Tabelle2[[#This Row],[q-Wert (Indifferenz)]])))))),IF(Tabelle2[[#This Row],[Urban Sprawl]]-Tabelle2[[#This Row],[Business as usual]]<0,-1*IF(ABS(Tabelle2[[#This Row],[Urban Sprawl]]-Tabelle2[[#This Row],[Business as usual]])<Tabelle2[[#This Row],[q-Wert (Indifferenz)]], 0,IF(ABS(Tabelle2[[#This Row],[Urban Sprawl]]-Tabelle2[[#This Row],[Business as usual]])>Tabelle2[[#This Row],[p-Wert (Präferenz)]],1,IF(AND(ABS(Tabelle2[[#This Row],[Urban Sprawl]]-Tabelle2[[#This Row],[Business as usual]])<=Tabelle2[[#This Row],[p-Wert (Präferenz)]],ABS(Tabelle2[[#This Row],[Urban Sprawl]]-Tabelle2[[#This Row],[Business as usual]])>=Tabelle2[[#This Row],[q-Wert (Indifferenz)]]),((ABS(Tabelle2[[#This Row],[Urban Sprawl]]-Tabelle2[[#This Row],[Business as usual]])-Tabelle2[[#This Row],[q-Wert (Indifferenz)]])/(Tabelle2[[#This Row],[p-Wert (Präferenz)]]-Tabelle2[[#This Row],[q-Wert (Indifferenz)]]))))),IF(ABS(Tabelle2[[#This Row],[Urban Sprawl]]-Tabelle2[[#This Row],[Business as usual]])<Tabelle2[[#This Row],[q-Wert (Indifferenz)]], 0,IF(ABS(Tabelle2[[#This Row],[Urban Sprawl]]-Tabelle2[[#This Row],[Business as usual]])>Tabelle2[[#This Row],[p-Wert (Präferenz)]],1,IF(AND(ABS(Tabelle2[[#This Row],[Urban Sprawl]]-Tabelle2[[#This Row],[Business as usual]])<=Tabelle2[[#This Row],[p-Wert (Präferenz)]],ABS(Tabelle2[[#This Row],[Urban Sprawl]]-Tabelle2[[#This Row],[Business as usual]])>=Tabelle2[[#This Row],[q-Wert (Indifferenz)]]),((ABS(Tabelle2[[#This Row],[Urban Sprawl]]-Tabelle2[[#This Row],[Business as usual]])-Tabelle2[[#This Row],[q-Wert (Indifferenz)]])/(Tabelle2[[#This Row],[p-Wert (Präferenz)]]-Tabelle2[[#This Row],[q-Wert (Indifferenz)]])))))))","v":0},null,{"$f":"IF(Tabelle2[[#This Row],[min/max]]=\"min\",-1*IF(Tabelle2[[#This Row],[Business as usual]]-Tabelle2[[#This Row],[Smart City]]<0,-1*IF(ABS(Tabelle2[[#This Row],[Business as usual]]-Tabelle2[[#This Row],[Smart City]])<Tabelle2[[#This Row],[q-Wert (Indifferenz)]], 0,IF(ABS(Tabelle2[[#This Row],[Business as usual]]-Tabelle2[[#This Row],[Smart City]])>Tabelle2[[#This Row],[p-Wert (Präferenz)]],1,IF(AND(ABS(Tabelle2[[#This Row],[Business as usual]]-Tabelle2[[#This Row],[Smart City]])<=Tabelle2[[#This Row],[p-Wert (Präferenz)]],ABS(Tabelle2[[#This Row],[Business as usual]]-Tabelle2[[#This Row],[Smart City]])>=Tabelle2[[#This Row],[q-Wert (Indifferenz)]]),((ABS(Tabelle2[[#This Row],[Business as usual]]-Tabelle2[[#This Row],[Smart City]])-Tabelle2[[#This Row],[q-Wert (Indifferenz)]])/(Tabelle2[[#This Row],[p-Wert (Präferenz)]]-Tabelle2[[#This Row],[q-Wert (Indifferenz)]]))))),IF(ABS(Tabelle2[[#This Row],[Business as usual]]-Tabelle2[[#This Row],[Smart City]])<Tabelle2[[#This Row],[q-Wert (Indifferenz)]], 0,IF(ABS(Tabelle2[[#This Row],[Business as usual]]-Tabelle2[[#This Row],[Smart City]])>Tabelle2[[#This Row],[p-Wert (Präferenz)]],1,IF(AND(ABS(Tabelle2[[#This Row],[Business as usual]]-Tabelle2[[#This Row],[Smart City]])<=Tabelle2[[#This Row],[p-Wert (Präferenz)]],ABS(Tabelle2[[#This Row],[Business as usual]]-Tabelle2[[#This Row],[Smart City]])>=Tabelle2[[#This Row],[q-Wert (Indifferenz)]]),((ABS(Tabelle2[[#This Row],[Business as usual]]-Tabelle2[[#This Row],[Smart City]])-Tabelle2[[#This Row],[q-Wert (Indifferenz)]])/(Tabelle2[[#This Row],[p-Wert (Präferenz)]]-Tabelle2[[#This Row],[q-Wert (Indifferenz)]])))))),IF(Tabelle2[[#This Row],[Business as usual]]-Tabelle2[[#This Row],[Smart City]]<0,-1*IF(ABS(Tabelle2[[#This Row],[Business as usual]]-Tabelle2[[#This Row],[Smart City]])<Tabelle2[[#This Row],[q-Wert (Indifferenz)]], 0,IF(ABS(Tabelle2[[#This Row],[Business as usual]]-Tabelle2[[#This Row],[Smart City]])>Tabelle2[[#This Row],[p-Wert (Präferenz)]],1,IF(AND(ABS(Tabelle2[[#This Row],[Business as usual]]-Tabelle2[[#This Row],[Smart City]])<=Tabelle2[[#This Row],[p-Wert (Präferenz)]],ABS(Tabelle2[[#This Row],[Business as usual]]-Tabelle2[[#This Row],[Smart City]])>=Tabelle2[[#This Row],[q-Wert (Indifferenz)]]),((ABS(Tabelle2[[#This Row],[Business as usual]]-Tabelle2[[#This Row],[Smart City]])-Tabelle2[[#This Row],[q-Wert (Indifferenz)]])/(Tabelle2[[#This Row],[p-Wert (Präferenz)]]-Tabelle2[[#This Row],[q-Wert (Indifferenz)]]))))),IF(ABS(Tabelle2[[#This Row],[Business as usual]]-Tabelle2[[#This Row],[Smart City]])<Tabelle2[[#This Row],[q-Wert (Indifferenz)]], 0,IF(ABS(Tabelle2[[#This Row],[Business as usual]]-Tabelle2[[#This Row],[Smart City]])>Tabelle2[[#This Row],[p-Wert (Präferenz)]],1,IF(AND(ABS(Tabelle2[[#This Row],[Business as usual]]-Tabelle2[[#This Row],[Smart City]])<=Tabelle2[[#This Row],[p-Wert (Präferenz)]],ABS(Tabelle2[[#This Row],[Business as usual]]-Tabelle2[[#This Row],[Smart City]])>=Tabelle2[[#This Row],[q-Wert (Indifferenz)]]),((ABS(Tabelle2[[#This Row],[Business as usual]]-Tabelle2[[#This Row],[Smart City]])-Tabelle2[[#This Row],[q-Wert (Indifferenz)]])/(Tabelle2[[#This Row],[p-Wert (Präferenz)]]-Tabelle2[[#This Row],[q-Wert (Indifferenz)]])))))))","v":-0.26820908311910885},{"$f":"IF(Tabelle2[[#This Row],[min/max]]=\"min\",-1*IF(Tabelle2[[#This Row],[Business as usual]]-Tabelle2[[#This Row],[Healthy City]]<0,-1*IF(ABS(Tabelle2[[#This Row],[Business as usual]]-Tabelle2[[#This Row],[Healthy City]])<Tabelle2[[#This Row],[q-Wert (Indifferenz)]], 0,IF(ABS(Tabelle2[[#This Row],[Business as usual]]-Tabelle2[[#This Row],[Healthy City]])>Tabelle2[[#This Row],[p-Wert (Präferenz)]],1,IF(AND(ABS(Tabelle2[[#This Row],[Business as usual]]-Tabelle2[[#This Row],[Healthy City]])<=Tabelle2[[#This Row],[p-Wert (Präferenz)]],ABS(Tabelle2[[#This Row],[Business as usual]]-Tabelle2[[#This Row],[Healthy City]])>=Tabelle2[[#This Row],[q-Wert (Indifferenz)]]),((ABS(Tabelle2[[#This Row],[Business as usual]]-Tabelle2[[#This Row],[Healthy City]])-Tabelle2[[#This Row],[q-Wert (Indifferenz)]])/(Tabelle2[[#This Row],[p-Wert (Präferenz)]]-Tabelle2[[#This Row],[q-Wert (Indifferenz)]]))))),IF(ABS(Tabelle2[[#This Row],[Business as usual]]-Tabelle2[[#This Row],[Healthy City]])<Tabelle2[[#This Row],[q-Wert (Indifferenz)]], 0,IF(ABS(Tabelle2[[#This Row],[Business as usual]]-Tabelle2[[#This Row],[Healthy City]])>Tabelle2[[#This Row],[p-Wert (Präferenz)]],1,IF(AND(ABS(Tabelle2[[#This Row],[Business as usual]]-Tabelle2[[#This Row],[Healthy City]])<=Tabelle2[[#This Row],[p-Wert (Präferenz)]],ABS(Tabelle2[[#This Row],[Business as usual]]-Tabelle2[[#This Row],[Healthy City]])>=Tabelle2[[#This Row],[q-Wert (Indifferenz)]]),((ABS(Tabelle2[[#This Row],[Business as usual]]-Tabelle2[[#This Row],[Healthy City]])-Tabelle2[[#This Row],[q-Wert (Indifferenz)]])/(Tabelle2[[#This Row],[p-Wert (Präferenz)]]-Tabelle2[[#This Row],[q-Wert (Indifferenz)]])))))),IF(Tabelle2[[#This Row],[Business as usual]]-Tabelle2[[#This Row],[Healthy City]]<0,-1*IF(ABS(Tabelle2[[#This Row],[Business as usual]]-Tabelle2[[#This Row],[Healthy City]])<Tabelle2[[#This Row],[q-Wert (Indifferenz)]], 0,IF(ABS(Tabelle2[[#This Row],[Business as usual]]-Tabelle2[[#This Row],[Healthy City]])>Tabelle2[[#This Row],[p-Wert (Präferenz)]],1,IF(AND(ABS(Tabelle2[[#This Row],[Business as usual]]-Tabelle2[[#This Row],[Healthy City]])<=Tabelle2[[#This Row],[p-Wert (Präferenz)]],ABS(Tabelle2[[#This Row],[Business as usual]]-Tabelle2[[#This Row],[Healthy City]])>=Tabelle2[[#This Row],[q-Wert (Indifferenz)]]),((ABS(Tabelle2[[#This Row],[Business as usual]]-Tabelle2[[#This Row],[Healthy City]])-Tabelle2[[#This Row],[q-Wert (Indifferenz)]])/(Tabelle2[[#This Row],[p-Wert (Präferenz)]]-Tabelle2[[#This Row],[q-Wert (Indifferenz)]]))))),IF(ABS(Tabelle2[[#This Row],[Business as usual]]-Tabelle2[[#This Row],[Healthy City]])<Tabelle2[[#This Row],[q-Wert (Indifferenz)]], 0,IF(ABS(Tabelle2[[#This Row],[Business as usual]]-Tabelle2[[#This Row],[Healthy City]])>Tabelle2[[#This Row],[p-Wert (Präferenz)]],1,IF(AND(ABS(Tabelle2[[#This Row],[Business as usual]]-Tabelle2[[#This Row],[Healthy City]])<=Tabelle2[[#This Row],[p-Wert (Präferenz)]],ABS(Tabelle2[[#This Row],[Business as usual]]-Tabelle2[[#This Row],[Healthy City]])>=Tabelle2[[#This Row],[q-Wert (Indifferenz)]]),((ABS(Tabelle2[[#This Row],[Business as usual]]-Tabelle2[[#This Row],[Healthy City]])-Tabelle2[[#This Row],[q-Wert (Indifferenz)]])/(Tabelle2[[#This Row],[p-Wert (Präferenz)]]-Tabelle2[[#This Row],[q-Wert (Indifferenz)]])))))))","v":-1},{"$f":"IF(Tabelle2[[#This Row],[min/max]]=\"min\",-1*IF(Tabelle2[[#This Row],[Business as usual]]-Tabelle2[[#This Row],[Urban Sprawl]]<0,-1*IF(ABS(Tabelle2[[#This Row],[Business as usual]]-Tabelle2[[#This Row],[Urban Sprawl]])<Tabelle2[[#This Row],[q-Wert (Indifferenz)]], 0,IF(ABS(Tabelle2[[#This Row],[Business as usual]]-Tabelle2[[#This Row],[Urban Sprawl]])>Tabelle2[[#This Row],[p-Wert (Präferenz)]],1,IF(AND(ABS(Tabelle2[[#This Row],[Business as usual]]-Tabelle2[[#This Row],[Urban Sprawl]])<=Tabelle2[[#This Row],[p-Wert (Präferenz)]],ABS(Tabelle2[[#This Row],[Business as usual]]-Tabelle2[[#This Row],[Urban Sprawl]])>=Tabelle2[[#This Row],[q-Wert (Indifferenz)]]),((ABS(Tabelle2[[#This Row],[Business as usual]]-Tabelle2[[#This Row],[Urban Sprawl]])-Tabelle2[[#This Row],[q-Wert (Indifferenz)]])/(Tabelle2[[#This Row],[p-Wert (Präferenz)]]-Tabelle2[[#This Row],[q-Wert (Indifferenz)]]))))),IF(ABS(Tabelle2[[#This Row],[Business as usual]]-Tabelle2[[#This Row],[Urban Sprawl]])<Tabelle2[[#This Row],[q-Wert (Indifferenz)]], 0,IF(ABS(Tabelle2[[#This Row],[Business as usual]]-Tabelle2[[#This Row],[Urban Sprawl]])>Tabelle2[[#This Row],[p-Wert (Präferenz)]],1,IF(AND(ABS(Tabelle2[[#This Row],[Business as usual]]-Tabelle2[[#This Row],[Urban Sprawl]])<=Tabelle2[[#This Row],[p-Wert (Präferenz)]],ABS(Tabelle2[[#This Row],[Business as usual]]-Tabelle2[[#This Row],[Urban Sprawl]])>=Tabelle2[[#This Row],[q-Wert (Indifferenz)]]),((ABS(Tabelle2[[#This Row],[Business as usual]]-Tabelle2[[#This Row],[Urban Sprawl]])-Tabelle2[[#This Row],[q-Wert (Indifferenz)]])/(Tabelle2[[#This Row],[p-Wert (Präferenz)]]-Tabelle2[[#This Row],[q-Wert (Indifferenz)]])))))),IF(Tabelle2[[#This Row],[Business as usual]]-Tabelle2[[#This Row],[Urban Sprawl]]<0,-1*IF(ABS(Tabelle2[[#This Row],[Business as usual]]-Tabelle2[[#This Row],[Urban Sprawl]])<Tabelle2[[#This Row],[q-Wert (Indifferenz)]], 0,IF(ABS(Tabelle2[[#This Row],[Business as usual]]-Tabelle2[[#This Row],[Urban Sprawl]])>Tabelle2[[#This Row],[p-Wert (Präferenz)]],1,IF(AND(ABS(Tabelle2[[#This Row],[Business as usual]]-Tabelle2[[#This Row],[Urban Sprawl]])<=Tabelle2[[#This Row],[p-Wert (Präferenz)]],ABS(Tabelle2[[#This Row],[Business as usual]]-Tabelle2[[#This Row],[Urban Sprawl]])>=Tabelle2[[#This Row],[q-Wert (Indifferenz)]]),((ABS(Tabelle2[[#This Row],[Business as usual]]-Tabelle2[[#This Row],[Urban Sprawl]])-Tabelle2[[#This Row],[q-Wert (Indifferenz)]])/(Tabelle2[[#This Row],[p-Wert (Präferenz)]]-Tabelle2[[#This Row],[q-Wert (Indifferenz)]]))))),IF(ABS(Tabelle2[[#This Row],[Business as usual]]-Tabelle2[[#This Row],[Urban Sprawl]])<Tabelle2[[#This Row],[q-Wert (Indifferenz)]], 0,IF(ABS(Tabelle2[[#This Row],[Business as usual]]-Tabelle2[[#This Row],[Urban Sprawl]])>Tabelle2[[#This Row],[p-Wert (Präferenz)]],1,IF(AND(ABS(Tabelle2[[#This Row],[Business as usual]]-Tabelle2[[#This Row],[Urban Sprawl]])<=Tabelle2[[#This Row],[p-Wert (Präferenz)]],ABS(Tabelle2[[#This Row],[Business as usual]]-Tabelle2[[#This Row],[Urban Sprawl]])>=Tabelle2[[#This Row],[q-Wert (Indifferenz)]]),((ABS(Tabelle2[[#This Row],[Business as usual]]-Tabelle2[[#This Row],[Urban Sprawl]])-Tabelle2[[#This Row],[q-Wert (Indifferenz)]])/(Tabelle2[[#This Row],[p-Wert (Präferenz)]]-Tabelle2[[#This Row],[q-Wert (Indifferenz)]])))))))","v":0}]
[null,null,null,"Qualität Parkmanagement",{"$f":"('\"Walking Weights\"'!D8)/100","v":5.5555555555555552E-2},"max","Subjektiver Faktor",8,8,4,4,"Typ 5",2,5,{"$f":"IF(Tabelle2[[#This Row],[min/max]]=\"min\",-1*IF(Tabelle2[[#This Row],[Smart City]]-Tabelle2[[#This Row],[Healthy City]]<0,-1*IF(ABS(Tabelle2[[#This Row],[Smart City]]-Tabelle2[[#This Row],[Healthy City]])<Tabelle2[[#This Row],[q-Wert (Indifferenz)]], 0,IF(ABS(Tabelle2[[#This Row],[Smart City]]-Tabelle2[[#This Row],[Healthy City]])>Tabelle2[[#This Row],[p-Wert (Präferenz)]],1,IF(AND(ABS(Tabelle2[[#This Row],[Smart City]]-Tabelle2[[#This Row],[Healthy City]])<=Tabelle2[[#This Row],[p-Wert (Präferenz)]],ABS(Tabelle2[[#This Row],[Smart City]]-Tabelle2[[#This Row],[Healthy City]])>=Tabelle2[[#This Row],[q-Wert (Indifferenz)]]),((ABS(Tabelle2[[#This Row],[Smart City]]-Tabelle2[[#This Row],[Healthy City]])-Tabelle2[[#This Row],[q-Wert (Indifferenz)]])/(Tabelle2[[#This Row],[p-Wert (Präferenz)]]-Tabelle2[[#This Row],[q-Wert (Indifferenz)]]))))),IF(ABS(Tabelle2[[#This Row],[Smart City]]-Tabelle2[[#This Row],[Healthy City]])<Tabelle2[[#This Row],[q-Wert (Indifferenz)]], 0,IF(ABS(Tabelle2[[#This Row],[Smart City]]-Tabelle2[[#This Row],[Healthy City]])>Tabelle2[[#This Row],[p-Wert (Präferenz)]],1,IF(AND(ABS(Tabelle2[[#This Row],[Smart City]]-Tabelle2[[#This Row],[Healthy City]])<=Tabelle2[[#This Row],[p-Wert (Präferenz)]],ABS(Tabelle2[[#This Row],[Smart City]]-Tabelle2[[#This Row],[Healthy City]])>=Tabelle2[[#This Row],[q-Wert (Indifferenz)]]),((ABS(Tabelle2[[#This Row],[Smart City]]-Tabelle2[[#This Row],[Healthy City]])-Tabelle2[[#This Row],[q-Wert (Indifferenz)]])/(Tabelle2[[#This Row],[p-Wert (Präferenz)]]-Tabelle2[[#This Row],[q-Wert (Indifferenz)]])))))),IF(Tabelle2[[#This Row],[Smart City]]-Tabelle2[[#This Row],[Healthy City]]<0,-1*IF(ABS(Tabelle2[[#This Row],[Smart City]]-Tabelle2[[#This Row],[Healthy City]])<Tabelle2[[#This Row],[q-Wert (Indifferenz)]], 0,IF(ABS(Tabelle2[[#This Row],[Smart City]]-Tabelle2[[#This Row],[Healthy City]])>Tabelle2[[#This Row],[p-Wert (Präferenz)]],1,IF(AND(ABS(Tabelle2[[#This Row],[Smart City]]-Tabelle2[[#This Row],[Healthy City]])<=Tabelle2[[#This Row],[p-Wert (Präferenz)]],ABS(Tabelle2[[#This Row],[Smart City]]-Tabelle2[[#This Row],[Healthy City]])>=Tabelle2[[#This Row],[q-Wert (Indifferenz)]]),((ABS(Tabelle2[[#This Row],[Smart City]]-Tabelle2[[#This Row],[Healthy City]])-Tabelle2[[#This Row],[q-Wert (Indifferenz)]])/(Tabelle2[[#This Row],[p-Wert (Präferenz)]]-Tabelle2[[#This Row],[q-Wert (Indifferenz)]]))))),IF(ABS(Tabelle2[[#This Row],[Smart City]]-Tabelle2[[#This Row],[Healthy City]])<Tabelle2[[#This Row],[q-Wert (Indifferenz)]], 0,IF(ABS(Tabelle2[[#This Row],[Smart City]]-Tabelle2[[#This Row],[Healthy City]])>Tabelle2[[#This Row],[p-Wert (Präferenz)]],1,IF(AND(ABS(Tabelle2[[#This Row],[Smart City]]-Tabelle2[[#This Row],[Healthy City]])<=Tabelle2[[#This Row],[p-Wert (Präferenz)]],ABS(Tabelle2[[#This Row],[Smart City]]-Tabelle2[[#This Row],[Healthy City]])>=Tabelle2[[#This Row],[q-Wert (Indifferenz)]]),((ABS(Tabelle2[[#This Row],[Smart City]]-Tabelle2[[#This Row],[Healthy City]])-Tabelle2[[#This Row],[q-Wert (Indifferenz)]])/(Tabelle2[[#This Row],[p-Wert (Präferenz)]]-Tabelle2[[#This Row],[q-Wert (Indifferenz)]])))))))","v":0},{"$f":"IF(Tabelle2[[#This Row],[min/max]]=\"min\",-1*IF(Tabelle2[[#This Row],[Smart City]]-Tabelle2[[#This Row],[Urban Sprawl]]<0,-1*IF(ABS(Tabelle2[[#This Row],[Smart City]]-Tabelle2[[#This Row],[Urban Sprawl]])<Tabelle2[[#This Row],[q-Wert (Indifferenz)]], 0,IF(ABS(Tabelle2[[#This Row],[Smart City]]-Tabelle2[[#This Row],[Urban Sprawl]])>Tabelle2[[#This Row],[p-Wert (Präferenz)]],1,IF(AND(ABS(Tabelle2[[#This Row],[Smart City]]-Tabelle2[[#This Row],[Urban Sprawl]])<=Tabelle2[[#This Row],[p-Wert (Präferenz)]],ABS(Tabelle2[[#This Row],[Smart City]]-Tabelle2[[#This Row],[Urban Sprawl]])>=Tabelle2[[#This Row],[q-Wert (Indifferenz)]]),((ABS(Tabelle2[[#This Row],[Smart City]]-Tabelle2[[#This Row],[Urban Sprawl]])-Tabelle2[[#This Row],[q-Wert (Indifferenz)]])/(Tabelle2[[#This Row],[p-Wert (Präferenz)]]-Tabelle2[[#This Row],[q-Wert (Indifferenz)]]))))),IF(ABS(Tabelle2[[#This Row],[Smart City]]-Tabelle2[[#This Row],[Urban Sprawl]])<Tabelle2[[#This Row],[q-Wert (Indifferenz)]], 0,IF(ABS(Tabelle2[[#This Row],[Smart City]]-Tabelle2[[#This Row],[Urban Sprawl]])>Tabelle2[[#This Row],[p-Wert (Präferenz)]],1,IF(AND(ABS(Tabelle2[[#This Row],[Smart City]]-Tabelle2[[#This Row],[Urban Sprawl]])<=Tabelle2[[#This Row],[p-Wert (Präferenz)]],ABS(Tabelle2[[#This Row],[Smart City]]-Tabelle2[[#This Row],[Urban Sprawl]])>=Tabelle2[[#This Row],[q-Wert (Indifferenz)]]),((ABS(Tabelle2[[#This Row],[Smart City]]-Tabelle2[[#This Row],[Urban Sprawl]])-Tabelle2[[#This Row],[q-Wert (Indifferenz)]])/(Tabelle2[[#This Row],[p-Wert (Präferenz)]]-Tabelle2[[#This Row],[q-Wert (Indifferenz)]])))))),IF(Tabelle2[[#This Row],[Smart City]]-Tabelle2[[#This Row],[Urban Sprawl]]<0,-1*IF(ABS(Tabelle2[[#This Row],[Smart City]]-Tabelle2[[#This Row],[Urban Sprawl]])<Tabelle2[[#This Row],[q-Wert (Indifferenz)]], 0,IF(ABS(Tabelle2[[#This Row],[Smart City]]-Tabelle2[[#This Row],[Urban Sprawl]])>Tabelle2[[#This Row],[p-Wert (Präferenz)]],1,IF(AND(ABS(Tabelle2[[#This Row],[Smart City]]-Tabelle2[[#This Row],[Urban Sprawl]])<=Tabelle2[[#This Row],[p-Wert (Präferenz)]],ABS(Tabelle2[[#This Row],[Smart City]]-Tabelle2[[#This Row],[Urban Sprawl]])>=Tabelle2[[#This Row],[q-Wert (Indifferenz)]]),((ABS(Tabelle2[[#This Row],[Smart City]]-Tabelle2[[#This Row],[Urban Sprawl]])-Tabelle2[[#This Row],[q-Wert (Indifferenz)]])/(Tabelle2[[#This Row],[p-Wert (Präferenz)]]-Tabelle2[[#This Row],[q-Wert (Indifferenz)]]))))),IF(ABS(Tabelle2[[#This Row],[Smart City]]-Tabelle2[[#This Row],[Urban Sprawl]])<Tabelle2[[#This Row],[q-Wert (Indifferenz)]], 0,IF(ABS(Tabelle2[[#This Row],[Smart City]]-Tabelle2[[#This Row],[Urban Sprawl]])>Tabelle2[[#This Row],[p-Wert (Präferenz)]],1,IF(AND(ABS(Tabelle2[[#This Row],[Smart City]]-Tabelle2[[#This Row],[Urban Sprawl]])<=Tabelle2[[#This Row],[p-Wert (Präferenz)]],ABS(Tabelle2[[#This Row],[Smart City]]-Tabelle2[[#This Row],[Urban Sprawl]])>=Tabelle2[[#This Row],[q-Wert (Indifferenz)]]),((ABS(Tabelle2[[#This Row],[Smart City]]-Tabelle2[[#This Row],[Urban Sprawl]])-Tabelle2[[#This Row],[q-Wert (Indifferenz)]])/(Tabelle2[[#This Row],[p-Wert (Präferenz)]]-Tabelle2[[#This Row],[q-Wert (Indifferenz)]])))))))","v":0.66666666666666663},{"$f":"IF(Tabelle2[[#This Row],[min/max]]=\"min\",-1*IF(Tabelle2[[#This Row],[Smart City]]-Tabelle2[[#This Row],[Business as usual]]<0,-1*IF(ABS(Tabelle2[[#This Row],[Smart City]]-Tabelle2[[#This Row],[Business as usual]])<Tabelle2[[#This Row],[q-Wert (Indifferenz)]], 0,IF(ABS(Tabelle2[[#This Row],[Smart City]]-Tabelle2[[#This Row],[Business as usual]])>Tabelle2[[#This Row],[p-Wert (Präferenz)]],1,IF(AND(ABS(Tabelle2[[#This Row],[Smart City]]-Tabelle2[[#This Row],[Business as usual]])<=Tabelle2[[#This Row],[p-Wert (Präferenz)]],ABS(Tabelle2[[#This Row],[Smart City]]-Tabelle2[[#This Row],[Business as usual]])>=Tabelle2[[#This Row],[q-Wert (Indifferenz)]]),((ABS(Tabelle2[[#This Row],[Smart City]]-Tabelle2[[#This Row],[Business as usual]])-Tabelle2[[#This Row],[q-Wert (Indifferenz)]])/(Tabelle2[[#This Row],[p-Wert (Präferenz)]]-Tabelle2[[#This Row],[q-Wert (Indifferenz)]]))))),IF(ABS(Tabelle2[[#This Row],[Smart City]]-Tabelle2[[#This Row],[Business as usual]])<Tabelle2[[#This Row],[q-Wert (Indifferenz)]], 0,IF(ABS(Tabelle2[[#This Row],[Smart City]]-Tabelle2[[#This Row],[Business as usual]])>Tabelle2[[#This Row],[p-Wert (Präferenz)]],1,IF(AND(ABS(Tabelle2[[#This Row],[Smart City]]-Tabelle2[[#This Row],[Business as usual]])<=Tabelle2[[#This Row],[p-Wert (Präferenz)]],ABS(Tabelle2[[#This Row],[Smart City]]-Tabelle2[[#This Row],[Business as usual]])>=Tabelle2[[#This Row],[q-Wert (Indifferenz)]]),((ABS(Tabelle2[[#This Row],[Smart City]]-Tabelle2[[#This Row],[Business as usual]])-Tabelle2[[#This Row],[q-Wert (Indifferenz)]])/(Tabelle2[[#This Row],[p-Wert (Präferenz)]]-Tabelle2[[#This Row],[q-Wert (Indifferenz)]])))))),IF(Tabelle2[[#This Row],[Smart City]]-Tabelle2[[#This Row],[Business as usual]]<0,-1*IF(ABS(Tabelle2[[#This Row],[Smart City]]-Tabelle2[[#This Row],[Business as usual]])<Tabelle2[[#This Row],[q-Wert (Indifferenz)]], 0,IF(ABS(Tabelle2[[#This Row],[Smart City]]-Tabelle2[[#This Row],[Business as usual]])>Tabelle2[[#This Row],[p-Wert (Präferenz)]],1,IF(AND(ABS(Tabelle2[[#This Row],[Smart City]]-Tabelle2[[#This Row],[Business as usual]])<=Tabelle2[[#This Row],[p-Wert (Präferenz)]],ABS(Tabelle2[[#This Row],[Smart City]]-Tabelle2[[#This Row],[Business as usual]])>=Tabelle2[[#This Row],[q-Wert (Indifferenz)]]),((ABS(Tabelle2[[#This Row],[Smart City]]-Tabelle2[[#This Row],[Business as usual]])-Tabelle2[[#This Row],[q-Wert (Indifferenz)]])/(Tabelle2[[#This Row],[p-Wert (Präferenz)]]-Tabelle2[[#This Row],[q-Wert (Indifferenz)]]))))),IF(ABS(Tabelle2[[#This Row],[Smart City]]-Tabelle2[[#This Row],[Business as usual]])<Tabelle2[[#This Row],[q-Wert (Indifferenz)]], 0,IF(ABS(Tabelle2[[#This Row],[Smart City]]-Tabelle2[[#This Row],[Business as usual]])>Tabelle2[[#This Row],[p-Wert (Präferenz)]],1,IF(AND(ABS(Tabelle2[[#This Row],[Smart City]]-Tabelle2[[#This Row],[Business as usual]])<=Tabelle2[[#This Row],[p-Wert (Präferenz)]],ABS(Tabelle2[[#This Row],[Smart City]]-Tabelle2[[#This Row],[Business as usual]])>=Tabelle2[[#This Row],[q-Wert (Indifferenz)]]),((ABS(Tabelle2[[#This Row],[Smart City]]-Tabelle2[[#This Row],[Business as usual]])-Tabelle2[[#This Row],[q-Wert (Indifferenz)]])/(Tabelle2[[#This Row],[p-Wert (Präferenz)]]-Tabelle2[[#This Row],[q-Wert (Indifferenz)]])))))))","v":0.66666666666666663},null,{"$f":"IF(Tabelle2[[#This Row],[min/max]]=\"min\",-1*IF(Tabelle2[[#This Row],[Healthy City]]-Tabelle2[[#This Row],[Smart City]]<0,-1*IF(ABS(Tabelle2[[#This Row],[Healthy City]]-Tabelle2[[#This Row],[Smart City]])<Tabelle2[[#This Row],[q-Wert (Indifferenz)]], 0,IF(ABS(Tabelle2[[#This Row],[Healthy City]]-Tabelle2[[#This Row],[Smart City]])>Tabelle2[[#This Row],[p-Wert (Präferenz)]],1,IF(AND(ABS(Tabelle2[[#This Row],[Healthy City]]-Tabelle2[[#This Row],[Smart City]])<=Tabelle2[[#This Row],[p-Wert (Präferenz)]],ABS(Tabelle2[[#This Row],[Healthy City]]-Tabelle2[[#This Row],[Smart City]])>=Tabelle2[[#This Row],[q-Wert (Indifferenz)]]),((ABS(Tabelle2[[#This Row],[Healthy City]]-Tabelle2[[#This Row],[Smart City]])-Tabelle2[[#This Row],[q-Wert (Indifferenz)]])/(Tabelle2[[#This Row],[p-Wert (Präferenz)]]-Tabelle2[[#This Row],[q-Wert (Indifferenz)]]))))),IF(ABS(Tabelle2[[#This Row],[Healthy City]]-Tabelle2[[#This Row],[Smart City]])<Tabelle2[[#This Row],[q-Wert (Indifferenz)]], 0,IF(ABS(Tabelle2[[#This Row],[Healthy City]]-Tabelle2[[#This Row],[Smart City]])>Tabelle2[[#This Row],[p-Wert (Präferenz)]],1,IF(AND(ABS(Tabelle2[[#This Row],[Healthy City]]-Tabelle2[[#This Row],[Smart City]])<=Tabelle2[[#This Row],[p-Wert (Präferenz)]],ABS(Tabelle2[[#This Row],[Healthy City]]-Tabelle2[[#This Row],[Smart City]])>=Tabelle2[[#This Row],[q-Wert (Indifferenz)]]),((ABS(Tabelle2[[#This Row],[Healthy City]]-Tabelle2[[#This Row],[Smart City]])-Tabelle2[[#This Row],[q-Wert (Indifferenz)]])/(Tabelle2[[#This Row],[p-Wert (Präferenz)]]-Tabelle2[[#This Row],[q-Wert (Indifferenz)]])))))),IF(Tabelle2[[#This Row],[Healthy City]]-Tabelle2[[#This Row],[Smart City]]<0,-1*IF(ABS(Tabelle2[[#This Row],[Healthy City]]-Tabelle2[[#This Row],[Smart City]])<Tabelle2[[#This Row],[q-Wert (Indifferenz)]], 0,IF(ABS(Tabelle2[[#This Row],[Healthy City]]-Tabelle2[[#This Row],[Smart City]])>Tabelle2[[#This Row],[p-Wert (Präferenz)]],1,IF(AND(ABS(Tabelle2[[#This Row],[Healthy City]]-Tabelle2[[#This Row],[Smart City]])<=Tabelle2[[#This Row],[p-Wert (Präferenz)]],ABS(Tabelle2[[#This Row],[Healthy City]]-Tabelle2[[#This Row],[Smart City]])>=Tabelle2[[#This Row],[q-Wert (Indifferenz)]]),((ABS(Tabelle2[[#This Row],[Healthy City]]-Tabelle2[[#This Row],[Smart City]])-Tabelle2[[#This Row],[q-Wert (Indifferenz)]])/(Tabelle2[[#This Row],[p-Wert (Präferenz)]]-Tabelle2[[#This Row],[q-Wert (Indifferenz)]]))))),IF(ABS(Tabelle2[[#This Row],[Healthy City]]-Tabelle2[[#This Row],[Smart City]])<Tabelle2[[#This Row],[q-Wert (Indifferenz)]], 0,IF(ABS(Tabelle2[[#This Row],[Healthy City]]-Tabelle2[[#This Row],[Smart City]])>Tabelle2[[#This Row],[p-Wert (Präferenz)]],1,IF(AND(ABS(Tabelle2[[#This Row],[Healthy City]]-Tabelle2[[#This Row],[Smart City]])<=Tabelle2[[#This Row],[p-Wert (Präferenz)]],ABS(Tabelle2[[#This Row],[Healthy City]]-Tabelle2[[#This Row],[Smart City]])>=Tabelle2[[#This Row],[q-Wert (Indifferenz)]]),((ABS(Tabelle2[[#This Row],[Healthy City]]-Tabelle2[[#This Row],[Smart City]])-Tabelle2[[#This Row],[q-Wert (Indifferenz)]])/(Tabelle2[[#This Row],[p-Wert (Präferenz)]]-Tabelle2[[#This Row],[q-Wert (Indifferenz)]])))))))","v":0},{"$f":"IF(Tabelle2[[#This Row],[min/max]]=\"min\",-1*IF(Tabelle2[[#This Row],[Healthy City]]-Tabelle2[[#This Row],[Urban Sprawl]]<0,-1*IF(ABS(Tabelle2[[#This Row],[Healthy City]]-Tabelle2[[#This Row],[Urban Sprawl]])<Tabelle2[[#This Row],[q-Wert (Indifferenz)]], 0,IF(ABS(Tabelle2[[#This Row],[Healthy City]]-Tabelle2[[#This Row],[Urban Sprawl]])>Tabelle2[[#This Row],[p-Wert (Präferenz)]],1,IF(AND(ABS(Tabelle2[[#This Row],[Healthy City]]-Tabelle2[[#This Row],[Urban Sprawl]])<=Tabelle2[[#This Row],[p-Wert (Präferenz)]],ABS(Tabelle2[[#This Row],[Healthy City]]-Tabelle2[[#This Row],[Urban Sprawl]])>=Tabelle2[[#This Row],[q-Wert (Indifferenz)]]),((ABS(Tabelle2[[#This Row],[Healthy City]]-Tabelle2[[#This Row],[Urban Sprawl]])-Tabelle2[[#This Row],[q-Wert (Indifferenz)]])/(Tabelle2[[#This Row],[p-Wert (Präferenz)]]-Tabelle2[[#This Row],[q-Wert (Indifferenz)]]))))),IF(ABS(Tabelle2[[#This Row],[Healthy City]]-Tabelle2[[#This Row],[Urban Sprawl]])<Tabelle2[[#This Row],[q-Wert (Indifferenz)]], 0,IF(ABS(Tabelle2[[#This Row],[Healthy City]]-Tabelle2[[#This Row],[Urban Sprawl]])>Tabelle2[[#This Row],[p-Wert (Präferenz)]],1,IF(AND(ABS(Tabelle2[[#This Row],[Healthy City]]-Tabelle2[[#This Row],[Urban Sprawl]])<=Tabelle2[[#This Row],[p-Wert (Präferenz)]],ABS(Tabelle2[[#This Row],[Healthy City]]-Tabelle2[[#This Row],[Urban Sprawl]])>=Tabelle2[[#This Row],[q-Wert (Indifferenz)]]),((ABS(Tabelle2[[#This Row],[Healthy City]]-Tabelle2[[#This Row],[Urban Sprawl]])-Tabelle2[[#This Row],[q-Wert (Indifferenz)]])/(Tabelle2[[#This Row],[p-Wert (Präferenz)]]-Tabelle2[[#This Row],[q-Wert (Indifferenz)]])))))),IF(Tabelle2[[#This Row],[Healthy City]]-Tabelle2[[#This Row],[Urban Sprawl]]<0,-1*IF(ABS(Tabelle2[[#This Row],[Healthy City]]-Tabelle2[[#This Row],[Urban Sprawl]])<Tabelle2[[#This Row],[q-Wert (Indifferenz)]], 0,IF(ABS(Tabelle2[[#This Row],[Healthy City]]-Tabelle2[[#This Row],[Urban Sprawl]])>Tabelle2[[#This Row],[p-Wert (Präferenz)]],1,IF(AND(ABS(Tabelle2[[#This Row],[Healthy City]]-Tabelle2[[#This Row],[Urban Sprawl]])<=Tabelle2[[#This Row],[p-Wert (Präferenz)]],ABS(Tabelle2[[#This Row],[Healthy City]]-Tabelle2[[#This Row],[Urban Sprawl]])>=Tabelle2[[#This Row],[q-Wert (Indifferenz)]]),((ABS(Tabelle2[[#This Row],[Healthy City]]-Tabelle2[[#This Row],[Urban Sprawl]])-Tabelle2[[#This Row],[q-Wert (Indifferenz)]])/(Tabelle2[[#This Row],[p-Wert (Präferenz)]]-Tabelle2[[#This Row],[q-Wert (Indifferenz)]]))))),IF(ABS(Tabelle2[[#This Row],[Healthy City]]-Tabelle2[[#This Row],[Urban Sprawl]])<Tabelle2[[#This Row],[q-Wert (Indifferenz)]], 0,IF(ABS(Tabelle2[[#This Row],[Healthy City]]-Tabelle2[[#This Row],[Urban Sprawl]])>Tabelle2[[#This Row],[p-Wert (Präferenz)]],1,IF(AND(ABS(Tabelle2[[#This Row],[Healthy City]]-Tabelle2[[#This Row],[Urban Sprawl]])<=Tabelle2[[#This Row],[p-Wert (Präferenz)]],ABS(Tabelle2[[#This Row],[Healthy City]]-Tabelle2[[#This Row],[Urban Sprawl]])>=Tabelle2[[#This Row],[q-Wert (Indifferenz)]]),((ABS(Tabelle2[[#This Row],[Healthy City]]-Tabelle2[[#This Row],[Urban Sprawl]])-Tabelle2[[#This Row],[q-Wert (Indifferenz)]])/(Tabelle2[[#This Row],[p-Wert (Präferenz)]]-Tabelle2[[#This Row],[q-Wert (Indifferenz)]])))))))","v":0.66666666666666663},{"$f":"IF(Tabelle2[[#This Row],[min/max]]=\"min\",-1*IF(Tabelle2[[#This Row],[Healthy City]]-Tabelle2[[#This Row],[Business as usual]]<0,-1*IF(ABS(Tabelle2[[#This Row],[Healthy City]]-Tabelle2[[#This Row],[Business as usual]])<Tabelle2[[#This Row],[q-Wert (Indifferenz)]], 0,IF(ABS(Tabelle2[[#This Row],[Healthy City]]-Tabelle2[[#This Row],[Business as usual]])>Tabelle2[[#This Row],[p-Wert (Präferenz)]],1,IF(AND(ABS(Tabelle2[[#This Row],[Healthy City]]-Tabelle2[[#This Row],[Business as usual]])<=Tabelle2[[#This Row],[p-Wert (Präferenz)]],ABS(Tabelle2[[#This Row],[Healthy City]]-Tabelle2[[#This Row],[Business as usual]])>=Tabelle2[[#This Row],[q-Wert (Indifferenz)]]),((ABS(Tabelle2[[#This Row],[Healthy City]]-Tabelle2[[#This Row],[Business as usual]])-Tabelle2[[#This Row],[q-Wert (Indifferenz)]])/(Tabelle2[[#This Row],[p-Wert (Präferenz)]]-Tabelle2[[#This Row],[q-Wert (Indifferenz)]]))))),IF(ABS(Tabelle2[[#This Row],[Healthy City]]-Tabelle2[[#This Row],[Business as usual]])<Tabelle2[[#This Row],[q-Wert (Indifferenz)]], 0,IF(ABS(Tabelle2[[#This Row],[Healthy City]]-Tabelle2[[#This Row],[Business as usual]])>Tabelle2[[#This Row],[p-Wert (Präferenz)]],1,IF(AND(ABS(Tabelle2[[#This Row],[Healthy City]]-Tabelle2[[#This Row],[Business as usual]])<=Tabelle2[[#This Row],[p-Wert (Präferenz)]],ABS(Tabelle2[[#This Row],[Healthy City]]-Tabelle2[[#This Row],[Business as usual]])>=Tabelle2[[#This Row],[q-Wert (Indifferenz)]]),((ABS(Tabelle2[[#This Row],[Healthy City]]-Tabelle2[[#This Row],[Business as usual]])-Tabelle2[[#This Row],[q-Wert (Indifferenz)]])/(Tabelle2[[#This Row],[p-Wert (Präferenz)]]-Tabelle2[[#This Row],[q-Wert (Indifferenz)]])))))),IF(Tabelle2[[#This Row],[Healthy City]]-Tabelle2[[#This Row],[Business as usual]]<0,-1*IF(ABS(Tabelle2[[#This Row],[Healthy City]]-Tabelle2[[#This Row],[Business as usual]])<Tabelle2[[#This Row],[q-Wert (Indifferenz)]], 0,IF(ABS(Tabelle2[[#This Row],[Healthy City]]-Tabelle2[[#This Row],[Business as usual]])>Tabelle2[[#This Row],[p-Wert (Präferenz)]],1,IF(AND(ABS(Tabelle2[[#This Row],[Healthy City]]-Tabelle2[[#This Row],[Business as usual]])<=Tabelle2[[#This Row],[p-Wert (Präferenz)]],ABS(Tabelle2[[#This Row],[Healthy City]]-Tabelle2[[#This Row],[Business as usual]])>=Tabelle2[[#This Row],[q-Wert (Indifferenz)]]),((ABS(Tabelle2[[#This Row],[Healthy City]]-Tabelle2[[#This Row],[Business as usual]])-Tabelle2[[#This Row],[q-Wert (Indifferenz)]])/(Tabelle2[[#This Row],[p-Wert (Präferenz)]]-Tabelle2[[#This Row],[q-Wert (Indifferenz)]]))))),IF(ABS(Tabelle2[[#This Row],[Healthy City]]-Tabelle2[[#This Row],[Business as usual]])<Tabelle2[[#This Row],[q-Wert (Indifferenz)]], 0,IF(ABS(Tabelle2[[#This Row],[Healthy City]]-Tabelle2[[#This Row],[Business as usual]])>Tabelle2[[#This Row],[p-Wert (Präferenz)]],1,IF(AND(ABS(Tabelle2[[#This Row],[Healthy City]]-Tabelle2[[#This Row],[Business as usual]])<=Tabelle2[[#This Row],[p-Wert (Präferenz)]],ABS(Tabelle2[[#This Row],[Healthy City]]-Tabelle2[[#This Row],[Business as usual]])>=Tabelle2[[#This Row],[q-Wert (Indifferenz)]]),((ABS(Tabelle2[[#This Row],[Healthy City]]-Tabelle2[[#This Row],[Business as usual]])-Tabelle2[[#This Row],[q-Wert (Indifferenz)]])/(Tabelle2[[#This Row],[p-Wert (Präferenz)]]-Tabelle2[[#This Row],[q-Wert (Indifferenz)]])))))))","v":0.66666666666666663},null,{"$f":"IF(Tabelle2[[#This Row],[min/max]]=\"min\",-1*IF(Tabelle2[[#This Row],[Urban Sprawl]]-Tabelle2[[#This Row],[Smart City]]<0,-1*IF(ABS(Tabelle2[[#This Row],[Urban Sprawl]]-Tabelle2[[#This Row],[Smart City]])<Tabelle2[[#This Row],[q-Wert (Indifferenz)]], 0,IF(ABS(Tabelle2[[#This Row],[Urban Sprawl]]-Tabelle2[[#This Row],[Smart City]])>Tabelle2[[#This Row],[p-Wert (Präferenz)]],1,IF(AND(ABS(Tabelle2[[#This Row],[Urban Sprawl]]-Tabelle2[[#This Row],[Smart City]])<=Tabelle2[[#This Row],[p-Wert (Präferenz)]],ABS(Tabelle2[[#This Row],[Urban Sprawl]]-Tabelle2[[#This Row],[Smart City]])>=Tabelle2[[#This Row],[q-Wert (Indifferenz)]]),((ABS(Tabelle2[[#This Row],[Urban Sprawl]]-Tabelle2[[#This Row],[Smart City]])-Tabelle2[[#This Row],[q-Wert (Indifferenz)]])/(Tabelle2[[#This Row],[p-Wert (Präferenz)]]-Tabelle2[[#This Row],[q-Wert (Indifferenz)]]))))),IF(ABS(Tabelle2[[#This Row],[Urban Sprawl]]-Tabelle2[[#This Row],[Smart City]])<Tabelle2[[#This Row],[q-Wert (Indifferenz)]], 0,IF(ABS(Tabelle2[[#This Row],[Urban Sprawl]]-Tabelle2[[#This Row],[Smart City]])>Tabelle2[[#This Row],[p-Wert (Präferenz)]],1,IF(AND(ABS(Tabelle2[[#This Row],[Urban Sprawl]]-Tabelle2[[#This Row],[Smart City]])<=Tabelle2[[#This Row],[p-Wert (Präferenz)]],ABS(Tabelle2[[#This Row],[Urban Sprawl]]-Tabelle2[[#This Row],[Smart City]])>=Tabelle2[[#This Row],[q-Wert (Indifferenz)]]),((ABS(Tabelle2[[#This Row],[Urban Sprawl]]-Tabelle2[[#This Row],[Smart City]])-Tabelle2[[#This Row],[q-Wert (Indifferenz)]])/(Tabelle2[[#This Row],[p-Wert (Präferenz)]]-Tabelle2[[#This Row],[q-Wert (Indifferenz)]])))))),IF(Tabelle2[[#This Row],[Urban Sprawl]]-Tabelle2[[#This Row],[Smart City]]<0,-1*IF(ABS(Tabelle2[[#This Row],[Urban Sprawl]]-Tabelle2[[#This Row],[Smart City]])<Tabelle2[[#This Row],[q-Wert (Indifferenz)]], 0,IF(ABS(Tabelle2[[#This Row],[Urban Sprawl]]-Tabelle2[[#This Row],[Smart City]])>Tabelle2[[#This Row],[p-Wert (Präferenz)]],1,IF(AND(ABS(Tabelle2[[#This Row],[Urban Sprawl]]-Tabelle2[[#This Row],[Smart City]])<=Tabelle2[[#This Row],[p-Wert (Präferenz)]],ABS(Tabelle2[[#This Row],[Urban Sprawl]]-Tabelle2[[#This Row],[Smart City]])>=Tabelle2[[#This Row],[q-Wert (Indifferenz)]]),((ABS(Tabelle2[[#This Row],[Urban Sprawl]]-Tabelle2[[#This Row],[Smart City]])-Tabelle2[[#This Row],[q-Wert (Indifferenz)]])/(Tabelle2[[#This Row],[p-Wert (Präferenz)]]-Tabelle2[[#This Row],[q-Wert (Indifferenz)]]))))),IF(ABS(Tabelle2[[#This Row],[Urban Sprawl]]-Tabelle2[[#This Row],[Smart City]])<Tabelle2[[#This Row],[q-Wert (Indifferenz)]], 0,IF(ABS(Tabelle2[[#This Row],[Urban Sprawl]]-Tabelle2[[#This Row],[Smart City]])>Tabelle2[[#This Row],[p-Wert (Präferenz)]],1,IF(AND(ABS(Tabelle2[[#This Row],[Urban Sprawl]]-Tabelle2[[#This Row],[Smart City]])<=Tabelle2[[#This Row],[p-Wert (Präferenz)]],ABS(Tabelle2[[#This Row],[Urban Sprawl]]-Tabelle2[[#This Row],[Smart City]])>=Tabelle2[[#This Row],[q-Wert (Indifferenz)]]),((ABS(Tabelle2[[#This Row],[Urban Sprawl]]-Tabelle2[[#This Row],[Smart City]])-Tabelle2[[#This Row],[q-Wert (Indifferenz)]])/(Tabelle2[[#This Row],[p-Wert (Präferenz)]]-Tabelle2[[#This Row],[q-Wert (Indifferenz)]])))))))","v":-0.66666666666666663},{"$f":"IF(Tabelle2[[#This Row],[min/max]]=\"min\",-1*IF(Tabelle2[[#This Row],[Urban Sprawl]]-Tabelle2[[#This Row],[Healthy City]]<0,-1*IF(ABS(Tabelle2[[#This Row],[Urban Sprawl]]-Tabelle2[[#This Row],[Healthy City]])<Tabelle2[[#This Row],[q-Wert (Indifferenz)]], 0,IF(ABS(Tabelle2[[#This Row],[Urban Sprawl]]-Tabelle2[[#This Row],[Healthy City]])>Tabelle2[[#This Row],[p-Wert (Präferenz)]],1,IF(AND(ABS(Tabelle2[[#This Row],[Urban Sprawl]]-Tabelle2[[#This Row],[Healthy City]])<=Tabelle2[[#This Row],[p-Wert (Präferenz)]],ABS(Tabelle2[[#This Row],[Urban Sprawl]]-Tabelle2[[#This Row],[Healthy City]])>=Tabelle2[[#This Row],[q-Wert (Indifferenz)]]),((ABS(Tabelle2[[#This Row],[Urban Sprawl]]-Tabelle2[[#This Row],[Healthy City]])-Tabelle2[[#This Row],[q-Wert (Indifferenz)]])/(Tabelle2[[#This Row],[p-Wert (Präferenz)]]-Tabelle2[[#This Row],[q-Wert (Indifferenz)]]))))),IF(ABS(Tabelle2[[#This Row],[Urban Sprawl]]-Tabelle2[[#This Row],[Healthy City]])<Tabelle2[[#This Row],[q-Wert (Indifferenz)]], 0,IF(ABS(Tabelle2[[#This Row],[Urban Sprawl]]-Tabelle2[[#This Row],[Healthy City]])>Tabelle2[[#This Row],[p-Wert (Präferenz)]],1,IF(AND(ABS(Tabelle2[[#This Row],[Urban Sprawl]]-Tabelle2[[#This Row],[Healthy City]])<=Tabelle2[[#This Row],[p-Wert (Präferenz)]],ABS(Tabelle2[[#This Row],[Urban Sprawl]]-Tabelle2[[#This Row],[Healthy City]])>=Tabelle2[[#This Row],[q-Wert (Indifferenz)]]),((ABS(Tabelle2[[#This Row],[Urban Sprawl]]-Tabelle2[[#This Row],[Healthy City]])-Tabelle2[[#This Row],[q-Wert (Indifferenz)]])/(Tabelle2[[#This Row],[p-Wert (Präferenz)]]-Tabelle2[[#This Row],[q-Wert (Indifferenz)]])))))),IF(Tabelle2[[#This Row],[Urban Sprawl]]-Tabelle2[[#This Row],[Healthy City]]<0,-1*IF(ABS(Tabelle2[[#This Row],[Urban Sprawl]]-Tabelle2[[#This Row],[Healthy City]])<Tabelle2[[#This Row],[q-Wert (Indifferenz)]], 0,IF(ABS(Tabelle2[[#This Row],[Urban Sprawl]]-Tabelle2[[#This Row],[Healthy City]])>Tabelle2[[#This Row],[p-Wert (Präferenz)]],1,IF(AND(ABS(Tabelle2[[#This Row],[Urban Sprawl]]-Tabelle2[[#This Row],[Healthy City]])<=Tabelle2[[#This Row],[p-Wert (Präferenz)]],ABS(Tabelle2[[#This Row],[Urban Sprawl]]-Tabelle2[[#This Row],[Healthy City]])>=Tabelle2[[#This Row],[q-Wert (Indifferenz)]]),((ABS(Tabelle2[[#This Row],[Urban Sprawl]]-Tabelle2[[#This Row],[Healthy City]])-Tabelle2[[#This Row],[q-Wert (Indifferenz)]])/(Tabelle2[[#This Row],[p-Wert (Präferenz)]]-Tabelle2[[#This Row],[q-Wert (Indifferenz)]]))))),IF(ABS(Tabelle2[[#This Row],[Urban Sprawl]]-Tabelle2[[#This Row],[Healthy City]])<Tabelle2[[#This Row],[q-Wert (Indifferenz)]], 0,IF(ABS(Tabelle2[[#This Row],[Urban Sprawl]]-Tabelle2[[#This Row],[Healthy City]])>Tabelle2[[#This Row],[p-Wert (Präferenz)]],1,IF(AND(ABS(Tabelle2[[#This Row],[Urban Sprawl]]-Tabelle2[[#This Row],[Healthy City]])<=Tabelle2[[#This Row],[p-Wert (Präferenz)]],ABS(Tabelle2[[#This Row],[Urban Sprawl]]-Tabelle2[[#This Row],[Healthy City]])>=Tabelle2[[#This Row],[q-Wert (Indifferenz)]]),((ABS(Tabelle2[[#This Row],[Urban Sprawl]]-Tabelle2[[#This Row],[Healthy City]])-Tabelle2[[#This Row],[q-Wert (Indifferenz)]])/(Tabelle2[[#This Row],[p-Wert (Präferenz)]]-Tabelle2[[#This Row],[q-Wert (Indifferenz)]])))))))","v":-0.66666666666666663},{"$f":"IF(Tabelle2[[#This Row],[min/max]]=\"min\",-1*IF(Tabelle2[[#This Row],[Urban Sprawl]]-Tabelle2[[#This Row],[Business as usual]]<0,-1*IF(ABS(Tabelle2[[#This Row],[Urban Sprawl]]-Tabelle2[[#This Row],[Business as usual]])<Tabelle2[[#This Row],[q-Wert (Indifferenz)]], 0,IF(ABS(Tabelle2[[#This Row],[Urban Sprawl]]-Tabelle2[[#This Row],[Business as usual]])>Tabelle2[[#This Row],[p-Wert (Präferenz)]],1,IF(AND(ABS(Tabelle2[[#This Row],[Urban Sprawl]]-Tabelle2[[#This Row],[Business as usual]])<=Tabelle2[[#This Row],[p-Wert (Präferenz)]],ABS(Tabelle2[[#This Row],[Urban Sprawl]]-Tabelle2[[#This Row],[Business as usual]])>=Tabelle2[[#This Row],[q-Wert (Indifferenz)]]),((ABS(Tabelle2[[#This Row],[Urban Sprawl]]-Tabelle2[[#This Row],[Business as usual]])-Tabelle2[[#This Row],[q-Wert (Indifferenz)]])/(Tabelle2[[#This Row],[p-Wert (Präferenz)]]-Tabelle2[[#This Row],[q-Wert (Indifferenz)]]))))),IF(ABS(Tabelle2[[#This Row],[Urban Sprawl]]-Tabelle2[[#This Row],[Business as usual]])<Tabelle2[[#This Row],[q-Wert (Indifferenz)]], 0,IF(ABS(Tabelle2[[#This Row],[Urban Sprawl]]-Tabelle2[[#This Row],[Business as usual]])>Tabelle2[[#This Row],[p-Wert (Präferenz)]],1,IF(AND(ABS(Tabelle2[[#This Row],[Urban Sprawl]]-Tabelle2[[#This Row],[Business as usual]])<=Tabelle2[[#This Row],[p-Wert (Präferenz)]],ABS(Tabelle2[[#This Row],[Urban Sprawl]]-Tabelle2[[#This Row],[Business as usual]])>=Tabelle2[[#This Row],[q-Wert (Indifferenz)]]),((ABS(Tabelle2[[#This Row],[Urban Sprawl]]-Tabelle2[[#This Row],[Business as usual]])-Tabelle2[[#This Row],[q-Wert (Indifferenz)]])/(Tabelle2[[#This Row],[p-Wert (Präferenz)]]-Tabelle2[[#This Row],[q-Wert (Indifferenz)]])))))),IF(Tabelle2[[#This Row],[Urban Sprawl]]-Tabelle2[[#This Row],[Business as usual]]<0,-1*IF(ABS(Tabelle2[[#This Row],[Urban Sprawl]]-Tabelle2[[#This Row],[Business as usual]])<Tabelle2[[#This Row],[q-Wert (Indifferenz)]], 0,IF(ABS(Tabelle2[[#This Row],[Urban Sprawl]]-Tabelle2[[#This Row],[Business as usual]])>Tabelle2[[#This Row],[p-Wert (Präferenz)]],1,IF(AND(ABS(Tabelle2[[#This Row],[Urban Sprawl]]-Tabelle2[[#This Row],[Business as usual]])<=Tabelle2[[#This Row],[p-Wert (Präferenz)]],ABS(Tabelle2[[#This Row],[Urban Sprawl]]-Tabelle2[[#This Row],[Business as usual]])>=Tabelle2[[#This Row],[q-Wert (Indifferenz)]]),((ABS(Tabelle2[[#This Row],[Urban Sprawl]]-Tabelle2[[#This Row],[Business as usual]])-Tabelle2[[#This Row],[q-Wert (Indifferenz)]])/(Tabelle2[[#This Row],[p-Wert (Präferenz)]]-Tabelle2[[#This Row],[q-Wert (Indifferenz)]]))))),IF(ABS(Tabelle2[[#This Row],[Urban Sprawl]]-Tabelle2[[#This Row],[Business as usual]])<Tabelle2[[#This Row],[q-Wert (Indifferenz)]], 0,IF(ABS(Tabelle2[[#This Row],[Urban Sprawl]]-Tabelle2[[#This Row],[Business as usual]])>Tabelle2[[#This Row],[p-Wert (Präferenz)]],1,IF(AND(ABS(Tabelle2[[#This Row],[Urban Sprawl]]-Tabelle2[[#This Row],[Business as usual]])<=Tabelle2[[#This Row],[p-Wert (Präferenz)]],ABS(Tabelle2[[#This Row],[Urban Sprawl]]-Tabelle2[[#This Row],[Business as usual]])>=Tabelle2[[#This Row],[q-Wert (Indifferenz)]]),((ABS(Tabelle2[[#This Row],[Urban Sprawl]]-Tabelle2[[#This Row],[Business as usual]])-Tabelle2[[#This Row],[q-Wert (Indifferenz)]])/(Tabelle2[[#This Row],[p-Wert (Präferenz)]]-Tabelle2[[#This Row],[q-Wert (Indifferenz)]])))))))","v":0},null,{"$f":"IF(Tabelle2[[#This Row],[min/max]]=\"min\",-1*IF(Tabelle2[[#This Row],[Business as usual]]-Tabelle2[[#This Row],[Smart City]]<0,-1*IF(ABS(Tabelle2[[#This Row],[Business as usual]]-Tabelle2[[#This Row],[Smart City]])<Tabelle2[[#This Row],[q-Wert (Indifferenz)]], 0,IF(ABS(Tabelle2[[#This Row],[Business as usual]]-Tabelle2[[#This Row],[Smart City]])>Tabelle2[[#This Row],[p-Wert (Präferenz)]],1,IF(AND(ABS(Tabelle2[[#This Row],[Business as usual]]-Tabelle2[[#This Row],[Smart City]])<=Tabelle2[[#This Row],[p-Wert (Präferenz)]],ABS(Tabelle2[[#This Row],[Business as usual]]-Tabelle2[[#This Row],[Smart City]])>=Tabelle2[[#This Row],[q-Wert (Indifferenz)]]),((ABS(Tabelle2[[#This Row],[Business as usual]]-Tabelle2[[#This Row],[Smart City]])-Tabelle2[[#This Row],[q-Wert (Indifferenz)]])/(Tabelle2[[#This Row],[p-Wert (Präferenz)]]-Tabelle2[[#This Row],[q-Wert (Indifferenz)]]))))),IF(ABS(Tabelle2[[#This Row],[Business as usual]]-Tabelle2[[#This Row],[Smart City]])<Tabelle2[[#This Row],[q-Wert (Indifferenz)]], 0,IF(ABS(Tabelle2[[#This Row],[Business as usual]]-Tabelle2[[#This Row],[Smart City]])>Tabelle2[[#This Row],[p-Wert (Präferenz)]],1,IF(AND(ABS(Tabelle2[[#This Row],[Business as usual]]-Tabelle2[[#This Row],[Smart City]])<=Tabelle2[[#This Row],[p-Wert (Präferenz)]],ABS(Tabelle2[[#This Row],[Business as usual]]-Tabelle2[[#This Row],[Smart City]])>=Tabelle2[[#This Row],[q-Wert (Indifferenz)]]),((ABS(Tabelle2[[#This Row],[Business as usual]]-Tabelle2[[#This Row],[Smart City]])-Tabelle2[[#This Row],[q-Wert (Indifferenz)]])/(Tabelle2[[#This Row],[p-Wert (Präferenz)]]-Tabelle2[[#This Row],[q-Wert (Indifferenz)]])))))),IF(Tabelle2[[#This Row],[Business as usual]]-Tabelle2[[#This Row],[Smart City]]<0,-1*IF(ABS(Tabelle2[[#This Row],[Business as usual]]-Tabelle2[[#This Row],[Smart City]])<Tabelle2[[#This Row],[q-Wert (Indifferenz)]], 0,IF(ABS(Tabelle2[[#This Row],[Business as usual]]-Tabelle2[[#This Row],[Smart City]])>Tabelle2[[#This Row],[p-Wert (Präferenz)]],1,IF(AND(ABS(Tabelle2[[#This Row],[Business as usual]]-Tabelle2[[#This Row],[Smart City]])<=Tabelle2[[#This Row],[p-Wert (Präferenz)]],ABS(Tabelle2[[#This Row],[Business as usual]]-Tabelle2[[#This Row],[Smart City]])>=Tabelle2[[#This Row],[q-Wert (Indifferenz)]]),((ABS(Tabelle2[[#This Row],[Business as usual]]-Tabelle2[[#This Row],[Smart City]])-Tabelle2[[#This Row],[q-Wert (Indifferenz)]])/(Tabelle2[[#This Row],[p-Wert (Präferenz)]]-Tabelle2[[#This Row],[q-Wert (Indifferenz)]]))))),IF(ABS(Tabelle2[[#This Row],[Business as usual]]-Tabelle2[[#This Row],[Smart City]])<Tabelle2[[#This Row],[q-Wert (Indifferenz)]], 0,IF(ABS(Tabelle2[[#This Row],[Business as usual]]-Tabelle2[[#This Row],[Smart City]])>Tabelle2[[#This Row],[p-Wert (Präferenz)]],1,IF(AND(ABS(Tabelle2[[#This Row],[Business as usual]]-Tabelle2[[#This Row],[Smart City]])<=Tabelle2[[#This Row],[p-Wert (Präferenz)]],ABS(Tabelle2[[#This Row],[Business as usual]]-Tabelle2[[#This Row],[Smart City]])>=Tabelle2[[#This Row],[q-Wert (Indifferenz)]]),((ABS(Tabelle2[[#This Row],[Business as usual]]-Tabelle2[[#This Row],[Smart City]])-Tabelle2[[#This Row],[q-Wert (Indifferenz)]])/(Tabelle2[[#This Row],[p-Wert (Präferenz)]]-Tabelle2[[#This Row],[q-Wert (Indifferenz)]])))))))","v":-0.66666666666666663},{"$f":"IF(Tabelle2[[#This Row],[min/max]]=\"min\",-1*IF(Tabelle2[[#This Row],[Business as usual]]-Tabelle2[[#This Row],[Healthy City]]<0,-1*IF(ABS(Tabelle2[[#This Row],[Business as usual]]-Tabelle2[[#This Row],[Healthy City]])<Tabelle2[[#This Row],[q-Wert (Indifferenz)]], 0,IF(ABS(Tabelle2[[#This Row],[Business as usual]]-Tabelle2[[#This Row],[Healthy City]])>Tabelle2[[#This Row],[p-Wert (Präferenz)]],1,IF(AND(ABS(Tabelle2[[#This Row],[Business as usual]]-Tabelle2[[#This Row],[Healthy City]])<=Tabelle2[[#This Row],[p-Wert (Präferenz)]],ABS(Tabelle2[[#This Row],[Business as usual]]-Tabelle2[[#This Row],[Healthy City]])>=Tabelle2[[#This Row],[q-Wert (Indifferenz)]]),((ABS(Tabelle2[[#This Row],[Business as usual]]-Tabelle2[[#This Row],[Healthy City]])-Tabelle2[[#This Row],[q-Wert (Indifferenz)]])/(Tabelle2[[#This Row],[p-Wert (Präferenz)]]-Tabelle2[[#This Row],[q-Wert (Indifferenz)]]))))),IF(ABS(Tabelle2[[#This Row],[Business as usual]]-Tabelle2[[#This Row],[Healthy City]])<Tabelle2[[#This Row],[q-Wert (Indifferenz)]], 0,IF(ABS(Tabelle2[[#This Row],[Business as usual]]-Tabelle2[[#This Row],[Healthy City]])>Tabelle2[[#This Row],[p-Wert (Präferenz)]],1,IF(AND(ABS(Tabelle2[[#This Row],[Business as usual]]-Tabelle2[[#This Row],[Healthy City]])<=Tabelle2[[#This Row],[p-Wert (Präferenz)]],ABS(Tabelle2[[#This Row],[Business as usual]]-Tabelle2[[#This Row],[Healthy City]])>=Tabelle2[[#This Row],[q-Wert (Indifferenz)]]),((ABS(Tabelle2[[#This Row],[Business as usual]]-Tabelle2[[#This Row],[Healthy City]])-Tabelle2[[#This Row],[q-Wert (Indifferenz)]])/(Tabelle2[[#This Row],[p-Wert (Präferenz)]]-Tabelle2[[#This Row],[q-Wert (Indifferenz)]])))))),IF(Tabelle2[[#This Row],[Business as usual]]-Tabelle2[[#This Row],[Healthy City]]<0,-1*IF(ABS(Tabelle2[[#This Row],[Business as usual]]-Tabelle2[[#This Row],[Healthy City]])<Tabelle2[[#This Row],[q-Wert (Indifferenz)]], 0,IF(ABS(Tabelle2[[#This Row],[Business as usual]]-Tabelle2[[#This Row],[Healthy City]])>Tabelle2[[#This Row],[p-Wert (Präferenz)]],1,IF(AND(ABS(Tabelle2[[#This Row],[Business as usual]]-Tabelle2[[#This Row],[Healthy City]])<=Tabelle2[[#This Row],[p-Wert (Präferenz)]],ABS(Tabelle2[[#This Row],[Business as usual]]-Tabelle2[[#This Row],[Healthy City]])>=Tabelle2[[#This Row],[q-Wert (Indifferenz)]]),((ABS(Tabelle2[[#This Row],[Business as usual]]-Tabelle2[[#This Row],[Healthy City]])-Tabelle2[[#This Row],[q-Wert (Indifferenz)]])/(Tabelle2[[#This Row],[p-Wert (Präferenz)]]-Tabelle2[[#This Row],[q-Wert (Indifferenz)]]))))),IF(ABS(Tabelle2[[#This Row],[Business as usual]]-Tabelle2[[#This Row],[Healthy City]])<Tabelle2[[#This Row],[q-Wert (Indifferenz)]], 0,IF(ABS(Tabelle2[[#This Row],[Business as usual]]-Tabelle2[[#This Row],[Healthy City]])>Tabelle2[[#This Row],[p-Wert (Präferenz)]],1,IF(AND(ABS(Tabelle2[[#This Row],[Business as usual]]-Tabelle2[[#This Row],[Healthy City]])<=Tabelle2[[#This Row],[p-Wert (Präferenz)]],ABS(Tabelle2[[#This Row],[Business as usual]]-Tabelle2[[#This Row],[Healthy City]])>=Tabelle2[[#This Row],[q-Wert (Indifferenz)]]),((ABS(Tabelle2[[#This Row],[Business as usual]]-Tabelle2[[#This Row],[Healthy City]])-Tabelle2[[#This Row],[q-Wert (Indifferenz)]])/(Tabelle2[[#This Row],[p-Wert (Präferenz)]]-Tabelle2[[#This Row],[q-Wert (Indifferenz)]])))))))","v":-0.66666666666666663},{"$f":"IF(Tabelle2[[#This Row],[min/max]]=\"min\",-1*IF(Tabelle2[[#This Row],[Business as usual]]-Tabelle2[[#This Row],[Urban Sprawl]]<0,-1*IF(ABS(Tabelle2[[#This Row],[Business as usual]]-Tabelle2[[#This Row],[Urban Sprawl]])<Tabelle2[[#This Row],[q-Wert (Indifferenz)]], 0,IF(ABS(Tabelle2[[#This Row],[Business as usual]]-Tabelle2[[#This Row],[Urban Sprawl]])>Tabelle2[[#This Row],[p-Wert (Präferenz)]],1,IF(AND(ABS(Tabelle2[[#This Row],[Business as usual]]-Tabelle2[[#This Row],[Urban Sprawl]])<=Tabelle2[[#This Row],[p-Wert (Präferenz)]],ABS(Tabelle2[[#This Row],[Business as usual]]-Tabelle2[[#This Row],[Urban Sprawl]])>=Tabelle2[[#This Row],[q-Wert (Indifferenz)]]),((ABS(Tabelle2[[#This Row],[Business as usual]]-Tabelle2[[#This Row],[Urban Sprawl]])-Tabelle2[[#This Row],[q-Wert (Indifferenz)]])/(Tabelle2[[#This Row],[p-Wert (Präferenz)]]-Tabelle2[[#This Row],[q-Wert (Indifferenz)]]))))),IF(ABS(Tabelle2[[#This Row],[Business as usual]]-Tabelle2[[#This Row],[Urban Sprawl]])<Tabelle2[[#This Row],[q-Wert (Indifferenz)]], 0,IF(ABS(Tabelle2[[#This Row],[Business as usual]]-Tabelle2[[#This Row],[Urban Sprawl]])>Tabelle2[[#This Row],[p-Wert (Präferenz)]],1,IF(AND(ABS(Tabelle2[[#This Row],[Business as usual]]-Tabelle2[[#This Row],[Urban Sprawl]])<=Tabelle2[[#This Row],[p-Wert (Präferenz)]],ABS(Tabelle2[[#This Row],[Business as usual]]-Tabelle2[[#This Row],[Urban Sprawl]])>=Tabelle2[[#This Row],[q-Wert (Indifferenz)]]),((ABS(Tabelle2[[#This Row],[Business as usual]]-Tabelle2[[#This Row],[Urban Sprawl]])-Tabelle2[[#This Row],[q-Wert (Indifferenz)]])/(Tabelle2[[#This Row],[p-Wert (Präferenz)]]-Tabelle2[[#This Row],[q-Wert (Indifferenz)]])))))),IF(Tabelle2[[#This Row],[Business as usual]]-Tabelle2[[#This Row],[Urban Sprawl]]<0,-1*IF(ABS(Tabelle2[[#This Row],[Business as usual]]-Tabelle2[[#This Row],[Urban Sprawl]])<Tabelle2[[#This Row],[q-Wert (Indifferenz)]], 0,IF(ABS(Tabelle2[[#This Row],[Business as usual]]-Tabelle2[[#This Row],[Urban Sprawl]])>Tabelle2[[#This Row],[p-Wert (Präferenz)]],1,IF(AND(ABS(Tabelle2[[#This Row],[Business as usual]]-Tabelle2[[#This Row],[Urban Sprawl]])<=Tabelle2[[#This Row],[p-Wert (Präferenz)]],ABS(Tabelle2[[#This Row],[Business as usual]]-Tabelle2[[#This Row],[Urban Sprawl]])>=Tabelle2[[#This Row],[q-Wert (Indifferenz)]]),((ABS(Tabelle2[[#This Row],[Business as usual]]-Tabelle2[[#This Row],[Urban Sprawl]])-Tabelle2[[#This Row],[q-Wert (Indifferenz)]])/(Tabelle2[[#This Row],[p-Wert (Präferenz)]]-Tabelle2[[#This Row],[q-Wert (Indifferenz)]]))))),IF(ABS(Tabelle2[[#This Row],[Business as usual]]-Tabelle2[[#This Row],[Urban Sprawl]])<Tabelle2[[#This Row],[q-Wert (Indifferenz)]], 0,IF(ABS(Tabelle2[[#This Row],[Business as usual]]-Tabelle2[[#This Row],[Urban Sprawl]])>Tabelle2[[#This Row],[p-Wert (Präferenz)]],1,IF(AND(ABS(Tabelle2[[#This Row],[Business as usual]]-Tabelle2[[#This Row],[Urban Sprawl]])<=Tabelle2[[#This Row],[p-Wert (Präferenz)]],ABS(Tabelle2[[#This Row],[Business as usual]]-Tabelle2[[#This Row],[Urban Sprawl]])>=Tabelle2[[#This Row],[q-Wert (Indifferenz)]]),((ABS(Tabelle2[[#This Row],[Business as usual]]-Tabelle2[[#This Row],[Urban Sprawl]])-Tabelle2[[#This Row],[q-Wert (Indifferenz)]])/(Tabelle2[[#This Row],[p-Wert (Präferenz)]]-Tabelle2[[#This Row],[q-Wert (Indifferenz)]])))))))","v":0}]
[null,null,null,"Qualität ÖPNV",{"$f":"('\"Walking Weights\"'!D9)/100","v":5.5555555555555552E-2},"max","Subjektiver Faktor",9,10,9,4,"Typ 5",2,5,{"$f":"IF(Tabelle2[[#This Row],[min/max]]=\"min\",-1*IF(Tabelle2[[#This Row],[Smart City]]-Tabelle2[[#This Row],[Healthy City]]<0,-1*IF(ABS(Tabelle2[[#This Row],[Smart City]]-Tabelle2[[#This Row],[Healthy City]])<Tabelle2[[#This Row],[q-Wert (Indifferenz)]], 0,IF(ABS(Tabelle2[[#This Row],[Smart City]]-Tabelle2[[#This Row],[Healthy City]])>Tabelle2[[#This Row],[p-Wert (Präferenz)]],1,IF(AND(ABS(Tabelle2[[#This Row],[Smart City]]-Tabelle2[[#This Row],[Healthy City]])<=Tabelle2[[#This Row],[p-Wert (Präferenz)]],ABS(Tabelle2[[#This Row],[Smart City]]-Tabelle2[[#This Row],[Healthy City]])>=Tabelle2[[#This Row],[q-Wert (Indifferenz)]]),((ABS(Tabelle2[[#This Row],[Smart City]]-Tabelle2[[#This Row],[Healthy City]])-Tabelle2[[#This Row],[q-Wert (Indifferenz)]])/(Tabelle2[[#This Row],[p-Wert (Präferenz)]]-Tabelle2[[#This Row],[q-Wert (Indifferenz)]]))))),IF(ABS(Tabelle2[[#This Row],[Smart City]]-Tabelle2[[#This Row],[Healthy City]])<Tabelle2[[#This Row],[q-Wert (Indifferenz)]], 0,IF(ABS(Tabelle2[[#This Row],[Smart City]]-Tabelle2[[#This Row],[Healthy City]])>Tabelle2[[#This Row],[p-Wert (Präferenz)]],1,IF(AND(ABS(Tabelle2[[#This Row],[Smart City]]-Tabelle2[[#This Row],[Healthy City]])<=Tabelle2[[#This Row],[p-Wert (Präferenz)]],ABS(Tabelle2[[#This Row],[Smart City]]-Tabelle2[[#This Row],[Healthy City]])>=Tabelle2[[#This Row],[q-Wert (Indifferenz)]]),((ABS(Tabelle2[[#This Row],[Smart City]]-Tabelle2[[#This Row],[Healthy City]])-Tabelle2[[#This Row],[q-Wert (Indifferenz)]])/(Tabelle2[[#This Row],[p-Wert (Präferenz)]]-Tabelle2[[#This Row],[q-Wert (Indifferenz)]])))))),IF(Tabelle2[[#This Row],[Smart City]]-Tabelle2[[#This Row],[Healthy City]]<0,-1*IF(ABS(Tabelle2[[#This Row],[Smart City]]-Tabelle2[[#This Row],[Healthy City]])<Tabelle2[[#This Row],[q-Wert (Indifferenz)]], 0,IF(ABS(Tabelle2[[#This Row],[Smart City]]-Tabelle2[[#This Row],[Healthy City]])>Tabelle2[[#This Row],[p-Wert (Präferenz)]],1,IF(AND(ABS(Tabelle2[[#This Row],[Smart City]]-Tabelle2[[#This Row],[Healthy City]])<=Tabelle2[[#This Row],[p-Wert (Präferenz)]],ABS(Tabelle2[[#This Row],[Smart City]]-Tabelle2[[#This Row],[Healthy City]])>=Tabelle2[[#This Row],[q-Wert (Indifferenz)]]),((ABS(Tabelle2[[#This Row],[Smart City]]-Tabelle2[[#This Row],[Healthy City]])-Tabelle2[[#This Row],[q-Wert (Indifferenz)]])/(Tabelle2[[#This Row],[p-Wert (Präferenz)]]-Tabelle2[[#This Row],[q-Wert (Indifferenz)]]))))),IF(ABS(Tabelle2[[#This Row],[Smart City]]-Tabelle2[[#This Row],[Healthy City]])<Tabelle2[[#This Row],[q-Wert (Indifferenz)]], 0,IF(ABS(Tabelle2[[#This Row],[Smart City]]-Tabelle2[[#This Row],[Healthy City]])>Tabelle2[[#This Row],[p-Wert (Präferenz)]],1,IF(AND(ABS(Tabelle2[[#This Row],[Smart City]]-Tabelle2[[#This Row],[Healthy City]])<=Tabelle2[[#This Row],[p-Wert (Präferenz)]],ABS(Tabelle2[[#This Row],[Smart City]]-Tabelle2[[#This Row],[Healthy City]])>=Tabelle2[[#This Row],[q-Wert (Indifferenz)]]),((ABS(Tabelle2[[#This Row],[Smart City]]-Tabelle2[[#This Row],[Healthy City]])-Tabelle2[[#This Row],[q-Wert (Indifferenz)]])/(Tabelle2[[#This Row],[p-Wert (Präferenz)]]-Tabelle2[[#This Row],[q-Wert (Indifferenz)]])))))))","v":0},{"$f":"IF(Tabelle2[[#This Row],[min/max]]=\"min\",-1*IF(Tabelle2[[#This Row],[Smart City]]-Tabelle2[[#This Row],[Urban Sprawl]]<0,-1*IF(ABS(Tabelle2[[#This Row],[Smart City]]-Tabelle2[[#This Row],[Urban Sprawl]])<Tabelle2[[#This Row],[q-Wert (Indifferenz)]], 0,IF(ABS(Tabelle2[[#This Row],[Smart City]]-Tabelle2[[#This Row],[Urban Sprawl]])>Tabelle2[[#This Row],[p-Wert (Präferenz)]],1,IF(AND(ABS(Tabelle2[[#This Row],[Smart City]]-Tabelle2[[#This Row],[Urban Sprawl]])<=Tabelle2[[#This Row],[p-Wert (Präferenz)]],ABS(Tabelle2[[#This Row],[Smart City]]-Tabelle2[[#This Row],[Urban Sprawl]])>=Tabelle2[[#This Row],[q-Wert (Indifferenz)]]),((ABS(Tabelle2[[#This Row],[Smart City]]-Tabelle2[[#This Row],[Urban Sprawl]])-Tabelle2[[#This Row],[q-Wert (Indifferenz)]])/(Tabelle2[[#This Row],[p-Wert (Präferenz)]]-Tabelle2[[#This Row],[q-Wert (Indifferenz)]]))))),IF(ABS(Tabelle2[[#This Row],[Smart City]]-Tabelle2[[#This Row],[Urban Sprawl]])<Tabelle2[[#This Row],[q-Wert (Indifferenz)]], 0,IF(ABS(Tabelle2[[#This Row],[Smart City]]-Tabelle2[[#This Row],[Urban Sprawl]])>Tabelle2[[#This Row],[p-Wert (Präferenz)]],1,IF(AND(ABS(Tabelle2[[#This Row],[Smart City]]-Tabelle2[[#This Row],[Urban Sprawl]])<=Tabelle2[[#This Row],[p-Wert (Präferenz)]],ABS(Tabelle2[[#This Row],[Smart City]]-Tabelle2[[#This Row],[Urban Sprawl]])>=Tabelle2[[#This Row],[q-Wert (Indifferenz)]]),((ABS(Tabelle2[[#This Row],[Smart City]]-Tabelle2[[#This Row],[Urban Sprawl]])-Tabelle2[[#This Row],[q-Wert (Indifferenz)]])/(Tabelle2[[#This Row],[p-Wert (Präferenz)]]-Tabelle2[[#This Row],[q-Wert (Indifferenz)]])))))),IF(Tabelle2[[#This Row],[Smart City]]-Tabelle2[[#This Row],[Urban Sprawl]]<0,-1*IF(ABS(Tabelle2[[#This Row],[Smart City]]-Tabelle2[[#This Row],[Urban Sprawl]])<Tabelle2[[#This Row],[q-Wert (Indifferenz)]], 0,IF(ABS(Tabelle2[[#This Row],[Smart City]]-Tabelle2[[#This Row],[Urban Sprawl]])>Tabelle2[[#This Row],[p-Wert (Präferenz)]],1,IF(AND(ABS(Tabelle2[[#This Row],[Smart City]]-Tabelle2[[#This Row],[Urban Sprawl]])<=Tabelle2[[#This Row],[p-Wert (Präferenz)]],ABS(Tabelle2[[#This Row],[Smart City]]-Tabelle2[[#This Row],[Urban Sprawl]])>=Tabelle2[[#This Row],[q-Wert (Indifferenz)]]),((ABS(Tabelle2[[#This Row],[Smart City]]-Tabelle2[[#This Row],[Urban Sprawl]])-Tabelle2[[#This Row],[q-Wert (Indifferenz)]])/(Tabelle2[[#This Row],[p-Wert (Präferenz)]]-Tabelle2[[#This Row],[q-Wert (Indifferenz)]]))))),IF(ABS(Tabelle2[[#This Row],[Smart City]]-Tabelle2[[#This Row],[Urban Sprawl]])<Tabelle2[[#This Row],[q-Wert (Indifferenz)]], 0,IF(ABS(Tabelle2[[#This Row],[Smart City]]-Tabelle2[[#This Row],[Urban Sprawl]])>Tabelle2[[#This Row],[p-Wert (Präferenz)]],1,IF(AND(ABS(Tabelle2[[#This Row],[Smart City]]-Tabelle2[[#This Row],[Urban Sprawl]])<=Tabelle2[[#This Row],[p-Wert (Präferenz)]],ABS(Tabelle2[[#This Row],[Smart City]]-Tabelle2[[#This Row],[Urban Sprawl]])>=Tabelle2[[#This Row],[q-Wert (Indifferenz)]]),((ABS(Tabelle2[[#This Row],[Smart City]]-Tabelle2[[#This Row],[Urban Sprawl]])-Tabelle2[[#This Row],[q-Wert (Indifferenz)]])/(Tabelle2[[#This Row],[p-Wert (Präferenz)]]-Tabelle2[[#This Row],[q-Wert (Indifferenz)]])))))))","v":0},{"$f":"IF(Tabelle2[[#This Row],[min/max]]=\"min\",-1*IF(Tabelle2[[#This Row],[Smart City]]-Tabelle2[[#This Row],[Business as usual]]<0,-1*IF(ABS(Tabelle2[[#This Row],[Smart City]]-Tabelle2[[#This Row],[Business as usual]])<Tabelle2[[#This Row],[q-Wert (Indifferenz)]], 0,IF(ABS(Tabelle2[[#This Row],[Smart City]]-Tabelle2[[#This Row],[Business as usual]])>Tabelle2[[#This Row],[p-Wert (Präferenz)]],1,IF(AND(ABS(Tabelle2[[#This Row],[Smart City]]-Tabelle2[[#This Row],[Business as usual]])<=Tabelle2[[#This Row],[p-Wert (Präferenz)]],ABS(Tabelle2[[#This Row],[Smart City]]-Tabelle2[[#This Row],[Business as usual]])>=Tabelle2[[#This Row],[q-Wert (Indifferenz)]]),((ABS(Tabelle2[[#This Row],[Smart City]]-Tabelle2[[#This Row],[Business as usual]])-Tabelle2[[#This Row],[q-Wert (Indifferenz)]])/(Tabelle2[[#This Row],[p-Wert (Präferenz)]]-Tabelle2[[#This Row],[q-Wert (Indifferenz)]]))))),IF(ABS(Tabelle2[[#This Row],[Smart City]]-Tabelle2[[#This Row],[Business as usual]])<Tabelle2[[#This Row],[q-Wert (Indifferenz)]], 0,IF(ABS(Tabelle2[[#This Row],[Smart City]]-Tabelle2[[#This Row],[Business as usual]])>Tabelle2[[#This Row],[p-Wert (Präferenz)]],1,IF(AND(ABS(Tabelle2[[#This Row],[Smart City]]-Tabelle2[[#This Row],[Business as usual]])<=Tabelle2[[#This Row],[p-Wert (Präferenz)]],ABS(Tabelle2[[#This Row],[Smart City]]-Tabelle2[[#This Row],[Business as usual]])>=Tabelle2[[#This Row],[q-Wert (Indifferenz)]]),((ABS(Tabelle2[[#This Row],[Smart City]]-Tabelle2[[#This Row],[Business as usual]])-Tabelle2[[#This Row],[q-Wert (Indifferenz)]])/(Tabelle2[[#This Row],[p-Wert (Präferenz)]]-Tabelle2[[#This Row],[q-Wert (Indifferenz)]])))))),IF(Tabelle2[[#This Row],[Smart City]]-Tabelle2[[#This Row],[Business as usual]]<0,-1*IF(ABS(Tabelle2[[#This Row],[Smart City]]-Tabelle2[[#This Row],[Business as usual]])<Tabelle2[[#This Row],[q-Wert (Indifferenz)]], 0,IF(ABS(Tabelle2[[#This Row],[Smart City]]-Tabelle2[[#This Row],[Business as usual]])>Tabelle2[[#This Row],[p-Wert (Präferenz)]],1,IF(AND(ABS(Tabelle2[[#This Row],[Smart City]]-Tabelle2[[#This Row],[Business as usual]])<=Tabelle2[[#This Row],[p-Wert (Präferenz)]],ABS(Tabelle2[[#This Row],[Smart City]]-Tabelle2[[#This Row],[Business as usual]])>=Tabelle2[[#This Row],[q-Wert (Indifferenz)]]),((ABS(Tabelle2[[#This Row],[Smart City]]-Tabelle2[[#This Row],[Business as usual]])-Tabelle2[[#This Row],[q-Wert (Indifferenz)]])/(Tabelle2[[#This Row],[p-Wert (Präferenz)]]-Tabelle2[[#This Row],[q-Wert (Indifferenz)]]))))),IF(ABS(Tabelle2[[#This Row],[Smart City]]-Tabelle2[[#This Row],[Business as usual]])<Tabelle2[[#This Row],[q-Wert (Indifferenz)]], 0,IF(ABS(Tabelle2[[#This Row],[Smart City]]-Tabelle2[[#This Row],[Business as usual]])>Tabelle2[[#This Row],[p-Wert (Präferenz)]],1,IF(AND(ABS(Tabelle2[[#This Row],[Smart City]]-Tabelle2[[#This Row],[Business as usual]])<=Tabelle2[[#This Row],[p-Wert (Präferenz)]],ABS(Tabelle2[[#This Row],[Smart City]]-Tabelle2[[#This Row],[Business as usual]])>=Tabelle2[[#This Row],[q-Wert (Indifferenz)]]),((ABS(Tabelle2[[#This Row],[Smart City]]-Tabelle2[[#This Row],[Business as usual]])-Tabelle2[[#This Row],[q-Wert (Indifferenz)]])/(Tabelle2[[#This Row],[p-Wert (Präferenz)]]-Tabelle2[[#This Row],[q-Wert (Indifferenz)]])))))))","v":1},null,{"$f":"IF(Tabelle2[[#This Row],[min/max]]=\"min\",-1*IF(Tabelle2[[#This Row],[Healthy City]]-Tabelle2[[#This Row],[Smart City]]<0,-1*IF(ABS(Tabelle2[[#This Row],[Healthy City]]-Tabelle2[[#This Row],[Smart City]])<Tabelle2[[#This Row],[q-Wert (Indifferenz)]], 0,IF(ABS(Tabelle2[[#This Row],[Healthy City]]-Tabelle2[[#This Row],[Smart City]])>Tabelle2[[#This Row],[p-Wert (Präferenz)]],1,IF(AND(ABS(Tabelle2[[#This Row],[Healthy City]]-Tabelle2[[#This Row],[Smart City]])<=Tabelle2[[#This Row],[p-Wert (Präferenz)]],ABS(Tabelle2[[#This Row],[Healthy City]]-Tabelle2[[#This Row],[Smart City]])>=Tabelle2[[#This Row],[q-Wert (Indifferenz)]]),((ABS(Tabelle2[[#This Row],[Healthy City]]-Tabelle2[[#This Row],[Smart City]])-Tabelle2[[#This Row],[q-Wert (Indifferenz)]])/(Tabelle2[[#This Row],[p-Wert (Präferenz)]]-Tabelle2[[#This Row],[q-Wert (Indifferenz)]]))))),IF(ABS(Tabelle2[[#This Row],[Healthy City]]-Tabelle2[[#This Row],[Smart City]])<Tabelle2[[#This Row],[q-Wert (Indifferenz)]], 0,IF(ABS(Tabelle2[[#This Row],[Healthy City]]-Tabelle2[[#This Row],[Smart City]])>Tabelle2[[#This Row],[p-Wert (Präferenz)]],1,IF(AND(ABS(Tabelle2[[#This Row],[Healthy City]]-Tabelle2[[#This Row],[Smart City]])<=Tabelle2[[#This Row],[p-Wert (Präferenz)]],ABS(Tabelle2[[#This Row],[Healthy City]]-Tabelle2[[#This Row],[Smart City]])>=Tabelle2[[#This Row],[q-Wert (Indifferenz)]]),((ABS(Tabelle2[[#This Row],[Healthy City]]-Tabelle2[[#This Row],[Smart City]])-Tabelle2[[#This Row],[q-Wert (Indifferenz)]])/(Tabelle2[[#This Row],[p-Wert (Präferenz)]]-Tabelle2[[#This Row],[q-Wert (Indifferenz)]])))))),IF(Tabelle2[[#This Row],[Healthy City]]-Tabelle2[[#This Row],[Smart City]]<0,-1*IF(ABS(Tabelle2[[#This Row],[Healthy City]]-Tabelle2[[#This Row],[Smart City]])<Tabelle2[[#This Row],[q-Wert (Indifferenz)]], 0,IF(ABS(Tabelle2[[#This Row],[Healthy City]]-Tabelle2[[#This Row],[Smart City]])>Tabelle2[[#This Row],[p-Wert (Präferenz)]],1,IF(AND(ABS(Tabelle2[[#This Row],[Healthy City]]-Tabelle2[[#This Row],[Smart City]])<=Tabelle2[[#This Row],[p-Wert (Präferenz)]],ABS(Tabelle2[[#This Row],[Healthy City]]-Tabelle2[[#This Row],[Smart City]])>=Tabelle2[[#This Row],[q-Wert (Indifferenz)]]),((ABS(Tabelle2[[#This Row],[Healthy City]]-Tabelle2[[#This Row],[Smart City]])-Tabelle2[[#This Row],[q-Wert (Indifferenz)]])/(Tabelle2[[#This Row],[p-Wert (Präferenz)]]-Tabelle2[[#This Row],[q-Wert (Indifferenz)]]))))),IF(ABS(Tabelle2[[#This Row],[Healthy City]]-Tabelle2[[#This Row],[Smart City]])<Tabelle2[[#This Row],[q-Wert (Indifferenz)]], 0,IF(ABS(Tabelle2[[#This Row],[Healthy City]]-Tabelle2[[#This Row],[Smart City]])>Tabelle2[[#This Row],[p-Wert (Präferenz)]],1,IF(AND(ABS(Tabelle2[[#This Row],[Healthy City]]-Tabelle2[[#This Row],[Smart City]])<=Tabelle2[[#This Row],[p-Wert (Präferenz)]],ABS(Tabelle2[[#This Row],[Healthy City]]-Tabelle2[[#This Row],[Smart City]])>=Tabelle2[[#This Row],[q-Wert (Indifferenz)]]),((ABS(Tabelle2[[#This Row],[Healthy City]]-Tabelle2[[#This Row],[Smart City]])-Tabelle2[[#This Row],[q-Wert (Indifferenz)]])/(Tabelle2[[#This Row],[p-Wert (Präferenz)]]-Tabelle2[[#This Row],[q-Wert (Indifferenz)]])))))))","v":0},{"$f":"IF(Tabelle2[[#This Row],[min/max]]=\"min\",-1*IF(Tabelle2[[#This Row],[Healthy City]]-Tabelle2[[#This Row],[Urban Sprawl]]<0,-1*IF(ABS(Tabelle2[[#This Row],[Healthy City]]-Tabelle2[[#This Row],[Urban Sprawl]])<Tabelle2[[#This Row],[q-Wert (Indifferenz)]], 0,IF(ABS(Tabelle2[[#This Row],[Healthy City]]-Tabelle2[[#This Row],[Urban Sprawl]])>Tabelle2[[#This Row],[p-Wert (Präferenz)]],1,IF(AND(ABS(Tabelle2[[#This Row],[Healthy City]]-Tabelle2[[#This Row],[Urban Sprawl]])<=Tabelle2[[#This Row],[p-Wert (Präferenz)]],ABS(Tabelle2[[#This Row],[Healthy City]]-Tabelle2[[#This Row],[Urban Sprawl]])>=Tabelle2[[#This Row],[q-Wert (Indifferenz)]]),((ABS(Tabelle2[[#This Row],[Healthy City]]-Tabelle2[[#This Row],[Urban Sprawl]])-Tabelle2[[#This Row],[q-Wert (Indifferenz)]])/(Tabelle2[[#This Row],[p-Wert (Präferenz)]]-Tabelle2[[#This Row],[q-Wert (Indifferenz)]]))))),IF(ABS(Tabelle2[[#This Row],[Healthy City]]-Tabelle2[[#This Row],[Urban Sprawl]])<Tabelle2[[#This Row],[q-Wert (Indifferenz)]], 0,IF(ABS(Tabelle2[[#This Row],[Healthy City]]-Tabelle2[[#This Row],[Urban Sprawl]])>Tabelle2[[#This Row],[p-Wert (Präferenz)]],1,IF(AND(ABS(Tabelle2[[#This Row],[Healthy City]]-Tabelle2[[#This Row],[Urban Sprawl]])<=Tabelle2[[#This Row],[p-Wert (Präferenz)]],ABS(Tabelle2[[#This Row],[Healthy City]]-Tabelle2[[#This Row],[Urban Sprawl]])>=Tabelle2[[#This Row],[q-Wert (Indifferenz)]]),((ABS(Tabelle2[[#This Row],[Healthy City]]-Tabelle2[[#This Row],[Urban Sprawl]])-Tabelle2[[#This Row],[q-Wert (Indifferenz)]])/(Tabelle2[[#This Row],[p-Wert (Präferenz)]]-Tabelle2[[#This Row],[q-Wert (Indifferenz)]])))))),IF(Tabelle2[[#This Row],[Healthy City]]-Tabelle2[[#This Row],[Urban Sprawl]]<0,-1*IF(ABS(Tabelle2[[#This Row],[Healthy City]]-Tabelle2[[#This Row],[Urban Sprawl]])<Tabelle2[[#This Row],[q-Wert (Indifferenz)]], 0,IF(ABS(Tabelle2[[#This Row],[Healthy City]]-Tabelle2[[#This Row],[Urban Sprawl]])>Tabelle2[[#This Row],[p-Wert (Präferenz)]],1,IF(AND(ABS(Tabelle2[[#This Row],[Healthy City]]-Tabelle2[[#This Row],[Urban Sprawl]])<=Tabelle2[[#This Row],[p-Wert (Präferenz)]],ABS(Tabelle2[[#This Row],[Healthy City]]-Tabelle2[[#This Row],[Urban Sprawl]])>=Tabelle2[[#This Row],[q-Wert (Indifferenz)]]),((ABS(Tabelle2[[#This Row],[Healthy City]]-Tabelle2[[#This Row],[Urban Sprawl]])-Tabelle2[[#This Row],[q-Wert (Indifferenz)]])/(Tabelle2[[#This Row],[p-Wert (Präferenz)]]-Tabelle2[[#This Row],[q-Wert (Indifferenz)]]))))),IF(ABS(Tabelle2[[#This Row],[Healthy City]]-Tabelle2[[#This Row],[Urban Sprawl]])<Tabelle2[[#This Row],[q-Wert (Indifferenz)]], 0,IF(ABS(Tabelle2[[#This Row],[Healthy City]]-Tabelle2[[#This Row],[Urban Sprawl]])>Tabelle2[[#This Row],[p-Wert (Präferenz)]],1,IF(AND(ABS(Tabelle2[[#This Row],[Healthy City]]-Tabelle2[[#This Row],[Urban Sprawl]])<=Tabelle2[[#This Row],[p-Wert (Präferenz)]],ABS(Tabelle2[[#This Row],[Healthy City]]-Tabelle2[[#This Row],[Urban Sprawl]])>=Tabelle2[[#This Row],[q-Wert (Indifferenz)]]),((ABS(Tabelle2[[#This Row],[Healthy City]]-Tabelle2[[#This Row],[Urban Sprawl]])-Tabelle2[[#This Row],[q-Wert (Indifferenz)]])/(Tabelle2[[#This Row],[p-Wert (Präferenz)]]-Tabelle2[[#This Row],[q-Wert (Indifferenz)]])))))))","v":0},{"$f":"IF(Tabelle2[[#This Row],[min/max]]=\"min\",-1*IF(Tabelle2[[#This Row],[Healthy City]]-Tabelle2[[#This Row],[Business as usual]]<0,-1*IF(ABS(Tabelle2[[#This Row],[Healthy City]]-Tabelle2[[#This Row],[Business as usual]])<Tabelle2[[#This Row],[q-Wert (Indifferenz)]], 0,IF(ABS(Tabelle2[[#This Row],[Healthy City]]-Tabelle2[[#This Row],[Business as usual]])>Tabelle2[[#This Row],[p-Wert (Präferenz)]],1,IF(AND(ABS(Tabelle2[[#This Row],[Healthy City]]-Tabelle2[[#This Row],[Business as usual]])<=Tabelle2[[#This Row],[p-Wert (Präferenz)]],ABS(Tabelle2[[#This Row],[Healthy City]]-Tabelle2[[#This Row],[Business as usual]])>=Tabelle2[[#This Row],[q-Wert (Indifferenz)]]),((ABS(Tabelle2[[#This Row],[Healthy City]]-Tabelle2[[#This Row],[Business as usual]])-Tabelle2[[#This Row],[q-Wert (Indifferenz)]])/(Tabelle2[[#This Row],[p-Wert (Präferenz)]]-Tabelle2[[#This Row],[q-Wert (Indifferenz)]]))))),IF(ABS(Tabelle2[[#This Row],[Healthy City]]-Tabelle2[[#This Row],[Business as usual]])<Tabelle2[[#This Row],[q-Wert (Indifferenz)]], 0,IF(ABS(Tabelle2[[#This Row],[Healthy City]]-Tabelle2[[#This Row],[Business as usual]])>Tabelle2[[#This Row],[p-Wert (Präferenz)]],1,IF(AND(ABS(Tabelle2[[#This Row],[Healthy City]]-Tabelle2[[#This Row],[Business as usual]])<=Tabelle2[[#This Row],[p-Wert (Präferenz)]],ABS(Tabelle2[[#This Row],[Healthy City]]-Tabelle2[[#This Row],[Business as usual]])>=Tabelle2[[#This Row],[q-Wert (Indifferenz)]]),((ABS(Tabelle2[[#This Row],[Healthy City]]-Tabelle2[[#This Row],[Business as usual]])-Tabelle2[[#This Row],[q-Wert (Indifferenz)]])/(Tabelle2[[#This Row],[p-Wert (Präferenz)]]-Tabelle2[[#This Row],[q-Wert (Indifferenz)]])))))),IF(Tabelle2[[#This Row],[Healthy City]]-Tabelle2[[#This Row],[Business as usual]]<0,-1*IF(ABS(Tabelle2[[#This Row],[Healthy City]]-Tabelle2[[#This Row],[Business as usual]])<Tabelle2[[#This Row],[q-Wert (Indifferenz)]], 0,IF(ABS(Tabelle2[[#This Row],[Healthy City]]-Tabelle2[[#This Row],[Business as usual]])>Tabelle2[[#This Row],[p-Wert (Präferenz)]],1,IF(AND(ABS(Tabelle2[[#This Row],[Healthy City]]-Tabelle2[[#This Row],[Business as usual]])<=Tabelle2[[#This Row],[p-Wert (Präferenz)]],ABS(Tabelle2[[#This Row],[Healthy City]]-Tabelle2[[#This Row],[Business as usual]])>=Tabelle2[[#This Row],[q-Wert (Indifferenz)]]),((ABS(Tabelle2[[#This Row],[Healthy City]]-Tabelle2[[#This Row],[Business as usual]])-Tabelle2[[#This Row],[q-Wert (Indifferenz)]])/(Tabelle2[[#This Row],[p-Wert (Präferenz)]]-Tabelle2[[#This Row],[q-Wert (Indifferenz)]]))))),IF(ABS(Tabelle2[[#This Row],[Healthy City]]-Tabelle2[[#This Row],[Business as usual]])<Tabelle2[[#This Row],[q-Wert (Indifferenz)]], 0,IF(ABS(Tabelle2[[#This Row],[Healthy City]]-Tabelle2[[#This Row],[Business as usual]])>Tabelle2[[#This Row],[p-Wert (Präferenz)]],1,IF(AND(ABS(Tabelle2[[#This Row],[Healthy City]]-Tabelle2[[#This Row],[Business as usual]])<=Tabelle2[[#This Row],[p-Wert (Präferenz)]],ABS(Tabelle2[[#This Row],[Healthy City]]-Tabelle2[[#This Row],[Business as usual]])>=Tabelle2[[#This Row],[q-Wert (Indifferenz)]]),((ABS(Tabelle2[[#This Row],[Healthy City]]-Tabelle2[[#This Row],[Business as usual]])-Tabelle2[[#This Row],[q-Wert (Indifferenz)]])/(Tabelle2[[#This Row],[p-Wert (Präferenz)]]-Tabelle2[[#This Row],[q-Wert (Indifferenz)]])))))))","v":1},null,{"$f":"IF(Tabelle2[[#This Row],[min/max]]=\"min\",-1*IF(Tabelle2[[#This Row],[Urban Sprawl]]-Tabelle2[[#This Row],[Smart City]]<0,-1*IF(ABS(Tabelle2[[#This Row],[Urban Sprawl]]-Tabelle2[[#This Row],[Smart City]])<Tabelle2[[#This Row],[q-Wert (Indifferenz)]], 0,IF(ABS(Tabelle2[[#This Row],[Urban Sprawl]]-Tabelle2[[#This Row],[Smart City]])>Tabelle2[[#This Row],[p-Wert (Präferenz)]],1,IF(AND(ABS(Tabelle2[[#This Row],[Urban Sprawl]]-Tabelle2[[#This Row],[Smart City]])<=Tabelle2[[#This Row],[p-Wert (Präferenz)]],ABS(Tabelle2[[#This Row],[Urban Sprawl]]-Tabelle2[[#This Row],[Smart City]])>=Tabelle2[[#This Row],[q-Wert (Indifferenz)]]),((ABS(Tabelle2[[#This Row],[Urban Sprawl]]-Tabelle2[[#This Row],[Smart City]])-Tabelle2[[#This Row],[q-Wert (Indifferenz)]])/(Tabelle2[[#This Row],[p-Wert (Präferenz)]]-Tabelle2[[#This Row],[q-Wert (Indifferenz)]]))))),IF(ABS(Tabelle2[[#This Row],[Urban Sprawl]]-Tabelle2[[#This Row],[Smart City]])<Tabelle2[[#This Row],[q-Wert (Indifferenz)]], 0,IF(ABS(Tabelle2[[#This Row],[Urban Sprawl]]-Tabelle2[[#This Row],[Smart City]])>Tabelle2[[#This Row],[p-Wert (Präferenz)]],1,IF(AND(ABS(Tabelle2[[#This Row],[Urban Sprawl]]-Tabelle2[[#This Row],[Smart City]])<=Tabelle2[[#This Row],[p-Wert (Präferenz)]],ABS(Tabelle2[[#This Row],[Urban Sprawl]]-Tabelle2[[#This Row],[Smart City]])>=Tabelle2[[#This Row],[q-Wert (Indifferenz)]]),((ABS(Tabelle2[[#This Row],[Urban Sprawl]]-Tabelle2[[#This Row],[Smart City]])-Tabelle2[[#This Row],[q-Wert (Indifferenz)]])/(Tabelle2[[#This Row],[p-Wert (Präferenz)]]-Tabelle2[[#This Row],[q-Wert (Indifferenz)]])))))),IF(Tabelle2[[#This Row],[Urban Sprawl]]-Tabelle2[[#This Row],[Smart City]]<0,-1*IF(ABS(Tabelle2[[#This Row],[Urban Sprawl]]-Tabelle2[[#This Row],[Smart City]])<Tabelle2[[#This Row],[q-Wert (Indifferenz)]], 0,IF(ABS(Tabelle2[[#This Row],[Urban Sprawl]]-Tabelle2[[#This Row],[Smart City]])>Tabelle2[[#This Row],[p-Wert (Präferenz)]],1,IF(AND(ABS(Tabelle2[[#This Row],[Urban Sprawl]]-Tabelle2[[#This Row],[Smart City]])<=Tabelle2[[#This Row],[p-Wert (Präferenz)]],ABS(Tabelle2[[#This Row],[Urban Sprawl]]-Tabelle2[[#This Row],[Smart City]])>=Tabelle2[[#This Row],[q-Wert (Indifferenz)]]),((ABS(Tabelle2[[#This Row],[Urban Sprawl]]-Tabelle2[[#This Row],[Smart City]])-Tabelle2[[#This Row],[q-Wert (Indifferenz)]])/(Tabelle2[[#This Row],[p-Wert (Präferenz)]]-Tabelle2[[#This Row],[q-Wert (Indifferenz)]]))))),IF(ABS(Tabelle2[[#This Row],[Urban Sprawl]]-Tabelle2[[#This Row],[Smart City]])<Tabelle2[[#This Row],[q-Wert (Indifferenz)]], 0,IF(ABS(Tabelle2[[#This Row],[Urban Sprawl]]-Tabelle2[[#This Row],[Smart City]])>Tabelle2[[#This Row],[p-Wert (Präferenz)]],1,IF(AND(ABS(Tabelle2[[#This Row],[Urban Sprawl]]-Tabelle2[[#This Row],[Smart City]])<=Tabelle2[[#This Row],[p-Wert (Präferenz)]],ABS(Tabelle2[[#This Row],[Urban Sprawl]]-Tabelle2[[#This Row],[Smart City]])>=Tabelle2[[#This Row],[q-Wert (Indifferenz)]]),((ABS(Tabelle2[[#This Row],[Urban Sprawl]]-Tabelle2[[#This Row],[Smart City]])-Tabelle2[[#This Row],[q-Wert (Indifferenz)]])/(Tabelle2[[#This Row],[p-Wert (Präferenz)]]-Tabelle2[[#This Row],[q-Wert (Indifferenz)]])))))))","v":0},{"$f":"IF(Tabelle2[[#This Row],[min/max]]=\"min\",-1*IF(Tabelle2[[#This Row],[Urban Sprawl]]-Tabelle2[[#This Row],[Healthy City]]<0,-1*IF(ABS(Tabelle2[[#This Row],[Urban Sprawl]]-Tabelle2[[#This Row],[Healthy City]])<Tabelle2[[#This Row],[q-Wert (Indifferenz)]], 0,IF(ABS(Tabelle2[[#This Row],[Urban Sprawl]]-Tabelle2[[#This Row],[Healthy City]])>Tabelle2[[#This Row],[p-Wert (Präferenz)]],1,IF(AND(ABS(Tabelle2[[#This Row],[Urban Sprawl]]-Tabelle2[[#This Row],[Healthy City]])<=Tabelle2[[#This Row],[p-Wert (Präferenz)]],ABS(Tabelle2[[#This Row],[Urban Sprawl]]-Tabelle2[[#This Row],[Healthy City]])>=Tabelle2[[#This Row],[q-Wert (Indifferenz)]]),((ABS(Tabelle2[[#This Row],[Urban Sprawl]]-Tabelle2[[#This Row],[Healthy City]])-Tabelle2[[#This Row],[q-Wert (Indifferenz)]])/(Tabelle2[[#This Row],[p-Wert (Präferenz)]]-Tabelle2[[#This Row],[q-Wert (Indifferenz)]]))))),IF(ABS(Tabelle2[[#This Row],[Urban Sprawl]]-Tabelle2[[#This Row],[Healthy City]])<Tabelle2[[#This Row],[q-Wert (Indifferenz)]], 0,IF(ABS(Tabelle2[[#This Row],[Urban Sprawl]]-Tabelle2[[#This Row],[Healthy City]])>Tabelle2[[#This Row],[p-Wert (Präferenz)]],1,IF(AND(ABS(Tabelle2[[#This Row],[Urban Sprawl]]-Tabelle2[[#This Row],[Healthy City]])<=Tabelle2[[#This Row],[p-Wert (Präferenz)]],ABS(Tabelle2[[#This Row],[Urban Sprawl]]-Tabelle2[[#This Row],[Healthy City]])>=Tabelle2[[#This Row],[q-Wert (Indifferenz)]]),((ABS(Tabelle2[[#This Row],[Urban Sprawl]]-Tabelle2[[#This Row],[Healthy City]])-Tabelle2[[#This Row],[q-Wert (Indifferenz)]])/(Tabelle2[[#This Row],[p-Wert (Präferenz)]]-Tabelle2[[#This Row],[q-Wert (Indifferenz)]])))))),IF(Tabelle2[[#This Row],[Urban Sprawl]]-Tabelle2[[#This Row],[Healthy City]]<0,-1*IF(ABS(Tabelle2[[#This Row],[Urban Sprawl]]-Tabelle2[[#This Row],[Healthy City]])<Tabelle2[[#This Row],[q-Wert (Indifferenz)]], 0,IF(ABS(Tabelle2[[#This Row],[Urban Sprawl]]-Tabelle2[[#This Row],[Healthy City]])>Tabelle2[[#This Row],[p-Wert (Präferenz)]],1,IF(AND(ABS(Tabelle2[[#This Row],[Urban Sprawl]]-Tabelle2[[#This Row],[Healthy City]])<=Tabelle2[[#This Row],[p-Wert (Präferenz)]],ABS(Tabelle2[[#This Row],[Urban Sprawl]]-Tabelle2[[#This Row],[Healthy City]])>=Tabelle2[[#This Row],[q-Wert (Indifferenz)]]),((ABS(Tabelle2[[#This Row],[Urban Sprawl]]-Tabelle2[[#This Row],[Healthy City]])-Tabelle2[[#This Row],[q-Wert (Indifferenz)]])/(Tabelle2[[#This Row],[p-Wert (Präferenz)]]-Tabelle2[[#This Row],[q-Wert (Indifferenz)]]))))),IF(ABS(Tabelle2[[#This Row],[Urban Sprawl]]-Tabelle2[[#This Row],[Healthy City]])<Tabelle2[[#This Row],[q-Wert (Indifferenz)]], 0,IF(ABS(Tabelle2[[#This Row],[Urban Sprawl]]-Tabelle2[[#This Row],[Healthy City]])>Tabelle2[[#This Row],[p-Wert (Präferenz)]],1,IF(AND(ABS(Tabelle2[[#This Row],[Urban Sprawl]]-Tabelle2[[#This Row],[Healthy City]])<=Tabelle2[[#This Row],[p-Wert (Präferenz)]],ABS(Tabelle2[[#This Row],[Urban Sprawl]]-Tabelle2[[#This Row],[Healthy City]])>=Tabelle2[[#This Row],[q-Wert (Indifferenz)]]),((ABS(Tabelle2[[#This Row],[Urban Sprawl]]-Tabelle2[[#This Row],[Healthy City]])-Tabelle2[[#This Row],[q-Wert (Indifferenz)]])/(Tabelle2[[#This Row],[p-Wert (Präferenz)]]-Tabelle2[[#This Row],[q-Wert (Indifferenz)]])))))))","v":0},{"$f":"IF(Tabelle2[[#This Row],[min/max]]=\"min\",-1*IF(Tabelle2[[#This Row],[Urban Sprawl]]-Tabelle2[[#This Row],[Business as usual]]<0,-1*IF(ABS(Tabelle2[[#This Row],[Urban Sprawl]]-Tabelle2[[#This Row],[Business as usual]])<Tabelle2[[#This Row],[q-Wert (Indifferenz)]], 0,IF(ABS(Tabelle2[[#This Row],[Urban Sprawl]]-Tabelle2[[#This Row],[Business as usual]])>Tabelle2[[#This Row],[p-Wert (Präferenz)]],1,IF(AND(ABS(Tabelle2[[#This Row],[Urban Sprawl]]-Tabelle2[[#This Row],[Business as usual]])<=Tabelle2[[#This Row],[p-Wert (Präferenz)]],ABS(Tabelle2[[#This Row],[Urban Sprawl]]-Tabelle2[[#This Row],[Business as usual]])>=Tabelle2[[#This Row],[q-Wert (Indifferenz)]]),((ABS(Tabelle2[[#This Row],[Urban Sprawl]]-Tabelle2[[#This Row],[Business as usual]])-Tabelle2[[#This Row],[q-Wert (Indifferenz)]])/(Tabelle2[[#This Row],[p-Wert (Präferenz)]]-Tabelle2[[#This Row],[q-Wert (Indifferenz)]]))))),IF(ABS(Tabelle2[[#This Row],[Urban Sprawl]]-Tabelle2[[#This Row],[Business as usual]])<Tabelle2[[#This Row],[q-Wert (Indifferenz)]], 0,IF(ABS(Tabelle2[[#This Row],[Urban Sprawl]]-Tabelle2[[#This Row],[Business as usual]])>Tabelle2[[#This Row],[p-Wert (Präferenz)]],1,IF(AND(ABS(Tabelle2[[#This Row],[Urban Sprawl]]-Tabelle2[[#This Row],[Business as usual]])<=Tabelle2[[#This Row],[p-Wert (Präferenz)]],ABS(Tabelle2[[#This Row],[Urban Sprawl]]-Tabelle2[[#This Row],[Business as usual]])>=Tabelle2[[#This Row],[q-Wert (Indifferenz)]]),((ABS(Tabelle2[[#This Row],[Urban Sprawl]]-Tabelle2[[#This Row],[Business as usual]])-Tabelle2[[#This Row],[q-Wert (Indifferenz)]])/(Tabelle2[[#This Row],[p-Wert (Präferenz)]]-Tabelle2[[#This Row],[q-Wert (Indifferenz)]])))))),IF(Tabelle2[[#This Row],[Urban Sprawl]]-Tabelle2[[#This Row],[Business as usual]]<0,-1*IF(ABS(Tabelle2[[#This Row],[Urban Sprawl]]-Tabelle2[[#This Row],[Business as usual]])<Tabelle2[[#This Row],[q-Wert (Indifferenz)]], 0,IF(ABS(Tabelle2[[#This Row],[Urban Sprawl]]-Tabelle2[[#This Row],[Business as usual]])>Tabelle2[[#This Row],[p-Wert (Präferenz)]],1,IF(AND(ABS(Tabelle2[[#This Row],[Urban Sprawl]]-Tabelle2[[#This Row],[Business as usual]])<=Tabelle2[[#This Row],[p-Wert (Präferenz)]],ABS(Tabelle2[[#This Row],[Urban Sprawl]]-Tabelle2[[#This Row],[Business as usual]])>=Tabelle2[[#This Row],[q-Wert (Indifferenz)]]),((ABS(Tabelle2[[#This Row],[Urban Sprawl]]-Tabelle2[[#This Row],[Business as usual]])-Tabelle2[[#This Row],[q-Wert (Indifferenz)]])/(Tabelle2[[#This Row],[p-Wert (Präferenz)]]-Tabelle2[[#This Row],[q-Wert (Indifferenz)]]))))),IF(ABS(Tabelle2[[#This Row],[Urban Sprawl]]-Tabelle2[[#This Row],[Business as usual]])<Tabelle2[[#This Row],[q-Wert (Indifferenz)]], 0,IF(ABS(Tabelle2[[#This Row],[Urban Sprawl]]-Tabelle2[[#This Row],[Business as usual]])>Tabelle2[[#This Row],[p-Wert (Präferenz)]],1,IF(AND(ABS(Tabelle2[[#This Row],[Urban Sprawl]]-Tabelle2[[#This Row],[Business as usual]])<=Tabelle2[[#This Row],[p-Wert (Präferenz)]],ABS(Tabelle2[[#This Row],[Urban Sprawl]]-Tabelle2[[#This Row],[Business as usual]])>=Tabelle2[[#This Row],[q-Wert (Indifferenz)]]),((ABS(Tabelle2[[#This Row],[Urban Sprawl]]-Tabelle2[[#This Row],[Business as usual]])-Tabelle2[[#This Row],[q-Wert (Indifferenz)]])/(Tabelle2[[#This Row],[p-Wert (Präferenz)]]-Tabelle2[[#This Row],[q-Wert (Indifferenz)]])))))))","v":1},null,{"$f":"IF(Tabelle2[[#This Row],[min/max]]=\"min\",-1*IF(Tabelle2[[#This Row],[Business as usual]]-Tabelle2[[#This Row],[Smart City]]<0,-1*IF(ABS(Tabelle2[[#This Row],[Business as usual]]-Tabelle2[[#This Row],[Smart City]])<Tabelle2[[#This Row],[q-Wert (Indifferenz)]], 0,IF(ABS(Tabelle2[[#This Row],[Business as usual]]-Tabelle2[[#This Row],[Smart City]])>Tabelle2[[#This Row],[p-Wert (Präferenz)]],1,IF(AND(ABS(Tabelle2[[#This Row],[Business as usual]]-Tabelle2[[#This Row],[Smart City]])<=Tabelle2[[#This Row],[p-Wert (Präferenz)]],ABS(Tabelle2[[#This Row],[Business as usual]]-Tabelle2[[#This Row],[Smart City]])>=Tabelle2[[#This Row],[q-Wert (Indifferenz)]]),((ABS(Tabelle2[[#This Row],[Business as usual]]-Tabelle2[[#This Row],[Smart City]])-Tabelle2[[#This Row],[q-Wert (Indifferenz)]])/(Tabelle2[[#This Row],[p-Wert (Präferenz)]]-Tabelle2[[#This Row],[q-Wert (Indifferenz)]]))))),IF(ABS(Tabelle2[[#This Row],[Business as usual]]-Tabelle2[[#This Row],[Smart City]])<Tabelle2[[#This Row],[q-Wert (Indifferenz)]], 0,IF(ABS(Tabelle2[[#This Row],[Business as usual]]-Tabelle2[[#This Row],[Smart City]])>Tabelle2[[#This Row],[p-Wert (Präferenz)]],1,IF(AND(ABS(Tabelle2[[#This Row],[Business as usual]]-Tabelle2[[#This Row],[Smart City]])<=Tabelle2[[#This Row],[p-Wert (Präferenz)]],ABS(Tabelle2[[#This Row],[Business as usual]]-Tabelle2[[#This Row],[Smart City]])>=Tabelle2[[#This Row],[q-Wert (Indifferenz)]]),((ABS(Tabelle2[[#This Row],[Business as usual]]-Tabelle2[[#This Row],[Smart City]])-Tabelle2[[#This Row],[q-Wert (Indifferenz)]])/(Tabelle2[[#This Row],[p-Wert (Präferenz)]]-Tabelle2[[#This Row],[q-Wert (Indifferenz)]])))))),IF(Tabelle2[[#This Row],[Business as usual]]-Tabelle2[[#This Row],[Smart City]]<0,-1*IF(ABS(Tabelle2[[#This Row],[Business as usual]]-Tabelle2[[#This Row],[Smart City]])<Tabelle2[[#This Row],[q-Wert (Indifferenz)]], 0,IF(ABS(Tabelle2[[#This Row],[Business as usual]]-Tabelle2[[#This Row],[Smart City]])>Tabelle2[[#This Row],[p-Wert (Präferenz)]],1,IF(AND(ABS(Tabelle2[[#This Row],[Business as usual]]-Tabelle2[[#This Row],[Smart City]])<=Tabelle2[[#This Row],[p-Wert (Präferenz)]],ABS(Tabelle2[[#This Row],[Business as usual]]-Tabelle2[[#This Row],[Smart City]])>=Tabelle2[[#This Row],[q-Wert (Indifferenz)]]),((ABS(Tabelle2[[#This Row],[Business as usual]]-Tabelle2[[#This Row],[Smart City]])-Tabelle2[[#This Row],[q-Wert (Indifferenz)]])/(Tabelle2[[#This Row],[p-Wert (Präferenz)]]-Tabelle2[[#This Row],[q-Wert (Indifferenz)]]))))),IF(ABS(Tabelle2[[#This Row],[Business as usual]]-Tabelle2[[#This Row],[Smart City]])<Tabelle2[[#This Row],[q-Wert (Indifferenz)]], 0,IF(ABS(Tabelle2[[#This Row],[Business as usual]]-Tabelle2[[#This Row],[Smart City]])>Tabelle2[[#This Row],[p-Wert (Präferenz)]],1,IF(AND(ABS(Tabelle2[[#This Row],[Business as usual]]-Tabelle2[[#This Row],[Smart City]])<=Tabelle2[[#This Row],[p-Wert (Präferenz)]],ABS(Tabelle2[[#This Row],[Business as usual]]-Tabelle2[[#This Row],[Smart City]])>=Tabelle2[[#This Row],[q-Wert (Indifferenz)]]),((ABS(Tabelle2[[#This Row],[Business as usual]]-Tabelle2[[#This Row],[Smart City]])-Tabelle2[[#This Row],[q-Wert (Indifferenz)]])/(Tabelle2[[#This Row],[p-Wert (Präferenz)]]-Tabelle2[[#This Row],[q-Wert (Indifferenz)]])))))))","v":-1},{"$f":"IF(Tabelle2[[#This Row],[min/max]]=\"min\",-1*IF(Tabelle2[[#This Row],[Business as usual]]-Tabelle2[[#This Row],[Healthy City]]<0,-1*IF(ABS(Tabelle2[[#This Row],[Business as usual]]-Tabelle2[[#This Row],[Healthy City]])<Tabelle2[[#This Row],[q-Wert (Indifferenz)]], 0,IF(ABS(Tabelle2[[#This Row],[Business as usual]]-Tabelle2[[#This Row],[Healthy City]])>Tabelle2[[#This Row],[p-Wert (Präferenz)]],1,IF(AND(ABS(Tabelle2[[#This Row],[Business as usual]]-Tabelle2[[#This Row],[Healthy City]])<=Tabelle2[[#This Row],[p-Wert (Präferenz)]],ABS(Tabelle2[[#This Row],[Business as usual]]-Tabelle2[[#This Row],[Healthy City]])>=Tabelle2[[#This Row],[q-Wert (Indifferenz)]]),((ABS(Tabelle2[[#This Row],[Business as usual]]-Tabelle2[[#This Row],[Healthy City]])-Tabelle2[[#This Row],[q-Wert (Indifferenz)]])/(Tabelle2[[#This Row],[p-Wert (Präferenz)]]-Tabelle2[[#This Row],[q-Wert (Indifferenz)]]))))),IF(ABS(Tabelle2[[#This Row],[Business as usual]]-Tabelle2[[#This Row],[Healthy City]])<Tabelle2[[#This Row],[q-Wert (Indifferenz)]], 0,IF(ABS(Tabelle2[[#This Row],[Business as usual]]-Tabelle2[[#This Row],[Healthy City]])>Tabelle2[[#This Row],[p-Wert (Präferenz)]],1,IF(AND(ABS(Tabelle2[[#This Row],[Business as usual]]-Tabelle2[[#This Row],[Healthy City]])<=Tabelle2[[#This Row],[p-Wert (Präferenz)]],ABS(Tabelle2[[#This Row],[Business as usual]]-Tabelle2[[#This Row],[Healthy City]])>=Tabelle2[[#This Row],[q-Wert (Indifferenz)]]),((ABS(Tabelle2[[#This Row],[Business as usual]]-Tabelle2[[#This Row],[Healthy City]])-Tabelle2[[#This Row],[q-Wert (Indifferenz)]])/(Tabelle2[[#This Row],[p-Wert (Präferenz)]]-Tabelle2[[#This Row],[q-Wert (Indifferenz)]])))))),IF(Tabelle2[[#This Row],[Business as usual]]-Tabelle2[[#This Row],[Healthy City]]<0,-1*IF(ABS(Tabelle2[[#This Row],[Business as usual]]-Tabelle2[[#This Row],[Healthy City]])<Tabelle2[[#This Row],[q-Wert (Indifferenz)]], 0,IF(ABS(Tabelle2[[#This Row],[Business as usual]]-Tabelle2[[#This Row],[Healthy City]])>Tabelle2[[#This Row],[p-Wert (Präferenz)]],1,IF(AND(ABS(Tabelle2[[#This Row],[Business as usual]]-Tabelle2[[#This Row],[Healthy City]])<=Tabelle2[[#This Row],[p-Wert (Präferenz)]],ABS(Tabelle2[[#This Row],[Business as usual]]-Tabelle2[[#This Row],[Healthy City]])>=Tabelle2[[#This Row],[q-Wert (Indifferenz)]]),((ABS(Tabelle2[[#This Row],[Business as usual]]-Tabelle2[[#This Row],[Healthy City]])-Tabelle2[[#This Row],[q-Wert (Indifferenz)]])/(Tabelle2[[#This Row],[p-Wert (Präferenz)]]-Tabelle2[[#This Row],[q-Wert (Indifferenz)]]))))),IF(ABS(Tabelle2[[#This Row],[Business as usual]]-Tabelle2[[#This Row],[Healthy City]])<Tabelle2[[#This Row],[q-Wert (Indifferenz)]], 0,IF(ABS(Tabelle2[[#This Row],[Business as usual]]-Tabelle2[[#This Row],[Healthy City]])>Tabelle2[[#This Row],[p-Wert (Präferenz)]],1,IF(AND(ABS(Tabelle2[[#This Row],[Business as usual]]-Tabelle2[[#This Row],[Healthy City]])<=Tabelle2[[#This Row],[p-Wert (Präferenz)]],ABS(Tabelle2[[#This Row],[Business as usual]]-Tabelle2[[#This Row],[Healthy City]])>=Tabelle2[[#This Row],[q-Wert (Indifferenz)]]),((ABS(Tabelle2[[#This Row],[Business as usual]]-Tabelle2[[#This Row],[Healthy City]])-Tabelle2[[#This Row],[q-Wert (Indifferenz)]])/(Tabelle2[[#This Row],[p-Wert (Präferenz)]]-Tabelle2[[#This Row],[q-Wert (Indifferenz)]])))))))","v":-1},{"$f":"IF(Tabelle2[[#This Row],[min/max]]=\"min\",-1*IF(Tabelle2[[#This Row],[Business as usual]]-Tabelle2[[#This Row],[Urban Sprawl]]<0,-1*IF(ABS(Tabelle2[[#This Row],[Business as usual]]-Tabelle2[[#This Row],[Urban Sprawl]])<Tabelle2[[#This Row],[q-Wert (Indifferenz)]], 0,IF(ABS(Tabelle2[[#This Row],[Business as usual]]-Tabelle2[[#This Row],[Urban Sprawl]])>Tabelle2[[#This Row],[p-Wert (Präferenz)]],1,IF(AND(ABS(Tabelle2[[#This Row],[Business as usual]]-Tabelle2[[#This Row],[Urban Sprawl]])<=Tabelle2[[#This Row],[p-Wert (Präferenz)]],ABS(Tabelle2[[#This Row],[Business as usual]]-Tabelle2[[#This Row],[Urban Sprawl]])>=Tabelle2[[#This Row],[q-Wert (Indifferenz)]]),((ABS(Tabelle2[[#This Row],[Business as usual]]-Tabelle2[[#This Row],[Urban Sprawl]])-Tabelle2[[#This Row],[q-Wert (Indifferenz)]])/(Tabelle2[[#This Row],[p-Wert (Präferenz)]]-Tabelle2[[#This Row],[q-Wert (Indifferenz)]]))))),IF(ABS(Tabelle2[[#This Row],[Business as usual]]-Tabelle2[[#This Row],[Urban Sprawl]])<Tabelle2[[#This Row],[q-Wert (Indifferenz)]], 0,IF(ABS(Tabelle2[[#This Row],[Business as usual]]-Tabelle2[[#This Row],[Urban Sprawl]])>Tabelle2[[#This Row],[p-Wert (Präferenz)]],1,IF(AND(ABS(Tabelle2[[#This Row],[Business as usual]]-Tabelle2[[#This Row],[Urban Sprawl]])<=Tabelle2[[#This Row],[p-Wert (Präferenz)]],ABS(Tabelle2[[#This Row],[Business as usual]]-Tabelle2[[#This Row],[Urban Sprawl]])>=Tabelle2[[#This Row],[q-Wert (Indifferenz)]]),((ABS(Tabelle2[[#This Row],[Business as usual]]-Tabelle2[[#This Row],[Urban Sprawl]])-Tabelle2[[#This Row],[q-Wert (Indifferenz)]])/(Tabelle2[[#This Row],[p-Wert (Präferenz)]]-Tabelle2[[#This Row],[q-Wert (Indifferenz)]])))))),IF(Tabelle2[[#This Row],[Business as usual]]-Tabelle2[[#This Row],[Urban Sprawl]]<0,-1*IF(ABS(Tabelle2[[#This Row],[Business as usual]]-Tabelle2[[#This Row],[Urban Sprawl]])<Tabelle2[[#This Row],[q-Wert (Indifferenz)]], 0,IF(ABS(Tabelle2[[#This Row],[Business as usual]]-Tabelle2[[#This Row],[Urban Sprawl]])>Tabelle2[[#This Row],[p-Wert (Präferenz)]],1,IF(AND(ABS(Tabelle2[[#This Row],[Business as usual]]-Tabelle2[[#This Row],[Urban Sprawl]])<=Tabelle2[[#This Row],[p-Wert (Präferenz)]],ABS(Tabelle2[[#This Row],[Business as usual]]-Tabelle2[[#This Row],[Urban Sprawl]])>=Tabelle2[[#This Row],[q-Wert (Indifferenz)]]),((ABS(Tabelle2[[#This Row],[Business as usual]]-Tabelle2[[#This Row],[Urban Sprawl]])-Tabelle2[[#This Row],[q-Wert (Indifferenz)]])/(Tabelle2[[#This Row],[p-Wert (Präferenz)]]-Tabelle2[[#This Row],[q-Wert (Indifferenz)]]))))),IF(ABS(Tabelle2[[#This Row],[Business as usual]]-Tabelle2[[#This Row],[Urban Sprawl]])<Tabelle2[[#This Row],[q-Wert (Indifferenz)]], 0,IF(ABS(Tabelle2[[#This Row],[Business as usual]]-Tabelle2[[#This Row],[Urban Sprawl]])>Tabelle2[[#This Row],[p-Wert (Präferenz)]],1,IF(AND(ABS(Tabelle2[[#This Row],[Business as usual]]-Tabelle2[[#This Row],[Urban Sprawl]])<=Tabelle2[[#This Row],[p-Wert (Präferenz)]],ABS(Tabelle2[[#This Row],[Business as usual]]-Tabelle2[[#This Row],[Urban Sprawl]])>=Tabelle2[[#This Row],[q-Wert (Indifferenz)]]),((ABS(Tabelle2[[#This Row],[Business as usual]]-Tabelle2[[#This Row],[Urban Sprawl]])-Tabelle2[[#This Row],[q-Wert (Indifferenz)]])/(Tabelle2[[#This Row],[p-Wert (Präferenz)]]-Tabelle2[[#This Row],[q-Wert (Indifferenz)]])))))))","v":-1}]
[null,null,null,"City Maut",{"$f":"('\"Walking Weights\"'!D10)/100","v":5.5555555555555552E-2},"max","€/Tag für Einfahrt",2.5,5,0,0,"Typ 5",1.72,4.63,{"$f":"IF(Tabelle2[[#This Row],[min/max]]=\"min\",-1*IF(Tabelle2[[#This Row],[Smart City]]-Tabelle2[[#This Row],[Healthy City]]<0,-1*IF(ABS(Tabelle2[[#This Row],[Smart City]]-Tabelle2[[#This Row],[Healthy City]])<Tabelle2[[#This Row],[q-Wert (Indifferenz)]], 0,IF(ABS(Tabelle2[[#This Row],[Smart City]]-Tabelle2[[#This Row],[Healthy City]])>Tabelle2[[#This Row],[p-Wert (Präferenz)]],1,IF(AND(ABS(Tabelle2[[#This Row],[Smart City]]-Tabelle2[[#This Row],[Healthy City]])<=Tabelle2[[#This Row],[p-Wert (Präferenz)]],ABS(Tabelle2[[#This Row],[Smart City]]-Tabelle2[[#This Row],[Healthy City]])>=Tabelle2[[#This Row],[q-Wert (Indifferenz)]]),((ABS(Tabelle2[[#This Row],[Smart City]]-Tabelle2[[#This Row],[Healthy City]])-Tabelle2[[#This Row],[q-Wert (Indifferenz)]])/(Tabelle2[[#This Row],[p-Wert (Präferenz)]]-Tabelle2[[#This Row],[q-Wert (Indifferenz)]]))))),IF(ABS(Tabelle2[[#This Row],[Smart City]]-Tabelle2[[#This Row],[Healthy City]])<Tabelle2[[#This Row],[q-Wert (Indifferenz)]], 0,IF(ABS(Tabelle2[[#This Row],[Smart City]]-Tabelle2[[#This Row],[Healthy City]])>Tabelle2[[#This Row],[p-Wert (Präferenz)]],1,IF(AND(ABS(Tabelle2[[#This Row],[Smart City]]-Tabelle2[[#This Row],[Healthy City]])<=Tabelle2[[#This Row],[p-Wert (Präferenz)]],ABS(Tabelle2[[#This Row],[Smart City]]-Tabelle2[[#This Row],[Healthy City]])>=Tabelle2[[#This Row],[q-Wert (Indifferenz)]]),((ABS(Tabelle2[[#This Row],[Smart City]]-Tabelle2[[#This Row],[Healthy City]])-Tabelle2[[#This Row],[q-Wert (Indifferenz)]])/(Tabelle2[[#This Row],[p-Wert (Präferenz)]]-Tabelle2[[#This Row],[q-Wert (Indifferenz)]])))))),IF(Tabelle2[[#This Row],[Smart City]]-Tabelle2[[#This Row],[Healthy City]]<0,-1*IF(ABS(Tabelle2[[#This Row],[Smart City]]-Tabelle2[[#This Row],[Healthy City]])<Tabelle2[[#This Row],[q-Wert (Indifferenz)]], 0,IF(ABS(Tabelle2[[#This Row],[Smart City]]-Tabelle2[[#This Row],[Healthy City]])>Tabelle2[[#This Row],[p-Wert (Präferenz)]],1,IF(AND(ABS(Tabelle2[[#This Row],[Smart City]]-Tabelle2[[#This Row],[Healthy City]])<=Tabelle2[[#This Row],[p-Wert (Präferenz)]],ABS(Tabelle2[[#This Row],[Smart City]]-Tabelle2[[#This Row],[Healthy City]])>=Tabelle2[[#This Row],[q-Wert (Indifferenz)]]),((ABS(Tabelle2[[#This Row],[Smart City]]-Tabelle2[[#This Row],[Healthy City]])-Tabelle2[[#This Row],[q-Wert (Indifferenz)]])/(Tabelle2[[#This Row],[p-Wert (Präferenz)]]-Tabelle2[[#This Row],[q-Wert (Indifferenz)]]))))),IF(ABS(Tabelle2[[#This Row],[Smart City]]-Tabelle2[[#This Row],[Healthy City]])<Tabelle2[[#This Row],[q-Wert (Indifferenz)]], 0,IF(ABS(Tabelle2[[#This Row],[Smart City]]-Tabelle2[[#This Row],[Healthy City]])>Tabelle2[[#This Row],[p-Wert (Präferenz)]],1,IF(AND(ABS(Tabelle2[[#This Row],[Smart City]]-Tabelle2[[#This Row],[Healthy City]])<=Tabelle2[[#This Row],[p-Wert (Präferenz)]],ABS(Tabelle2[[#This Row],[Smart City]]-Tabelle2[[#This Row],[Healthy City]])>=Tabelle2[[#This Row],[q-Wert (Indifferenz)]]),((ABS(Tabelle2[[#This Row],[Smart City]]-Tabelle2[[#This Row],[Healthy City]])-Tabelle2[[#This Row],[q-Wert (Indifferenz)]])/(Tabelle2[[#This Row],[p-Wert (Präferenz)]]-Tabelle2[[#This Row],[q-Wert (Indifferenz)]])))))))","v":-0.26804123711340205},{"$f":"IF(Tabelle2[[#This Row],[min/max]]=\"min\",-1*IF(Tabelle2[[#This Row],[Smart City]]-Tabelle2[[#This Row],[Urban Sprawl]]<0,-1*IF(ABS(Tabelle2[[#This Row],[Smart City]]-Tabelle2[[#This Row],[Urban Sprawl]])<Tabelle2[[#This Row],[q-Wert (Indifferenz)]], 0,IF(ABS(Tabelle2[[#This Row],[Smart City]]-Tabelle2[[#This Row],[Urban Sprawl]])>Tabelle2[[#This Row],[p-Wert (Präferenz)]],1,IF(AND(ABS(Tabelle2[[#This Row],[Smart City]]-Tabelle2[[#This Row],[Urban Sprawl]])<=Tabelle2[[#This Row],[p-Wert (Präferenz)]],ABS(Tabelle2[[#This Row],[Smart City]]-Tabelle2[[#This Row],[Urban Sprawl]])>=Tabelle2[[#This Row],[q-Wert (Indifferenz)]]),((ABS(Tabelle2[[#This Row],[Smart City]]-Tabelle2[[#This Row],[Urban Sprawl]])-Tabelle2[[#This Row],[q-Wert (Indifferenz)]])/(Tabelle2[[#This Row],[p-Wert (Präferenz)]]-Tabelle2[[#This Row],[q-Wert (Indifferenz)]]))))),IF(ABS(Tabelle2[[#This Row],[Smart City]]-Tabelle2[[#This Row],[Urban Sprawl]])<Tabelle2[[#This Row],[q-Wert (Indifferenz)]], 0,IF(ABS(Tabelle2[[#This Row],[Smart City]]-Tabelle2[[#This Row],[Urban Sprawl]])>Tabelle2[[#This Row],[p-Wert (Präferenz)]],1,IF(AND(ABS(Tabelle2[[#This Row],[Smart City]]-Tabelle2[[#This Row],[Urban Sprawl]])<=Tabelle2[[#This Row],[p-Wert (Präferenz)]],ABS(Tabelle2[[#This Row],[Smart City]]-Tabelle2[[#This Row],[Urban Sprawl]])>=Tabelle2[[#This Row],[q-Wert (Indifferenz)]]),((ABS(Tabelle2[[#This Row],[Smart City]]-Tabelle2[[#This Row],[Urban Sprawl]])-Tabelle2[[#This Row],[q-Wert (Indifferenz)]])/(Tabelle2[[#This Row],[p-Wert (Präferenz)]]-Tabelle2[[#This Row],[q-Wert (Indifferenz)]])))))),IF(Tabelle2[[#This Row],[Smart City]]-Tabelle2[[#This Row],[Urban Sprawl]]<0,-1*IF(ABS(Tabelle2[[#This Row],[Smart City]]-Tabelle2[[#This Row],[Urban Sprawl]])<Tabelle2[[#This Row],[q-Wert (Indifferenz)]], 0,IF(ABS(Tabelle2[[#This Row],[Smart City]]-Tabelle2[[#This Row],[Urban Sprawl]])>Tabelle2[[#This Row],[p-Wert (Präferenz)]],1,IF(AND(ABS(Tabelle2[[#This Row],[Smart City]]-Tabelle2[[#This Row],[Urban Sprawl]])<=Tabelle2[[#This Row],[p-Wert (Präferenz)]],ABS(Tabelle2[[#This Row],[Smart City]]-Tabelle2[[#This Row],[Urban Sprawl]])>=Tabelle2[[#This Row],[q-Wert (Indifferenz)]]),((ABS(Tabelle2[[#This Row],[Smart City]]-Tabelle2[[#This Row],[Urban Sprawl]])-Tabelle2[[#This Row],[q-Wert (Indifferenz)]])/(Tabelle2[[#This Row],[p-Wert (Präferenz)]]-Tabelle2[[#This Row],[q-Wert (Indifferenz)]]))))),IF(ABS(Tabelle2[[#This Row],[Smart City]]-Tabelle2[[#This Row],[Urban Sprawl]])<Tabelle2[[#This Row],[q-Wert (Indifferenz)]], 0,IF(ABS(Tabelle2[[#This Row],[Smart City]]-Tabelle2[[#This Row],[Urban Sprawl]])>Tabelle2[[#This Row],[p-Wert (Präferenz)]],1,IF(AND(ABS(Tabelle2[[#This Row],[Smart City]]-Tabelle2[[#This Row],[Urban Sprawl]])<=Tabelle2[[#This Row],[p-Wert (Präferenz)]],ABS(Tabelle2[[#This Row],[Smart City]]-Tabelle2[[#This Row],[Urban Sprawl]])>=Tabelle2[[#This Row],[q-Wert (Indifferenz)]]),((ABS(Tabelle2[[#This Row],[Smart City]]-Tabelle2[[#This Row],[Urban Sprawl]])-Tabelle2[[#This Row],[q-Wert (Indifferenz)]])/(Tabelle2[[#This Row],[p-Wert (Präferenz)]]-Tabelle2[[#This Row],[q-Wert (Indifferenz)]])))))))","v":0.26804123711340205},{"$f":"IF(Tabelle2[[#This Row],[min/max]]=\"min\",-1*IF(Tabelle2[[#This Row],[Smart City]]-Tabelle2[[#This Row],[Business as usual]]<0,-1*IF(ABS(Tabelle2[[#This Row],[Smart City]]-Tabelle2[[#This Row],[Business as usual]])<Tabelle2[[#This Row],[q-Wert (Indifferenz)]], 0,IF(ABS(Tabelle2[[#This Row],[Smart City]]-Tabelle2[[#This Row],[Business as usual]])>Tabelle2[[#This Row],[p-Wert (Präferenz)]],1,IF(AND(ABS(Tabelle2[[#This Row],[Smart City]]-Tabelle2[[#This Row],[Business as usual]])<=Tabelle2[[#This Row],[p-Wert (Präferenz)]],ABS(Tabelle2[[#This Row],[Smart City]]-Tabelle2[[#This Row],[Business as usual]])>=Tabelle2[[#This Row],[q-Wert (Indifferenz)]]),((ABS(Tabelle2[[#This Row],[Smart City]]-Tabelle2[[#This Row],[Business as usual]])-Tabelle2[[#This Row],[q-Wert (Indifferenz)]])/(Tabelle2[[#This Row],[p-Wert (Präferenz)]]-Tabelle2[[#This Row],[q-Wert (Indifferenz)]]))))),IF(ABS(Tabelle2[[#This Row],[Smart City]]-Tabelle2[[#This Row],[Business as usual]])<Tabelle2[[#This Row],[q-Wert (Indifferenz)]], 0,IF(ABS(Tabelle2[[#This Row],[Smart City]]-Tabelle2[[#This Row],[Business as usual]])>Tabelle2[[#This Row],[p-Wert (Präferenz)]],1,IF(AND(ABS(Tabelle2[[#This Row],[Smart City]]-Tabelle2[[#This Row],[Business as usual]])<=Tabelle2[[#This Row],[p-Wert (Präferenz)]],ABS(Tabelle2[[#This Row],[Smart City]]-Tabelle2[[#This Row],[Business as usual]])>=Tabelle2[[#This Row],[q-Wert (Indifferenz)]]),((ABS(Tabelle2[[#This Row],[Smart City]]-Tabelle2[[#This Row],[Business as usual]])-Tabelle2[[#This Row],[q-Wert (Indifferenz)]])/(Tabelle2[[#This Row],[p-Wert (Präferenz)]]-Tabelle2[[#This Row],[q-Wert (Indifferenz)]])))))),IF(Tabelle2[[#This Row],[Smart City]]-Tabelle2[[#This Row],[Business as usual]]<0,-1*IF(ABS(Tabelle2[[#This Row],[Smart City]]-Tabelle2[[#This Row],[Business as usual]])<Tabelle2[[#This Row],[q-Wert (Indifferenz)]], 0,IF(ABS(Tabelle2[[#This Row],[Smart City]]-Tabelle2[[#This Row],[Business as usual]])>Tabelle2[[#This Row],[p-Wert (Präferenz)]],1,IF(AND(ABS(Tabelle2[[#This Row],[Smart City]]-Tabelle2[[#This Row],[Business as usual]])<=Tabelle2[[#This Row],[p-Wert (Präferenz)]],ABS(Tabelle2[[#This Row],[Smart City]]-Tabelle2[[#This Row],[Business as usual]])>=Tabelle2[[#This Row],[q-Wert (Indifferenz)]]),((ABS(Tabelle2[[#This Row],[Smart City]]-Tabelle2[[#This Row],[Business as usual]])-Tabelle2[[#This Row],[q-Wert (Indifferenz)]])/(Tabelle2[[#This Row],[p-Wert (Präferenz)]]-Tabelle2[[#This Row],[q-Wert (Indifferenz)]]))))),IF(ABS(Tabelle2[[#This Row],[Smart City]]-Tabelle2[[#This Row],[Business as usual]])<Tabelle2[[#This Row],[q-Wert (Indifferenz)]], 0,IF(ABS(Tabelle2[[#This Row],[Smart City]]-Tabelle2[[#This Row],[Business as usual]])>Tabelle2[[#This Row],[p-Wert (Präferenz)]],1,IF(AND(ABS(Tabelle2[[#This Row],[Smart City]]-Tabelle2[[#This Row],[Business as usual]])<=Tabelle2[[#This Row],[p-Wert (Präferenz)]],ABS(Tabelle2[[#This Row],[Smart City]]-Tabelle2[[#This Row],[Business as usual]])>=Tabelle2[[#This Row],[q-Wert (Indifferenz)]]),((ABS(Tabelle2[[#This Row],[Smart City]]-Tabelle2[[#This Row],[Business as usual]])-Tabelle2[[#This Row],[q-Wert (Indifferenz)]])/(Tabelle2[[#This Row],[p-Wert (Präferenz)]]-Tabelle2[[#This Row],[q-Wert (Indifferenz)]])))))))","v":0.26804123711340205},null,{"$f":"IF(Tabelle2[[#This Row],[min/max]]=\"min\",-1*IF(Tabelle2[[#This Row],[Healthy City]]-Tabelle2[[#This Row],[Smart City]]<0,-1*IF(ABS(Tabelle2[[#This Row],[Healthy City]]-Tabelle2[[#This Row],[Smart City]])<Tabelle2[[#This Row],[q-Wert (Indifferenz)]], 0,IF(ABS(Tabelle2[[#This Row],[Healthy City]]-Tabelle2[[#This Row],[Smart City]])>Tabelle2[[#This Row],[p-Wert (Präferenz)]],1,IF(AND(ABS(Tabelle2[[#This Row],[Healthy City]]-Tabelle2[[#This Row],[Smart City]])<=Tabelle2[[#This Row],[p-Wert (Präferenz)]],ABS(Tabelle2[[#This Row],[Healthy City]]-Tabelle2[[#This Row],[Smart City]])>=Tabelle2[[#This Row],[q-Wert (Indifferenz)]]),((ABS(Tabelle2[[#This Row],[Healthy City]]-Tabelle2[[#This Row],[Smart City]])-Tabelle2[[#This Row],[q-Wert (Indifferenz)]])/(Tabelle2[[#This Row],[p-Wert (Präferenz)]]-Tabelle2[[#This Row],[q-Wert (Indifferenz)]]))))),IF(ABS(Tabelle2[[#This Row],[Healthy City]]-Tabelle2[[#This Row],[Smart City]])<Tabelle2[[#This Row],[q-Wert (Indifferenz)]], 0,IF(ABS(Tabelle2[[#This Row],[Healthy City]]-Tabelle2[[#This Row],[Smart City]])>Tabelle2[[#This Row],[p-Wert (Präferenz)]],1,IF(AND(ABS(Tabelle2[[#This Row],[Healthy City]]-Tabelle2[[#This Row],[Smart City]])<=Tabelle2[[#This Row],[p-Wert (Präferenz)]],ABS(Tabelle2[[#This Row],[Healthy City]]-Tabelle2[[#This Row],[Smart City]])>=Tabelle2[[#This Row],[q-Wert (Indifferenz)]]),((ABS(Tabelle2[[#This Row],[Healthy City]]-Tabelle2[[#This Row],[Smart City]])-Tabelle2[[#This Row],[q-Wert (Indifferenz)]])/(Tabelle2[[#This Row],[p-Wert (Präferenz)]]-Tabelle2[[#This Row],[q-Wert (Indifferenz)]])))))),IF(Tabelle2[[#This Row],[Healthy City]]-Tabelle2[[#This Row],[Smart City]]<0,-1*IF(ABS(Tabelle2[[#This Row],[Healthy City]]-Tabelle2[[#This Row],[Smart City]])<Tabelle2[[#This Row],[q-Wert (Indifferenz)]], 0,IF(ABS(Tabelle2[[#This Row],[Healthy City]]-Tabelle2[[#This Row],[Smart City]])>Tabelle2[[#This Row],[p-Wert (Präferenz)]],1,IF(AND(ABS(Tabelle2[[#This Row],[Healthy City]]-Tabelle2[[#This Row],[Smart City]])<=Tabelle2[[#This Row],[p-Wert (Präferenz)]],ABS(Tabelle2[[#This Row],[Healthy City]]-Tabelle2[[#This Row],[Smart City]])>=Tabelle2[[#This Row],[q-Wert (Indifferenz)]]),((ABS(Tabelle2[[#This Row],[Healthy City]]-Tabelle2[[#This Row],[Smart City]])-Tabelle2[[#This Row],[q-Wert (Indifferenz)]])/(Tabelle2[[#This Row],[p-Wert (Präferenz)]]-Tabelle2[[#This Row],[q-Wert (Indifferenz)]]))))),IF(ABS(Tabelle2[[#This Row],[Healthy City]]-Tabelle2[[#This Row],[Smart City]])<Tabelle2[[#This Row],[q-Wert (Indifferenz)]], 0,IF(ABS(Tabelle2[[#This Row],[Healthy City]]-Tabelle2[[#This Row],[Smart City]])>Tabelle2[[#This Row],[p-Wert (Präferenz)]],1,IF(AND(ABS(Tabelle2[[#This Row],[Healthy City]]-Tabelle2[[#This Row],[Smart City]])<=Tabelle2[[#This Row],[p-Wert (Präferenz)]],ABS(Tabelle2[[#This Row],[Healthy City]]-Tabelle2[[#This Row],[Smart City]])>=Tabelle2[[#This Row],[q-Wert (Indifferenz)]]),((ABS(Tabelle2[[#This Row],[Healthy City]]-Tabelle2[[#This Row],[Smart City]])-Tabelle2[[#This Row],[q-Wert (Indifferenz)]])/(Tabelle2[[#This Row],[p-Wert (Präferenz)]]-Tabelle2[[#This Row],[q-Wert (Indifferenz)]])))))))","v":0.26804123711340205},{"$f":"IF(Tabelle2[[#This Row],[min/max]]=\"min\",-1*IF(Tabelle2[[#This Row],[Healthy City]]-Tabelle2[[#This Row],[Urban Sprawl]]<0,-1*IF(ABS(Tabelle2[[#This Row],[Healthy City]]-Tabelle2[[#This Row],[Urban Sprawl]])<Tabelle2[[#This Row],[q-Wert (Indifferenz)]], 0,IF(ABS(Tabelle2[[#This Row],[Healthy City]]-Tabelle2[[#This Row],[Urban Sprawl]])>Tabelle2[[#This Row],[p-Wert (Präferenz)]],1,IF(AND(ABS(Tabelle2[[#This Row],[Healthy City]]-Tabelle2[[#This Row],[Urban Sprawl]])<=Tabelle2[[#This Row],[p-Wert (Präferenz)]],ABS(Tabelle2[[#This Row],[Healthy City]]-Tabelle2[[#This Row],[Urban Sprawl]])>=Tabelle2[[#This Row],[q-Wert (Indifferenz)]]),((ABS(Tabelle2[[#This Row],[Healthy City]]-Tabelle2[[#This Row],[Urban Sprawl]])-Tabelle2[[#This Row],[q-Wert (Indifferenz)]])/(Tabelle2[[#This Row],[p-Wert (Präferenz)]]-Tabelle2[[#This Row],[q-Wert (Indifferenz)]]))))),IF(ABS(Tabelle2[[#This Row],[Healthy City]]-Tabelle2[[#This Row],[Urban Sprawl]])<Tabelle2[[#This Row],[q-Wert (Indifferenz)]], 0,IF(ABS(Tabelle2[[#This Row],[Healthy City]]-Tabelle2[[#This Row],[Urban Sprawl]])>Tabelle2[[#This Row],[p-Wert (Präferenz)]],1,IF(AND(ABS(Tabelle2[[#This Row],[Healthy City]]-Tabelle2[[#This Row],[Urban Sprawl]])<=Tabelle2[[#This Row],[p-Wert (Präferenz)]],ABS(Tabelle2[[#This Row],[Healthy City]]-Tabelle2[[#This Row],[Urban Sprawl]])>=Tabelle2[[#This Row],[q-Wert (Indifferenz)]]),((ABS(Tabelle2[[#This Row],[Healthy City]]-Tabelle2[[#This Row],[Urban Sprawl]])-Tabelle2[[#This Row],[q-Wert (Indifferenz)]])/(Tabelle2[[#This Row],[p-Wert (Präferenz)]]-Tabelle2[[#This Row],[q-Wert (Indifferenz)]])))))),IF(Tabelle2[[#This Row],[Healthy City]]-Tabelle2[[#This Row],[Urban Sprawl]]<0,-1*IF(ABS(Tabelle2[[#This Row],[Healthy City]]-Tabelle2[[#This Row],[Urban Sprawl]])<Tabelle2[[#This Row],[q-Wert (Indifferenz)]], 0,IF(ABS(Tabelle2[[#This Row],[Healthy City]]-Tabelle2[[#This Row],[Urban Sprawl]])>Tabelle2[[#This Row],[p-Wert (Präferenz)]],1,IF(AND(ABS(Tabelle2[[#This Row],[Healthy City]]-Tabelle2[[#This Row],[Urban Sprawl]])<=Tabelle2[[#This Row],[p-Wert (Präferenz)]],ABS(Tabelle2[[#This Row],[Healthy City]]-Tabelle2[[#This Row],[Urban Sprawl]])>=Tabelle2[[#This Row],[q-Wert (Indifferenz)]]),((ABS(Tabelle2[[#This Row],[Healthy City]]-Tabelle2[[#This Row],[Urban Sprawl]])-Tabelle2[[#This Row],[q-Wert (Indifferenz)]])/(Tabelle2[[#This Row],[p-Wert (Präferenz)]]-Tabelle2[[#This Row],[q-Wert (Indifferenz)]]))))),IF(ABS(Tabelle2[[#This Row],[Healthy City]]-Tabelle2[[#This Row],[Urban Sprawl]])<Tabelle2[[#This Row],[q-Wert (Indifferenz)]], 0,IF(ABS(Tabelle2[[#This Row],[Healthy City]]-Tabelle2[[#This Row],[Urban Sprawl]])>Tabelle2[[#This Row],[p-Wert (Präferenz)]],1,IF(AND(ABS(Tabelle2[[#This Row],[Healthy City]]-Tabelle2[[#This Row],[Urban Sprawl]])<=Tabelle2[[#This Row],[p-Wert (Präferenz)]],ABS(Tabelle2[[#This Row],[Healthy City]]-Tabelle2[[#This Row],[Urban Sprawl]])>=Tabelle2[[#This Row],[q-Wert (Indifferenz)]]),((ABS(Tabelle2[[#This Row],[Healthy City]]-Tabelle2[[#This Row],[Urban Sprawl]])-Tabelle2[[#This Row],[q-Wert (Indifferenz)]])/(Tabelle2[[#This Row],[p-Wert (Präferenz)]]-Tabelle2[[#This Row],[q-Wert (Indifferenz)]])))))))","v":1},{"$f":"IF(Tabelle2[[#This Row],[min/max]]=\"min\",-1*IF(Tabelle2[[#This Row],[Healthy City]]-Tabelle2[[#This Row],[Business as usual]]<0,-1*IF(ABS(Tabelle2[[#This Row],[Healthy City]]-Tabelle2[[#This Row],[Business as usual]])<Tabelle2[[#This Row],[q-Wert (Indifferenz)]], 0,IF(ABS(Tabelle2[[#This Row],[Healthy City]]-Tabelle2[[#This Row],[Business as usual]])>Tabelle2[[#This Row],[p-Wert (Präferenz)]],1,IF(AND(ABS(Tabelle2[[#This Row],[Healthy City]]-Tabelle2[[#This Row],[Business as usual]])<=Tabelle2[[#This Row],[p-Wert (Präferenz)]],ABS(Tabelle2[[#This Row],[Healthy City]]-Tabelle2[[#This Row],[Business as usual]])>=Tabelle2[[#This Row],[q-Wert (Indifferenz)]]),((ABS(Tabelle2[[#This Row],[Healthy City]]-Tabelle2[[#This Row],[Business as usual]])-Tabelle2[[#This Row],[q-Wert (Indifferenz)]])/(Tabelle2[[#This Row],[p-Wert (Präferenz)]]-Tabelle2[[#This Row],[q-Wert (Indifferenz)]]))))),IF(ABS(Tabelle2[[#This Row],[Healthy City]]-Tabelle2[[#This Row],[Business as usual]])<Tabelle2[[#This Row],[q-Wert (Indifferenz)]], 0,IF(ABS(Tabelle2[[#This Row],[Healthy City]]-Tabelle2[[#This Row],[Business as usual]])>Tabelle2[[#This Row],[p-Wert (Präferenz)]],1,IF(AND(ABS(Tabelle2[[#This Row],[Healthy City]]-Tabelle2[[#This Row],[Business as usual]])<=Tabelle2[[#This Row],[p-Wert (Präferenz)]],ABS(Tabelle2[[#This Row],[Healthy City]]-Tabelle2[[#This Row],[Business as usual]])>=Tabelle2[[#This Row],[q-Wert (Indifferenz)]]),((ABS(Tabelle2[[#This Row],[Healthy City]]-Tabelle2[[#This Row],[Business as usual]])-Tabelle2[[#This Row],[q-Wert (Indifferenz)]])/(Tabelle2[[#This Row],[p-Wert (Präferenz)]]-Tabelle2[[#This Row],[q-Wert (Indifferenz)]])))))),IF(Tabelle2[[#This Row],[Healthy City]]-Tabelle2[[#This Row],[Business as usual]]<0,-1*IF(ABS(Tabelle2[[#This Row],[Healthy City]]-Tabelle2[[#This Row],[Business as usual]])<Tabelle2[[#This Row],[q-Wert (Indifferenz)]], 0,IF(ABS(Tabelle2[[#This Row],[Healthy City]]-Tabelle2[[#This Row],[Business as usual]])>Tabelle2[[#This Row],[p-Wert (Präferenz)]],1,IF(AND(ABS(Tabelle2[[#This Row],[Healthy City]]-Tabelle2[[#This Row],[Business as usual]])<=Tabelle2[[#This Row],[p-Wert (Präferenz)]],ABS(Tabelle2[[#This Row],[Healthy City]]-Tabelle2[[#This Row],[Business as usual]])>=Tabelle2[[#This Row],[q-Wert (Indifferenz)]]),((ABS(Tabelle2[[#This Row],[Healthy City]]-Tabelle2[[#This Row],[Business as usual]])-Tabelle2[[#This Row],[q-Wert (Indifferenz)]])/(Tabelle2[[#This Row],[p-Wert (Präferenz)]]-Tabelle2[[#This Row],[q-Wert (Indifferenz)]]))))),IF(ABS(Tabelle2[[#This Row],[Healthy City]]-Tabelle2[[#This Row],[Business as usual]])<Tabelle2[[#This Row],[q-Wert (Indifferenz)]], 0,IF(ABS(Tabelle2[[#This Row],[Healthy City]]-Tabelle2[[#This Row],[Business as usual]])>Tabelle2[[#This Row],[p-Wert (Präferenz)]],1,IF(AND(ABS(Tabelle2[[#This Row],[Healthy City]]-Tabelle2[[#This Row],[Business as usual]])<=Tabelle2[[#This Row],[p-Wert (Präferenz)]],ABS(Tabelle2[[#This Row],[Healthy City]]-Tabelle2[[#This Row],[Business as usual]])>=Tabelle2[[#This Row],[q-Wert (Indifferenz)]]),((ABS(Tabelle2[[#This Row],[Healthy City]]-Tabelle2[[#This Row],[Business as usual]])-Tabelle2[[#This Row],[q-Wert (Indifferenz)]])/(Tabelle2[[#This Row],[p-Wert (Präferenz)]]-Tabelle2[[#This Row],[q-Wert (Indifferenz)]])))))))","v":1},null,{"$f":"IF(Tabelle2[[#This Row],[min/max]]=\"min\",-1*IF(Tabelle2[[#This Row],[Urban Sprawl]]-Tabelle2[[#This Row],[Smart City]]<0,-1*IF(ABS(Tabelle2[[#This Row],[Urban Sprawl]]-Tabelle2[[#This Row],[Smart City]])<Tabelle2[[#This Row],[q-Wert (Indifferenz)]], 0,IF(ABS(Tabelle2[[#This Row],[Urban Sprawl]]-Tabelle2[[#This Row],[Smart City]])>Tabelle2[[#This Row],[p-Wert (Präferenz)]],1,IF(AND(ABS(Tabelle2[[#This Row],[Urban Sprawl]]-Tabelle2[[#This Row],[Smart City]])<=Tabelle2[[#This Row],[p-Wert (Präferenz)]],ABS(Tabelle2[[#This Row],[Urban Sprawl]]-Tabelle2[[#This Row],[Smart City]])>=Tabelle2[[#This Row],[q-Wert (Indifferenz)]]),((ABS(Tabelle2[[#This Row],[Urban Sprawl]]-Tabelle2[[#This Row],[Smart City]])-Tabelle2[[#This Row],[q-Wert (Indifferenz)]])/(Tabelle2[[#This Row],[p-Wert (Präferenz)]]-Tabelle2[[#This Row],[q-Wert (Indifferenz)]]))))),IF(ABS(Tabelle2[[#This Row],[Urban Sprawl]]-Tabelle2[[#This Row],[Smart City]])<Tabelle2[[#This Row],[q-Wert (Indifferenz)]], 0,IF(ABS(Tabelle2[[#This Row],[Urban Sprawl]]-Tabelle2[[#This Row],[Smart City]])>Tabelle2[[#This Row],[p-Wert (Präferenz)]],1,IF(AND(ABS(Tabelle2[[#This Row],[Urban Sprawl]]-Tabelle2[[#This Row],[Smart City]])<=Tabelle2[[#This Row],[p-Wert (Präferenz)]],ABS(Tabelle2[[#This Row],[Urban Sprawl]]-Tabelle2[[#This Row],[Smart City]])>=Tabelle2[[#This Row],[q-Wert (Indifferenz)]]),((ABS(Tabelle2[[#This Row],[Urban Sprawl]]-Tabelle2[[#This Row],[Smart City]])-Tabelle2[[#This Row],[q-Wert (Indifferenz)]])/(Tabelle2[[#This Row],[p-Wert (Präferenz)]]-Tabelle2[[#This Row],[q-Wert (Indifferenz)]])))))),IF(Tabelle2[[#This Row],[Urban Sprawl]]-Tabelle2[[#This Row],[Smart City]]<0,-1*IF(ABS(Tabelle2[[#This Row],[Urban Sprawl]]-Tabelle2[[#This Row],[Smart City]])<Tabelle2[[#This Row],[q-Wert (Indifferenz)]], 0,IF(ABS(Tabelle2[[#This Row],[Urban Sprawl]]-Tabelle2[[#This Row],[Smart City]])>Tabelle2[[#This Row],[p-Wert (Präferenz)]],1,IF(AND(ABS(Tabelle2[[#This Row],[Urban Sprawl]]-Tabelle2[[#This Row],[Smart City]])<=Tabelle2[[#This Row],[p-Wert (Präferenz)]],ABS(Tabelle2[[#This Row],[Urban Sprawl]]-Tabelle2[[#This Row],[Smart City]])>=Tabelle2[[#This Row],[q-Wert (Indifferenz)]]),((ABS(Tabelle2[[#This Row],[Urban Sprawl]]-Tabelle2[[#This Row],[Smart City]])-Tabelle2[[#This Row],[q-Wert (Indifferenz)]])/(Tabelle2[[#This Row],[p-Wert (Präferenz)]]-Tabelle2[[#This Row],[q-Wert (Indifferenz)]]))))),IF(ABS(Tabelle2[[#This Row],[Urban Sprawl]]-Tabelle2[[#This Row],[Smart City]])<Tabelle2[[#This Row],[q-Wert (Indifferenz)]], 0,IF(ABS(Tabelle2[[#This Row],[Urban Sprawl]]-Tabelle2[[#This Row],[Smart City]])>Tabelle2[[#This Row],[p-Wert (Präferenz)]],1,IF(AND(ABS(Tabelle2[[#This Row],[Urban Sprawl]]-Tabelle2[[#This Row],[Smart City]])<=Tabelle2[[#This Row],[p-Wert (Präferenz)]],ABS(Tabelle2[[#This Row],[Urban Sprawl]]-Tabelle2[[#This Row],[Smart City]])>=Tabelle2[[#This Row],[q-Wert (Indifferenz)]]),((ABS(Tabelle2[[#This Row],[Urban Sprawl]]-Tabelle2[[#This Row],[Smart City]])-Tabelle2[[#This Row],[q-Wert (Indifferenz)]])/(Tabelle2[[#This Row],[p-Wert (Präferenz)]]-Tabelle2[[#This Row],[q-Wert (Indifferenz)]])))))))","v":-0.26804123711340205},{"$f":"IF(Tabelle2[[#This Row],[min/max]]=\"min\",-1*IF(Tabelle2[[#This Row],[Urban Sprawl]]-Tabelle2[[#This Row],[Healthy City]]<0,-1*IF(ABS(Tabelle2[[#This Row],[Urban Sprawl]]-Tabelle2[[#This Row],[Healthy City]])<Tabelle2[[#This Row],[q-Wert (Indifferenz)]], 0,IF(ABS(Tabelle2[[#This Row],[Urban Sprawl]]-Tabelle2[[#This Row],[Healthy City]])>Tabelle2[[#This Row],[p-Wert (Präferenz)]],1,IF(AND(ABS(Tabelle2[[#This Row],[Urban Sprawl]]-Tabelle2[[#This Row],[Healthy City]])<=Tabelle2[[#This Row],[p-Wert (Präferenz)]],ABS(Tabelle2[[#This Row],[Urban Sprawl]]-Tabelle2[[#This Row],[Healthy City]])>=Tabelle2[[#This Row],[q-Wert (Indifferenz)]]),((ABS(Tabelle2[[#This Row],[Urban Sprawl]]-Tabelle2[[#This Row],[Healthy City]])-Tabelle2[[#This Row],[q-Wert (Indifferenz)]])/(Tabelle2[[#This Row],[p-Wert (Präferenz)]]-Tabelle2[[#This Row],[q-Wert (Indifferenz)]]))))),IF(ABS(Tabelle2[[#This Row],[Urban Sprawl]]-Tabelle2[[#This Row],[Healthy City]])<Tabelle2[[#This Row],[q-Wert (Indifferenz)]], 0,IF(ABS(Tabelle2[[#This Row],[Urban Sprawl]]-Tabelle2[[#This Row],[Healthy City]])>Tabelle2[[#This Row],[p-Wert (Präferenz)]],1,IF(AND(ABS(Tabelle2[[#This Row],[Urban Sprawl]]-Tabelle2[[#This Row],[Healthy City]])<=Tabelle2[[#This Row],[p-Wert (Präferenz)]],ABS(Tabelle2[[#This Row],[Urban Sprawl]]-Tabelle2[[#This Row],[Healthy City]])>=Tabelle2[[#This Row],[q-Wert (Indifferenz)]]),((ABS(Tabelle2[[#This Row],[Urban Sprawl]]-Tabelle2[[#This Row],[Healthy City]])-Tabelle2[[#This Row],[q-Wert (Indifferenz)]])/(Tabelle2[[#This Row],[p-Wert (Präferenz)]]-Tabelle2[[#This Row],[q-Wert (Indifferenz)]])))))),IF(Tabelle2[[#This Row],[Urban Sprawl]]-Tabelle2[[#This Row],[Healthy City]]<0,-1*IF(ABS(Tabelle2[[#This Row],[Urban Sprawl]]-Tabelle2[[#This Row],[Healthy City]])<Tabelle2[[#This Row],[q-Wert (Indifferenz)]], 0,IF(ABS(Tabelle2[[#This Row],[Urban Sprawl]]-Tabelle2[[#This Row],[Healthy City]])>Tabelle2[[#This Row],[p-Wert (Präferenz)]],1,IF(AND(ABS(Tabelle2[[#This Row],[Urban Sprawl]]-Tabelle2[[#This Row],[Healthy City]])<=Tabelle2[[#This Row],[p-Wert (Präferenz)]],ABS(Tabelle2[[#This Row],[Urban Sprawl]]-Tabelle2[[#This Row],[Healthy City]])>=Tabelle2[[#This Row],[q-Wert (Indifferenz)]]),((ABS(Tabelle2[[#This Row],[Urban Sprawl]]-Tabelle2[[#This Row],[Healthy City]])-Tabelle2[[#This Row],[q-Wert (Indifferenz)]])/(Tabelle2[[#This Row],[p-Wert (Präferenz)]]-Tabelle2[[#This Row],[q-Wert (Indifferenz)]]))))),IF(ABS(Tabelle2[[#This Row],[Urban Sprawl]]-Tabelle2[[#This Row],[Healthy City]])<Tabelle2[[#This Row],[q-Wert (Indifferenz)]], 0,IF(ABS(Tabelle2[[#This Row],[Urban Sprawl]]-Tabelle2[[#This Row],[Healthy City]])>Tabelle2[[#This Row],[p-Wert (Präferenz)]],1,IF(AND(ABS(Tabelle2[[#This Row],[Urban Sprawl]]-Tabelle2[[#This Row],[Healthy City]])<=Tabelle2[[#This Row],[p-Wert (Präferenz)]],ABS(Tabelle2[[#This Row],[Urban Sprawl]]-Tabelle2[[#This Row],[Healthy City]])>=Tabelle2[[#This Row],[q-Wert (Indifferenz)]]),((ABS(Tabelle2[[#This Row],[Urban Sprawl]]-Tabelle2[[#This Row],[Healthy City]])-Tabelle2[[#This Row],[q-Wert (Indifferenz)]])/(Tabelle2[[#This Row],[p-Wert (Präferenz)]]-Tabelle2[[#This Row],[q-Wert (Indifferenz)]])))))))","v":-1},{"$f":"IF(Tabelle2[[#This Row],[min/max]]=\"min\",-1*IF(Tabelle2[[#This Row],[Urban Sprawl]]-Tabelle2[[#This Row],[Business as usual]]<0,-1*IF(ABS(Tabelle2[[#This Row],[Urban Sprawl]]-Tabelle2[[#This Row],[Business as usual]])<Tabelle2[[#This Row],[q-Wert (Indifferenz)]], 0,IF(ABS(Tabelle2[[#This Row],[Urban Sprawl]]-Tabelle2[[#This Row],[Business as usual]])>Tabelle2[[#This Row],[p-Wert (Präferenz)]],1,IF(AND(ABS(Tabelle2[[#This Row],[Urban Sprawl]]-Tabelle2[[#This Row],[Business as usual]])<=Tabelle2[[#This Row],[p-Wert (Präferenz)]],ABS(Tabelle2[[#This Row],[Urban Sprawl]]-Tabelle2[[#This Row],[Business as usual]])>=Tabelle2[[#This Row],[q-Wert (Indifferenz)]]),((ABS(Tabelle2[[#This Row],[Urban Sprawl]]-Tabelle2[[#This Row],[Business as usual]])-Tabelle2[[#This Row],[q-Wert (Indifferenz)]])/(Tabelle2[[#This Row],[p-Wert (Präferenz)]]-Tabelle2[[#This Row],[q-Wert (Indifferenz)]]))))),IF(ABS(Tabelle2[[#This Row],[Urban Sprawl]]-Tabelle2[[#This Row],[Business as usual]])<Tabelle2[[#This Row],[q-Wert (Indifferenz)]], 0,IF(ABS(Tabelle2[[#This Row],[Urban Sprawl]]-Tabelle2[[#This Row],[Business as usual]])>Tabelle2[[#This Row],[p-Wert (Präferenz)]],1,IF(AND(ABS(Tabelle2[[#This Row],[Urban Sprawl]]-Tabelle2[[#This Row],[Business as usual]])<=Tabelle2[[#This Row],[p-Wert (Präferenz)]],ABS(Tabelle2[[#This Row],[Urban Sprawl]]-Tabelle2[[#This Row],[Business as usual]])>=Tabelle2[[#This Row],[q-Wert (Indifferenz)]]),((ABS(Tabelle2[[#This Row],[Urban Sprawl]]-Tabelle2[[#This Row],[Business as usual]])-Tabelle2[[#This Row],[q-Wert (Indifferenz)]])/(Tabelle2[[#This Row],[p-Wert (Präferenz)]]-Tabelle2[[#This Row],[q-Wert (Indifferenz)]])))))),IF(Tabelle2[[#This Row],[Urban Sprawl]]-Tabelle2[[#This Row],[Business as usual]]<0,-1*IF(ABS(Tabelle2[[#This Row],[Urban Sprawl]]-Tabelle2[[#This Row],[Business as usual]])<Tabelle2[[#This Row],[q-Wert (Indifferenz)]], 0,IF(ABS(Tabelle2[[#This Row],[Urban Sprawl]]-Tabelle2[[#This Row],[Business as usual]])>Tabelle2[[#This Row],[p-Wert (Präferenz)]],1,IF(AND(ABS(Tabelle2[[#This Row],[Urban Sprawl]]-Tabelle2[[#This Row],[Business as usual]])<=Tabelle2[[#This Row],[p-Wert (Präferenz)]],ABS(Tabelle2[[#This Row],[Urban Sprawl]]-Tabelle2[[#This Row],[Business as usual]])>=Tabelle2[[#This Row],[q-Wert (Indifferenz)]]),((ABS(Tabelle2[[#This Row],[Urban Sprawl]]-Tabelle2[[#This Row],[Business as usual]])-Tabelle2[[#This Row],[q-Wert (Indifferenz)]])/(Tabelle2[[#This Row],[p-Wert (Präferenz)]]-Tabelle2[[#This Row],[q-Wert (Indifferenz)]]))))),IF(ABS(Tabelle2[[#This Row],[Urban Sprawl]]-Tabelle2[[#This Row],[Business as usual]])<Tabelle2[[#This Row],[q-Wert (Indifferenz)]], 0,IF(ABS(Tabelle2[[#This Row],[Urban Sprawl]]-Tabelle2[[#This Row],[Business as usual]])>Tabelle2[[#This Row],[p-Wert (Präferenz)]],1,IF(AND(ABS(Tabelle2[[#This Row],[Urban Sprawl]]-Tabelle2[[#This Row],[Business as usual]])<=Tabelle2[[#This Row],[p-Wert (Präferenz)]],ABS(Tabelle2[[#This Row],[Urban Sprawl]]-Tabelle2[[#This Row],[Business as usual]])>=Tabelle2[[#This Row],[q-Wert (Indifferenz)]]),((ABS(Tabelle2[[#This Row],[Urban Sprawl]]-Tabelle2[[#This Row],[Business as usual]])-Tabelle2[[#This Row],[q-Wert (Indifferenz)]])/(Tabelle2[[#This Row],[p-Wert (Präferenz)]]-Tabelle2[[#This Row],[q-Wert (Indifferenz)]])))))))","v":0},null,{"$f":"IF(Tabelle2[[#This Row],[min/max]]=\"min\",-1*IF(Tabelle2[[#This Row],[Business as usual]]-Tabelle2[[#This Row],[Smart City]]<0,-1*IF(ABS(Tabelle2[[#This Row],[Business as usual]]-Tabelle2[[#This Row],[Smart City]])<Tabelle2[[#This Row],[q-Wert (Indifferenz)]], 0,IF(ABS(Tabelle2[[#This Row],[Business as usual]]-Tabelle2[[#This Row],[Smart City]])>Tabelle2[[#This Row],[p-Wert (Präferenz)]],1,IF(AND(ABS(Tabelle2[[#This Row],[Business as usual]]-Tabelle2[[#This Row],[Smart City]])<=Tabelle2[[#This Row],[p-Wert (Präferenz)]],ABS(Tabelle2[[#This Row],[Business as usual]]-Tabelle2[[#This Row],[Smart City]])>=Tabelle2[[#This Row],[q-Wert (Indifferenz)]]),((ABS(Tabelle2[[#This Row],[Business as usual]]-Tabelle2[[#This Row],[Smart City]])-Tabelle2[[#This Row],[q-Wert (Indifferenz)]])/(Tabelle2[[#This Row],[p-Wert (Präferenz)]]-Tabelle2[[#This Row],[q-Wert (Indifferenz)]]))))),IF(ABS(Tabelle2[[#This Row],[Business as usual]]-Tabelle2[[#This Row],[Smart City]])<Tabelle2[[#This Row],[q-Wert (Indifferenz)]], 0,IF(ABS(Tabelle2[[#This Row],[Business as usual]]-Tabelle2[[#This Row],[Smart City]])>Tabelle2[[#This Row],[p-Wert (Präferenz)]],1,IF(AND(ABS(Tabelle2[[#This Row],[Business as usual]]-Tabelle2[[#This Row],[Smart City]])<=Tabelle2[[#This Row],[p-Wert (Präferenz)]],ABS(Tabelle2[[#This Row],[Business as usual]]-Tabelle2[[#This Row],[Smart City]])>=Tabelle2[[#This Row],[q-Wert (Indifferenz)]]),((ABS(Tabelle2[[#This Row],[Business as usual]]-Tabelle2[[#This Row],[Smart City]])-Tabelle2[[#This Row],[q-Wert (Indifferenz)]])/(Tabelle2[[#This Row],[p-Wert (Präferenz)]]-Tabelle2[[#This Row],[q-Wert (Indifferenz)]])))))),IF(Tabelle2[[#This Row],[Business as usual]]-Tabelle2[[#This Row],[Smart City]]<0,-1*IF(ABS(Tabelle2[[#This Row],[Business as usual]]-Tabelle2[[#This Row],[Smart City]])<Tabelle2[[#This Row],[q-Wert (Indifferenz)]], 0,IF(ABS(Tabelle2[[#This Row],[Business as usual]]-Tabelle2[[#This Row],[Smart City]])>Tabelle2[[#This Row],[p-Wert (Präferenz)]],1,IF(AND(ABS(Tabelle2[[#This Row],[Business as usual]]-Tabelle2[[#This Row],[Smart City]])<=Tabelle2[[#This Row],[p-Wert (Präferenz)]],ABS(Tabelle2[[#This Row],[Business as usual]]-Tabelle2[[#This Row],[Smart City]])>=Tabelle2[[#This Row],[q-Wert (Indifferenz)]]),((ABS(Tabelle2[[#This Row],[Business as usual]]-Tabelle2[[#This Row],[Smart City]])-Tabelle2[[#This Row],[q-Wert (Indifferenz)]])/(Tabelle2[[#This Row],[p-Wert (Präferenz)]]-Tabelle2[[#This Row],[q-Wert (Indifferenz)]]))))),IF(ABS(Tabelle2[[#This Row],[Business as usual]]-Tabelle2[[#This Row],[Smart City]])<Tabelle2[[#This Row],[q-Wert (Indifferenz)]], 0,IF(ABS(Tabelle2[[#This Row],[Business as usual]]-Tabelle2[[#This Row],[Smart City]])>Tabelle2[[#This Row],[p-Wert (Präferenz)]],1,IF(AND(ABS(Tabelle2[[#This Row],[Business as usual]]-Tabelle2[[#This Row],[Smart City]])<=Tabelle2[[#This Row],[p-Wert (Präferenz)]],ABS(Tabelle2[[#This Row],[Business as usual]]-Tabelle2[[#This Row],[Smart City]])>=Tabelle2[[#This Row],[q-Wert (Indifferenz)]]),((ABS(Tabelle2[[#This Row],[Business as usual]]-Tabelle2[[#This Row],[Smart City]])-Tabelle2[[#This Row],[q-Wert (Indifferenz)]])/(Tabelle2[[#This Row],[p-Wert (Präferenz)]]-Tabelle2[[#This Row],[q-Wert (Indifferenz)]])))))))","v":-0.26804123711340205},{"$f":"IF(Tabelle2[[#This Row],[min/max]]=\"min\",-1*IF(Tabelle2[[#This Row],[Business as usual]]-Tabelle2[[#This Row],[Healthy City]]<0,-1*IF(ABS(Tabelle2[[#This Row],[Business as usual]]-Tabelle2[[#This Row],[Healthy City]])<Tabelle2[[#This Row],[q-Wert (Indifferenz)]], 0,IF(ABS(Tabelle2[[#This Row],[Business as usual]]-Tabelle2[[#This Row],[Healthy City]])>Tabelle2[[#This Row],[p-Wert (Präferenz)]],1,IF(AND(ABS(Tabelle2[[#This Row],[Business as usual]]-Tabelle2[[#This Row],[Healthy City]])<=Tabelle2[[#This Row],[p-Wert (Präferenz)]],ABS(Tabelle2[[#This Row],[Business as usual]]-Tabelle2[[#This Row],[Healthy City]])>=Tabelle2[[#This Row],[q-Wert (Indifferenz)]]),((ABS(Tabelle2[[#This Row],[Business as usual]]-Tabelle2[[#This Row],[Healthy City]])-Tabelle2[[#This Row],[q-Wert (Indifferenz)]])/(Tabelle2[[#This Row],[p-Wert (Präferenz)]]-Tabelle2[[#This Row],[q-Wert (Indifferenz)]]))))),IF(ABS(Tabelle2[[#This Row],[Business as usual]]-Tabelle2[[#This Row],[Healthy City]])<Tabelle2[[#This Row],[q-Wert (Indifferenz)]], 0,IF(ABS(Tabelle2[[#This Row],[Business as usual]]-Tabelle2[[#This Row],[Healthy City]])>Tabelle2[[#This Row],[p-Wert (Präferenz)]],1,IF(AND(ABS(Tabelle2[[#This Row],[Business as usual]]-Tabelle2[[#This Row],[Healthy City]])<=Tabelle2[[#This Row],[p-Wert (Präferenz)]],ABS(Tabelle2[[#This Row],[Business as usual]]-Tabelle2[[#This Row],[Healthy City]])>=Tabelle2[[#This Row],[q-Wert (Indifferenz)]]),((ABS(Tabelle2[[#This Row],[Business as usual]]-Tabelle2[[#This Row],[Healthy City]])-Tabelle2[[#This Row],[q-Wert (Indifferenz)]])/(Tabelle2[[#This Row],[p-Wert (Präferenz)]]-Tabelle2[[#This Row],[q-Wert (Indifferenz)]])))))),IF(Tabelle2[[#This Row],[Business as usual]]-Tabelle2[[#This Row],[Healthy City]]<0,-1*IF(ABS(Tabelle2[[#This Row],[Business as usual]]-Tabelle2[[#This Row],[Healthy City]])<Tabelle2[[#This Row],[q-Wert (Indifferenz)]], 0,IF(ABS(Tabelle2[[#This Row],[Business as usual]]-Tabelle2[[#This Row],[Healthy City]])>Tabelle2[[#This Row],[p-Wert (Präferenz)]],1,IF(AND(ABS(Tabelle2[[#This Row],[Business as usual]]-Tabelle2[[#This Row],[Healthy City]])<=Tabelle2[[#This Row],[p-Wert (Präferenz)]],ABS(Tabelle2[[#This Row],[Business as usual]]-Tabelle2[[#This Row],[Healthy City]])>=Tabelle2[[#This Row],[q-Wert (Indifferenz)]]),((ABS(Tabelle2[[#This Row],[Business as usual]]-Tabelle2[[#This Row],[Healthy City]])-Tabelle2[[#This Row],[q-Wert (Indifferenz)]])/(Tabelle2[[#This Row],[p-Wert (Präferenz)]]-Tabelle2[[#This Row],[q-Wert (Indifferenz)]]))))),IF(ABS(Tabelle2[[#This Row],[Business as usual]]-Tabelle2[[#This Row],[Healthy City]])<Tabelle2[[#This Row],[q-Wert (Indifferenz)]], 0,IF(ABS(Tabelle2[[#This Row],[Business as usual]]-Tabelle2[[#This Row],[Healthy City]])>Tabelle2[[#This Row],[p-Wert (Präferenz)]],1,IF(AND(ABS(Tabelle2[[#This Row],[Business as usual]]-Tabelle2[[#This Row],[Healthy City]])<=Tabelle2[[#This Row],[p-Wert (Präferenz)]],ABS(Tabelle2[[#This Row],[Business as usual]]-Tabelle2[[#This Row],[Healthy City]])>=Tabelle2[[#This Row],[q-Wert (Indifferenz)]]),((ABS(Tabelle2[[#This Row],[Business as usual]]-Tabelle2[[#This Row],[Healthy City]])-Tabelle2[[#This Row],[q-Wert (Indifferenz)]])/(Tabelle2[[#This Row],[p-Wert (Präferenz)]]-Tabelle2[[#This Row],[q-Wert (Indifferenz)]])))))))","v":-1},{"$f":"IF(Tabelle2[[#This Row],[min/max]]=\"min\",-1*IF(Tabelle2[[#This Row],[Business as usual]]-Tabelle2[[#This Row],[Urban Sprawl]]<0,-1*IF(ABS(Tabelle2[[#This Row],[Business as usual]]-Tabelle2[[#This Row],[Urban Sprawl]])<Tabelle2[[#This Row],[q-Wert (Indifferenz)]], 0,IF(ABS(Tabelle2[[#This Row],[Business as usual]]-Tabelle2[[#This Row],[Urban Sprawl]])>Tabelle2[[#This Row],[p-Wert (Präferenz)]],1,IF(AND(ABS(Tabelle2[[#This Row],[Business as usual]]-Tabelle2[[#This Row],[Urban Sprawl]])<=Tabelle2[[#This Row],[p-Wert (Präferenz)]],ABS(Tabelle2[[#This Row],[Business as usual]]-Tabelle2[[#This Row],[Urban Sprawl]])>=Tabelle2[[#This Row],[q-Wert (Indifferenz)]]),((ABS(Tabelle2[[#This Row],[Business as usual]]-Tabelle2[[#This Row],[Urban Sprawl]])-Tabelle2[[#This Row],[q-Wert (Indifferenz)]])/(Tabelle2[[#This Row],[p-Wert (Präferenz)]]-Tabelle2[[#This Row],[q-Wert (Indifferenz)]]))))),IF(ABS(Tabelle2[[#This Row],[Business as usual]]-Tabelle2[[#This Row],[Urban Sprawl]])<Tabelle2[[#This Row],[q-Wert (Indifferenz)]], 0,IF(ABS(Tabelle2[[#This Row],[Business as usual]]-Tabelle2[[#This Row],[Urban Sprawl]])>Tabelle2[[#This Row],[p-Wert (Präferenz)]],1,IF(AND(ABS(Tabelle2[[#This Row],[Business as usual]]-Tabelle2[[#This Row],[Urban Sprawl]])<=Tabelle2[[#This Row],[p-Wert (Präferenz)]],ABS(Tabelle2[[#This Row],[Business as usual]]-Tabelle2[[#This Row],[Urban Sprawl]])>=Tabelle2[[#This Row],[q-Wert (Indifferenz)]]),((ABS(Tabelle2[[#This Row],[Business as usual]]-Tabelle2[[#This Row],[Urban Sprawl]])-Tabelle2[[#This Row],[q-Wert (Indifferenz)]])/(Tabelle2[[#This Row],[p-Wert (Präferenz)]]-Tabelle2[[#This Row],[q-Wert (Indifferenz)]])))))),IF(Tabelle2[[#This Row],[Business as usual]]-Tabelle2[[#This Row],[Urban Sprawl]]<0,-1*IF(ABS(Tabelle2[[#This Row],[Business as usual]]-Tabelle2[[#This Row],[Urban Sprawl]])<Tabelle2[[#This Row],[q-Wert (Indifferenz)]], 0,IF(ABS(Tabelle2[[#This Row],[Business as usual]]-Tabelle2[[#This Row],[Urban Sprawl]])>Tabelle2[[#This Row],[p-Wert (Präferenz)]],1,IF(AND(ABS(Tabelle2[[#This Row],[Business as usual]]-Tabelle2[[#This Row],[Urban Sprawl]])<=Tabelle2[[#This Row],[p-Wert (Präferenz)]],ABS(Tabelle2[[#This Row],[Business as usual]]-Tabelle2[[#This Row],[Urban Sprawl]])>=Tabelle2[[#This Row],[q-Wert (Indifferenz)]]),((ABS(Tabelle2[[#This Row],[Business as usual]]-Tabelle2[[#This Row],[Urban Sprawl]])-Tabelle2[[#This Row],[q-Wert (Indifferenz)]])/(Tabelle2[[#This Row],[p-Wert (Präferenz)]]-Tabelle2[[#This Row],[q-Wert (Indifferenz)]]))))),IF(ABS(Tabelle2[[#This Row],[Business as usual]]-Tabelle2[[#This Row],[Urban Sprawl]])<Tabelle2[[#This Row],[q-Wert (Indifferenz)]], 0,IF(ABS(Tabelle2[[#This Row],[Business as usual]]-Tabelle2[[#This Row],[Urban Sprawl]])>Tabelle2[[#This Row],[p-Wert (Präferenz)]],1,IF(AND(ABS(Tabelle2[[#This Row],[Business as usual]]-Tabelle2[[#This Row],[Urban Sprawl]])<=Tabelle2[[#This Row],[p-Wert (Präferenz)]],ABS(Tabelle2[[#This Row],[Business as usual]]-Tabelle2[[#This Row],[Urban Sprawl]])>=Tabelle2[[#This Row],[q-Wert (Indifferenz)]]),((ABS(Tabelle2[[#This Row],[Business as usual]]-Tabelle2[[#This Row],[Urban Sprawl]])-Tabelle2[[#This Row],[q-Wert (Indifferenz)]])/(Tabelle2[[#This Row],[p-Wert (Präferenz)]]-Tabelle2[[#This Row],[q-Wert (Indifferenz)]])))))))","v":0}]
[null,null,null,"Parkpreis",{"$f":"('\"Walking Weights\"'!D11)/100","v":5.5555555555555552E-2},"max","€/Stunde",3,5,3,2,"Typ 5",0.96,2.46,{"$f":"IF(Tabelle2[[#This Row],[min/max]]=\"min\",-1*IF(Tabelle2[[#This Row],[Smart City]]-Tabelle2[[#This Row],[Healthy City]]<0,-1*IF(ABS(Tabelle2[[#This Row],[Smart City]]-Tabelle2[[#This Row],[Healthy City]])<Tabelle2[[#This Row],[q-Wert (Indifferenz)]], 0,IF(ABS(Tabelle2[[#This Row],[Smart City]]-Tabelle2[[#This Row],[Healthy City]])>Tabelle2[[#This Row],[p-Wert (Präferenz)]],1,IF(AND(ABS(Tabelle2[[#This Row],[Smart City]]-Tabelle2[[#This Row],[Healthy City]])<=Tabelle2[[#This Row],[p-Wert (Präferenz)]],ABS(Tabelle2[[#This Row],[Smart City]]-Tabelle2[[#This Row],[Healthy City]])>=Tabelle2[[#This Row],[q-Wert (Indifferenz)]]),((ABS(Tabelle2[[#This Row],[Smart City]]-Tabelle2[[#This Row],[Healthy City]])-Tabelle2[[#This Row],[q-Wert (Indifferenz)]])/(Tabelle2[[#This Row],[p-Wert (Präferenz)]]-Tabelle2[[#This Row],[q-Wert (Indifferenz)]]))))),IF(ABS(Tabelle2[[#This Row],[Smart City]]-Tabelle2[[#This Row],[Healthy City]])<Tabelle2[[#This Row],[q-Wert (Indifferenz)]], 0,IF(ABS(Tabelle2[[#This Row],[Smart City]]-Tabelle2[[#This Row],[Healthy City]])>Tabelle2[[#This Row],[p-Wert (Präferenz)]],1,IF(AND(ABS(Tabelle2[[#This Row],[Smart City]]-Tabelle2[[#This Row],[Healthy City]])<=Tabelle2[[#This Row],[p-Wert (Präferenz)]],ABS(Tabelle2[[#This Row],[Smart City]]-Tabelle2[[#This Row],[Healthy City]])>=Tabelle2[[#This Row],[q-Wert (Indifferenz)]]),((ABS(Tabelle2[[#This Row],[Smart City]]-Tabelle2[[#This Row],[Healthy City]])-Tabelle2[[#This Row],[q-Wert (Indifferenz)]])/(Tabelle2[[#This Row],[p-Wert (Präferenz)]]-Tabelle2[[#This Row],[q-Wert (Indifferenz)]])))))),IF(Tabelle2[[#This Row],[Smart City]]-Tabelle2[[#This Row],[Healthy City]]<0,-1*IF(ABS(Tabelle2[[#This Row],[Smart City]]-Tabelle2[[#This Row],[Healthy City]])<Tabelle2[[#This Row],[q-Wert (Indifferenz)]], 0,IF(ABS(Tabelle2[[#This Row],[Smart City]]-Tabelle2[[#This Row],[Healthy City]])>Tabelle2[[#This Row],[p-Wert (Präferenz)]],1,IF(AND(ABS(Tabelle2[[#This Row],[Smart City]]-Tabelle2[[#This Row],[Healthy City]])<=Tabelle2[[#This Row],[p-Wert (Präferenz)]],ABS(Tabelle2[[#This Row],[Smart City]]-Tabelle2[[#This Row],[Healthy City]])>=Tabelle2[[#This Row],[q-Wert (Indifferenz)]]),((ABS(Tabelle2[[#This Row],[Smart City]]-Tabelle2[[#This Row],[Healthy City]])-Tabelle2[[#This Row],[q-Wert (Indifferenz)]])/(Tabelle2[[#This Row],[p-Wert (Präferenz)]]-Tabelle2[[#This Row],[q-Wert (Indifferenz)]]))))),IF(ABS(Tabelle2[[#This Row],[Smart City]]-Tabelle2[[#This Row],[Healthy City]])<Tabelle2[[#This Row],[q-Wert (Indifferenz)]], 0,IF(ABS(Tabelle2[[#This Row],[Smart City]]-Tabelle2[[#This Row],[Healthy City]])>Tabelle2[[#This Row],[p-Wert (Präferenz)]],1,IF(AND(ABS(Tabelle2[[#This Row],[Smart City]]-Tabelle2[[#This Row],[Healthy City]])<=Tabelle2[[#This Row],[p-Wert (Präferenz)]],ABS(Tabelle2[[#This Row],[Smart City]]-Tabelle2[[#This Row],[Healthy City]])>=Tabelle2[[#This Row],[q-Wert (Indifferenz)]]),((ABS(Tabelle2[[#This Row],[Smart City]]-Tabelle2[[#This Row],[Healthy City]])-Tabelle2[[#This Row],[q-Wert (Indifferenz)]])/(Tabelle2[[#This Row],[p-Wert (Präferenz)]]-Tabelle2[[#This Row],[q-Wert (Indifferenz)]])))))))","v":-0.69333333333333336},{"$f":"IF(Tabelle2[[#This Row],[min/max]]=\"min\",-1*IF(Tabelle2[[#This Row],[Smart City]]-Tabelle2[[#This Row],[Urban Sprawl]]<0,-1*IF(ABS(Tabelle2[[#This Row],[Smart City]]-Tabelle2[[#This Row],[Urban Sprawl]])<Tabelle2[[#This Row],[q-Wert (Indifferenz)]], 0,IF(ABS(Tabelle2[[#This Row],[Smart City]]-Tabelle2[[#This Row],[Urban Sprawl]])>Tabelle2[[#This Row],[p-Wert (Präferenz)]],1,IF(AND(ABS(Tabelle2[[#This Row],[Smart City]]-Tabelle2[[#This Row],[Urban Sprawl]])<=Tabelle2[[#This Row],[p-Wert (Präferenz)]],ABS(Tabelle2[[#This Row],[Smart City]]-Tabelle2[[#This Row],[Urban Sprawl]])>=Tabelle2[[#This Row],[q-Wert (Indifferenz)]]),((ABS(Tabelle2[[#This Row],[Smart City]]-Tabelle2[[#This Row],[Urban Sprawl]])-Tabelle2[[#This Row],[q-Wert (Indifferenz)]])/(Tabelle2[[#This Row],[p-Wert (Präferenz)]]-Tabelle2[[#This Row],[q-Wert (Indifferenz)]]))))),IF(ABS(Tabelle2[[#This Row],[Smart City]]-Tabelle2[[#This Row],[Urban Sprawl]])<Tabelle2[[#This Row],[q-Wert (Indifferenz)]], 0,IF(ABS(Tabelle2[[#This Row],[Smart City]]-Tabelle2[[#This Row],[Urban Sprawl]])>Tabelle2[[#This Row],[p-Wert (Präferenz)]],1,IF(AND(ABS(Tabelle2[[#This Row],[Smart City]]-Tabelle2[[#This Row],[Urban Sprawl]])<=Tabelle2[[#This Row],[p-Wert (Präferenz)]],ABS(Tabelle2[[#This Row],[Smart City]]-Tabelle2[[#This Row],[Urban Sprawl]])>=Tabelle2[[#This Row],[q-Wert (Indifferenz)]]),((ABS(Tabelle2[[#This Row],[Smart City]]-Tabelle2[[#This Row],[Urban Sprawl]])-Tabelle2[[#This Row],[q-Wert (Indifferenz)]])/(Tabelle2[[#This Row],[p-Wert (Präferenz)]]-Tabelle2[[#This Row],[q-Wert (Indifferenz)]])))))),IF(Tabelle2[[#This Row],[Smart City]]-Tabelle2[[#This Row],[Urban Sprawl]]<0,-1*IF(ABS(Tabelle2[[#This Row],[Smart City]]-Tabelle2[[#This Row],[Urban Sprawl]])<Tabelle2[[#This Row],[q-Wert (Indifferenz)]], 0,IF(ABS(Tabelle2[[#This Row],[Smart City]]-Tabelle2[[#This Row],[Urban Sprawl]])>Tabelle2[[#This Row],[p-Wert (Präferenz)]],1,IF(AND(ABS(Tabelle2[[#This Row],[Smart City]]-Tabelle2[[#This Row],[Urban Sprawl]])<=Tabelle2[[#This Row],[p-Wert (Präferenz)]],ABS(Tabelle2[[#This Row],[Smart City]]-Tabelle2[[#This Row],[Urban Sprawl]])>=Tabelle2[[#This Row],[q-Wert (Indifferenz)]]),((ABS(Tabelle2[[#This Row],[Smart City]]-Tabelle2[[#This Row],[Urban Sprawl]])-Tabelle2[[#This Row],[q-Wert (Indifferenz)]])/(Tabelle2[[#This Row],[p-Wert (Präferenz)]]-Tabelle2[[#This Row],[q-Wert (Indifferenz)]]))))),IF(ABS(Tabelle2[[#This Row],[Smart City]]-Tabelle2[[#This Row],[Urban Sprawl]])<Tabelle2[[#This Row],[q-Wert (Indifferenz)]], 0,IF(ABS(Tabelle2[[#This Row],[Smart City]]-Tabelle2[[#This Row],[Urban Sprawl]])>Tabelle2[[#This Row],[p-Wert (Präferenz)]],1,IF(AND(ABS(Tabelle2[[#This Row],[Smart City]]-Tabelle2[[#This Row],[Urban Sprawl]])<=Tabelle2[[#This Row],[p-Wert (Präferenz)]],ABS(Tabelle2[[#This Row],[Smart City]]-Tabelle2[[#This Row],[Urban Sprawl]])>=Tabelle2[[#This Row],[q-Wert (Indifferenz)]]),((ABS(Tabelle2[[#This Row],[Smart City]]-Tabelle2[[#This Row],[Urban Sprawl]])-Tabelle2[[#This Row],[q-Wert (Indifferenz)]])/(Tabelle2[[#This Row],[p-Wert (Präferenz)]]-Tabelle2[[#This Row],[q-Wert (Indifferenz)]])))))))","v":0},{"$f":"IF(Tabelle2[[#This Row],[min/max]]=\"min\",-1*IF(Tabelle2[[#This Row],[Smart City]]-Tabelle2[[#This Row],[Business as usual]]<0,-1*IF(ABS(Tabelle2[[#This Row],[Smart City]]-Tabelle2[[#This Row],[Business as usual]])<Tabelle2[[#This Row],[q-Wert (Indifferenz)]], 0,IF(ABS(Tabelle2[[#This Row],[Smart City]]-Tabelle2[[#This Row],[Business as usual]])>Tabelle2[[#This Row],[p-Wert (Präferenz)]],1,IF(AND(ABS(Tabelle2[[#This Row],[Smart City]]-Tabelle2[[#This Row],[Business as usual]])<=Tabelle2[[#This Row],[p-Wert (Präferenz)]],ABS(Tabelle2[[#This Row],[Smart City]]-Tabelle2[[#This Row],[Business as usual]])>=Tabelle2[[#This Row],[q-Wert (Indifferenz)]]),((ABS(Tabelle2[[#This Row],[Smart City]]-Tabelle2[[#This Row],[Business as usual]])-Tabelle2[[#This Row],[q-Wert (Indifferenz)]])/(Tabelle2[[#This Row],[p-Wert (Präferenz)]]-Tabelle2[[#This Row],[q-Wert (Indifferenz)]]))))),IF(ABS(Tabelle2[[#This Row],[Smart City]]-Tabelle2[[#This Row],[Business as usual]])<Tabelle2[[#This Row],[q-Wert (Indifferenz)]], 0,IF(ABS(Tabelle2[[#This Row],[Smart City]]-Tabelle2[[#This Row],[Business as usual]])>Tabelle2[[#This Row],[p-Wert (Präferenz)]],1,IF(AND(ABS(Tabelle2[[#This Row],[Smart City]]-Tabelle2[[#This Row],[Business as usual]])<=Tabelle2[[#This Row],[p-Wert (Präferenz)]],ABS(Tabelle2[[#This Row],[Smart City]]-Tabelle2[[#This Row],[Business as usual]])>=Tabelle2[[#This Row],[q-Wert (Indifferenz)]]),((ABS(Tabelle2[[#This Row],[Smart City]]-Tabelle2[[#This Row],[Business as usual]])-Tabelle2[[#This Row],[q-Wert (Indifferenz)]])/(Tabelle2[[#This Row],[p-Wert (Präferenz)]]-Tabelle2[[#This Row],[q-Wert (Indifferenz)]])))))),IF(Tabelle2[[#This Row],[Smart City]]-Tabelle2[[#This Row],[Business as usual]]<0,-1*IF(ABS(Tabelle2[[#This Row],[Smart City]]-Tabelle2[[#This Row],[Business as usual]])<Tabelle2[[#This Row],[q-Wert (Indifferenz)]], 0,IF(ABS(Tabelle2[[#This Row],[Smart City]]-Tabelle2[[#This Row],[Business as usual]])>Tabelle2[[#This Row],[p-Wert (Präferenz)]],1,IF(AND(ABS(Tabelle2[[#This Row],[Smart City]]-Tabelle2[[#This Row],[Business as usual]])<=Tabelle2[[#This Row],[p-Wert (Präferenz)]],ABS(Tabelle2[[#This Row],[Smart City]]-Tabelle2[[#This Row],[Business as usual]])>=Tabelle2[[#This Row],[q-Wert (Indifferenz)]]),((ABS(Tabelle2[[#This Row],[Smart City]]-Tabelle2[[#This Row],[Business as usual]])-Tabelle2[[#This Row],[q-Wert (Indifferenz)]])/(Tabelle2[[#This Row],[p-Wert (Präferenz)]]-Tabelle2[[#This Row],[q-Wert (Indifferenz)]]))))),IF(ABS(Tabelle2[[#This Row],[Smart City]]-Tabelle2[[#This Row],[Business as usual]])<Tabelle2[[#This Row],[q-Wert (Indifferenz)]], 0,IF(ABS(Tabelle2[[#This Row],[Smart City]]-Tabelle2[[#This Row],[Business as usual]])>Tabelle2[[#This Row],[p-Wert (Präferenz)]],1,IF(AND(ABS(Tabelle2[[#This Row],[Smart City]]-Tabelle2[[#This Row],[Business as usual]])<=Tabelle2[[#This Row],[p-Wert (Präferenz)]],ABS(Tabelle2[[#This Row],[Smart City]]-Tabelle2[[#This Row],[Business as usual]])>=Tabelle2[[#This Row],[q-Wert (Indifferenz)]]),((ABS(Tabelle2[[#This Row],[Smart City]]-Tabelle2[[#This Row],[Business as usual]])-Tabelle2[[#This Row],[q-Wert (Indifferenz)]])/(Tabelle2[[#This Row],[p-Wert (Präferenz)]]-Tabelle2[[#This Row],[q-Wert (Indifferenz)]])))))))","v":2.6666666666666689E-2},null,{"$f":"IF(Tabelle2[[#This Row],[min/max]]=\"min\",-1*IF(Tabelle2[[#This Row],[Healthy City]]-Tabelle2[[#This Row],[Smart City]]<0,-1*IF(ABS(Tabelle2[[#This Row],[Healthy City]]-Tabelle2[[#This Row],[Smart City]])<Tabelle2[[#This Row],[q-Wert (Indifferenz)]], 0,IF(ABS(Tabelle2[[#This Row],[Healthy City]]-Tabelle2[[#This Row],[Smart City]])>Tabelle2[[#This Row],[p-Wert (Präferenz)]],1,IF(AND(ABS(Tabelle2[[#This Row],[Healthy City]]-Tabelle2[[#This Row],[Smart City]])<=Tabelle2[[#This Row],[p-Wert (Präferenz)]],ABS(Tabelle2[[#This Row],[Healthy City]]-Tabelle2[[#This Row],[Smart City]])>=Tabelle2[[#This Row],[q-Wert (Indifferenz)]]),((ABS(Tabelle2[[#This Row],[Healthy City]]-Tabelle2[[#This Row],[Smart City]])-Tabelle2[[#This Row],[q-Wert (Indifferenz)]])/(Tabelle2[[#This Row],[p-Wert (Präferenz)]]-Tabelle2[[#This Row],[q-Wert (Indifferenz)]]))))),IF(ABS(Tabelle2[[#This Row],[Healthy City]]-Tabelle2[[#This Row],[Smart City]])<Tabelle2[[#This Row],[q-Wert (Indifferenz)]], 0,IF(ABS(Tabelle2[[#This Row],[Healthy City]]-Tabelle2[[#This Row],[Smart City]])>Tabelle2[[#This Row],[p-Wert (Präferenz)]],1,IF(AND(ABS(Tabelle2[[#This Row],[Healthy City]]-Tabelle2[[#This Row],[Smart City]])<=Tabelle2[[#This Row],[p-Wert (Präferenz)]],ABS(Tabelle2[[#This Row],[Healthy City]]-Tabelle2[[#This Row],[Smart City]])>=Tabelle2[[#This Row],[q-Wert (Indifferenz)]]),((ABS(Tabelle2[[#This Row],[Healthy City]]-Tabelle2[[#This Row],[Smart City]])-Tabelle2[[#This Row],[q-Wert (Indifferenz)]])/(Tabelle2[[#This Row],[p-Wert (Präferenz)]]-Tabelle2[[#This Row],[q-Wert (Indifferenz)]])))))),IF(Tabelle2[[#This Row],[Healthy City]]-Tabelle2[[#This Row],[Smart City]]<0,-1*IF(ABS(Tabelle2[[#This Row],[Healthy City]]-Tabelle2[[#This Row],[Smart City]])<Tabelle2[[#This Row],[q-Wert (Indifferenz)]], 0,IF(ABS(Tabelle2[[#This Row],[Healthy City]]-Tabelle2[[#This Row],[Smart City]])>Tabelle2[[#This Row],[p-Wert (Präferenz)]],1,IF(AND(ABS(Tabelle2[[#This Row],[Healthy City]]-Tabelle2[[#This Row],[Smart City]])<=Tabelle2[[#This Row],[p-Wert (Präferenz)]],ABS(Tabelle2[[#This Row],[Healthy City]]-Tabelle2[[#This Row],[Smart City]])>=Tabelle2[[#This Row],[q-Wert (Indifferenz)]]),((ABS(Tabelle2[[#This Row],[Healthy City]]-Tabelle2[[#This Row],[Smart City]])-Tabelle2[[#This Row],[q-Wert (Indifferenz)]])/(Tabelle2[[#This Row],[p-Wert (Präferenz)]]-Tabelle2[[#This Row],[q-Wert (Indifferenz)]]))))),IF(ABS(Tabelle2[[#This Row],[Healthy City]]-Tabelle2[[#This Row],[Smart City]])<Tabelle2[[#This Row],[q-Wert (Indifferenz)]], 0,IF(ABS(Tabelle2[[#This Row],[Healthy City]]-Tabelle2[[#This Row],[Smart City]])>Tabelle2[[#This Row],[p-Wert (Präferenz)]],1,IF(AND(ABS(Tabelle2[[#This Row],[Healthy City]]-Tabelle2[[#This Row],[Smart City]])<=Tabelle2[[#This Row],[p-Wert (Präferenz)]],ABS(Tabelle2[[#This Row],[Healthy City]]-Tabelle2[[#This Row],[Smart City]])>=Tabelle2[[#This Row],[q-Wert (Indifferenz)]]),((ABS(Tabelle2[[#This Row],[Healthy City]]-Tabelle2[[#This Row],[Smart City]])-Tabelle2[[#This Row],[q-Wert (Indifferenz)]])/(Tabelle2[[#This Row],[p-Wert (Präferenz)]]-Tabelle2[[#This Row],[q-Wert (Indifferenz)]])))))))","v":0.69333333333333336},{"$f":"IF(Tabelle2[[#This Row],[min/max]]=\"min\",-1*IF(Tabelle2[[#This Row],[Healthy City]]-Tabelle2[[#This Row],[Urban Sprawl]]<0,-1*IF(ABS(Tabelle2[[#This Row],[Healthy City]]-Tabelle2[[#This Row],[Urban Sprawl]])<Tabelle2[[#This Row],[q-Wert (Indifferenz)]], 0,IF(ABS(Tabelle2[[#This Row],[Healthy City]]-Tabelle2[[#This Row],[Urban Sprawl]])>Tabelle2[[#This Row],[p-Wert (Präferenz)]],1,IF(AND(ABS(Tabelle2[[#This Row],[Healthy City]]-Tabelle2[[#This Row],[Urban Sprawl]])<=Tabelle2[[#This Row],[p-Wert (Präferenz)]],ABS(Tabelle2[[#This Row],[Healthy City]]-Tabelle2[[#This Row],[Urban Sprawl]])>=Tabelle2[[#This Row],[q-Wert (Indifferenz)]]),((ABS(Tabelle2[[#This Row],[Healthy City]]-Tabelle2[[#This Row],[Urban Sprawl]])-Tabelle2[[#This Row],[q-Wert (Indifferenz)]])/(Tabelle2[[#This Row],[p-Wert (Präferenz)]]-Tabelle2[[#This Row],[q-Wert (Indifferenz)]]))))),IF(ABS(Tabelle2[[#This Row],[Healthy City]]-Tabelle2[[#This Row],[Urban Sprawl]])<Tabelle2[[#This Row],[q-Wert (Indifferenz)]], 0,IF(ABS(Tabelle2[[#This Row],[Healthy City]]-Tabelle2[[#This Row],[Urban Sprawl]])>Tabelle2[[#This Row],[p-Wert (Präferenz)]],1,IF(AND(ABS(Tabelle2[[#This Row],[Healthy City]]-Tabelle2[[#This Row],[Urban Sprawl]])<=Tabelle2[[#This Row],[p-Wert (Präferenz)]],ABS(Tabelle2[[#This Row],[Healthy City]]-Tabelle2[[#This Row],[Urban Sprawl]])>=Tabelle2[[#This Row],[q-Wert (Indifferenz)]]),((ABS(Tabelle2[[#This Row],[Healthy City]]-Tabelle2[[#This Row],[Urban Sprawl]])-Tabelle2[[#This Row],[q-Wert (Indifferenz)]])/(Tabelle2[[#This Row],[p-Wert (Präferenz)]]-Tabelle2[[#This Row],[q-Wert (Indifferenz)]])))))),IF(Tabelle2[[#This Row],[Healthy City]]-Tabelle2[[#This Row],[Urban Sprawl]]<0,-1*IF(ABS(Tabelle2[[#This Row],[Healthy City]]-Tabelle2[[#This Row],[Urban Sprawl]])<Tabelle2[[#This Row],[q-Wert (Indifferenz)]], 0,IF(ABS(Tabelle2[[#This Row],[Healthy City]]-Tabelle2[[#This Row],[Urban Sprawl]])>Tabelle2[[#This Row],[p-Wert (Präferenz)]],1,IF(AND(ABS(Tabelle2[[#This Row],[Healthy City]]-Tabelle2[[#This Row],[Urban Sprawl]])<=Tabelle2[[#This Row],[p-Wert (Präferenz)]],ABS(Tabelle2[[#This Row],[Healthy City]]-Tabelle2[[#This Row],[Urban Sprawl]])>=Tabelle2[[#This Row],[q-Wert (Indifferenz)]]),((ABS(Tabelle2[[#This Row],[Healthy City]]-Tabelle2[[#This Row],[Urban Sprawl]])-Tabelle2[[#This Row],[q-Wert (Indifferenz)]])/(Tabelle2[[#This Row],[p-Wert (Präferenz)]]-Tabelle2[[#This Row],[q-Wert (Indifferenz)]]))))),IF(ABS(Tabelle2[[#This Row],[Healthy City]]-Tabelle2[[#This Row],[Urban Sprawl]])<Tabelle2[[#This Row],[q-Wert (Indifferenz)]], 0,IF(ABS(Tabelle2[[#This Row],[Healthy City]]-Tabelle2[[#This Row],[Urban Sprawl]])>Tabelle2[[#This Row],[p-Wert (Präferenz)]],1,IF(AND(ABS(Tabelle2[[#This Row],[Healthy City]]-Tabelle2[[#This Row],[Urban Sprawl]])<=Tabelle2[[#This Row],[p-Wert (Präferenz)]],ABS(Tabelle2[[#This Row],[Healthy City]]-Tabelle2[[#This Row],[Urban Sprawl]])>=Tabelle2[[#This Row],[q-Wert (Indifferenz)]]),((ABS(Tabelle2[[#This Row],[Healthy City]]-Tabelle2[[#This Row],[Urban Sprawl]])-Tabelle2[[#This Row],[q-Wert (Indifferenz)]])/(Tabelle2[[#This Row],[p-Wert (Präferenz)]]-Tabelle2[[#This Row],[q-Wert (Indifferenz)]])))))))","v":0.69333333333333336},{"$f":"IF(Tabelle2[[#This Row],[min/max]]=\"min\",-1*IF(Tabelle2[[#This Row],[Healthy City]]-Tabelle2[[#This Row],[Business as usual]]<0,-1*IF(ABS(Tabelle2[[#This Row],[Healthy City]]-Tabelle2[[#This Row],[Business as usual]])<Tabelle2[[#This Row],[q-Wert (Indifferenz)]], 0,IF(ABS(Tabelle2[[#This Row],[Healthy City]]-Tabelle2[[#This Row],[Business as usual]])>Tabelle2[[#This Row],[p-Wert (Präferenz)]],1,IF(AND(ABS(Tabelle2[[#This Row],[Healthy City]]-Tabelle2[[#This Row],[Business as usual]])<=Tabelle2[[#This Row],[p-Wert (Präferenz)]],ABS(Tabelle2[[#This Row],[Healthy City]]-Tabelle2[[#This Row],[Business as usual]])>=Tabelle2[[#This Row],[q-Wert (Indifferenz)]]),((ABS(Tabelle2[[#This Row],[Healthy City]]-Tabelle2[[#This Row],[Business as usual]])-Tabelle2[[#This Row],[q-Wert (Indifferenz)]])/(Tabelle2[[#This Row],[p-Wert (Präferenz)]]-Tabelle2[[#This Row],[q-Wert (Indifferenz)]]))))),IF(ABS(Tabelle2[[#This Row],[Healthy City]]-Tabelle2[[#This Row],[Business as usual]])<Tabelle2[[#This Row],[q-Wert (Indifferenz)]], 0,IF(ABS(Tabelle2[[#This Row],[Healthy City]]-Tabelle2[[#This Row],[Business as usual]])>Tabelle2[[#This Row],[p-Wert (Präferenz)]],1,IF(AND(ABS(Tabelle2[[#This Row],[Healthy City]]-Tabelle2[[#This Row],[Business as usual]])<=Tabelle2[[#This Row],[p-Wert (Präferenz)]],ABS(Tabelle2[[#This Row],[Healthy City]]-Tabelle2[[#This Row],[Business as usual]])>=Tabelle2[[#This Row],[q-Wert (Indifferenz)]]),((ABS(Tabelle2[[#This Row],[Healthy City]]-Tabelle2[[#This Row],[Business as usual]])-Tabelle2[[#This Row],[q-Wert (Indifferenz)]])/(Tabelle2[[#This Row],[p-Wert (Präferenz)]]-Tabelle2[[#This Row],[q-Wert (Indifferenz)]])))))),IF(Tabelle2[[#This Row],[Healthy City]]-Tabelle2[[#This Row],[Business as usual]]<0,-1*IF(ABS(Tabelle2[[#This Row],[Healthy City]]-Tabelle2[[#This Row],[Business as usual]])<Tabelle2[[#This Row],[q-Wert (Indifferenz)]], 0,IF(ABS(Tabelle2[[#This Row],[Healthy City]]-Tabelle2[[#This Row],[Business as usual]])>Tabelle2[[#This Row],[p-Wert (Präferenz)]],1,IF(AND(ABS(Tabelle2[[#This Row],[Healthy City]]-Tabelle2[[#This Row],[Business as usual]])<=Tabelle2[[#This Row],[p-Wert (Präferenz)]],ABS(Tabelle2[[#This Row],[Healthy City]]-Tabelle2[[#This Row],[Business as usual]])>=Tabelle2[[#This Row],[q-Wert (Indifferenz)]]),((ABS(Tabelle2[[#This Row],[Healthy City]]-Tabelle2[[#This Row],[Business as usual]])-Tabelle2[[#This Row],[q-Wert (Indifferenz)]])/(Tabelle2[[#This Row],[p-Wert (Präferenz)]]-Tabelle2[[#This Row],[q-Wert (Indifferenz)]]))))),IF(ABS(Tabelle2[[#This Row],[Healthy City]]-Tabelle2[[#This Row],[Business as usual]])<Tabelle2[[#This Row],[q-Wert (Indifferenz)]], 0,IF(ABS(Tabelle2[[#This Row],[Healthy City]]-Tabelle2[[#This Row],[Business as usual]])>Tabelle2[[#This Row],[p-Wert (Präferenz)]],1,IF(AND(ABS(Tabelle2[[#This Row],[Healthy City]]-Tabelle2[[#This Row],[Business as usual]])<=Tabelle2[[#This Row],[p-Wert (Präferenz)]],ABS(Tabelle2[[#This Row],[Healthy City]]-Tabelle2[[#This Row],[Business as usual]])>=Tabelle2[[#This Row],[q-Wert (Indifferenz)]]),((ABS(Tabelle2[[#This Row],[Healthy City]]-Tabelle2[[#This Row],[Business as usual]])-Tabelle2[[#This Row],[q-Wert (Indifferenz)]])/(Tabelle2[[#This Row],[p-Wert (Präferenz)]]-Tabelle2[[#This Row],[q-Wert (Indifferenz)]])))))))","v":1},null,{"$f":"IF(Tabelle2[[#This Row],[min/max]]=\"min\",-1*IF(Tabelle2[[#This Row],[Urban Sprawl]]-Tabelle2[[#This Row],[Smart City]]<0,-1*IF(ABS(Tabelle2[[#This Row],[Urban Sprawl]]-Tabelle2[[#This Row],[Smart City]])<Tabelle2[[#This Row],[q-Wert (Indifferenz)]], 0,IF(ABS(Tabelle2[[#This Row],[Urban Sprawl]]-Tabelle2[[#This Row],[Smart City]])>Tabelle2[[#This Row],[p-Wert (Präferenz)]],1,IF(AND(ABS(Tabelle2[[#This Row],[Urban Sprawl]]-Tabelle2[[#This Row],[Smart City]])<=Tabelle2[[#This Row],[p-Wert (Präferenz)]],ABS(Tabelle2[[#This Row],[Urban Sprawl]]-Tabelle2[[#This Row],[Smart City]])>=Tabelle2[[#This Row],[q-Wert (Indifferenz)]]),((ABS(Tabelle2[[#This Row],[Urban Sprawl]]-Tabelle2[[#This Row],[Smart City]])-Tabelle2[[#This Row],[q-Wert (Indifferenz)]])/(Tabelle2[[#This Row],[p-Wert (Präferenz)]]-Tabelle2[[#This Row],[q-Wert (Indifferenz)]]))))),IF(ABS(Tabelle2[[#This Row],[Urban Sprawl]]-Tabelle2[[#This Row],[Smart City]])<Tabelle2[[#This Row],[q-Wert (Indifferenz)]], 0,IF(ABS(Tabelle2[[#This Row],[Urban Sprawl]]-Tabelle2[[#This Row],[Smart City]])>Tabelle2[[#This Row],[p-Wert (Präferenz)]],1,IF(AND(ABS(Tabelle2[[#This Row],[Urban Sprawl]]-Tabelle2[[#This Row],[Smart City]])<=Tabelle2[[#This Row],[p-Wert (Präferenz)]],ABS(Tabelle2[[#This Row],[Urban Sprawl]]-Tabelle2[[#This Row],[Smart City]])>=Tabelle2[[#This Row],[q-Wert (Indifferenz)]]),((ABS(Tabelle2[[#This Row],[Urban Sprawl]]-Tabelle2[[#This Row],[Smart City]])-Tabelle2[[#This Row],[q-Wert (Indifferenz)]])/(Tabelle2[[#This Row],[p-Wert (Präferenz)]]-Tabelle2[[#This Row],[q-Wert (Indifferenz)]])))))),IF(Tabelle2[[#This Row],[Urban Sprawl]]-Tabelle2[[#This Row],[Smart City]]<0,-1*IF(ABS(Tabelle2[[#This Row],[Urban Sprawl]]-Tabelle2[[#This Row],[Smart City]])<Tabelle2[[#This Row],[q-Wert (Indifferenz)]], 0,IF(ABS(Tabelle2[[#This Row],[Urban Sprawl]]-Tabelle2[[#This Row],[Smart City]])>Tabelle2[[#This Row],[p-Wert (Präferenz)]],1,IF(AND(ABS(Tabelle2[[#This Row],[Urban Sprawl]]-Tabelle2[[#This Row],[Smart City]])<=Tabelle2[[#This Row],[p-Wert (Präferenz)]],ABS(Tabelle2[[#This Row],[Urban Sprawl]]-Tabelle2[[#This Row],[Smart City]])>=Tabelle2[[#This Row],[q-Wert (Indifferenz)]]),((ABS(Tabelle2[[#This Row],[Urban Sprawl]]-Tabelle2[[#This Row],[Smart City]])-Tabelle2[[#This Row],[q-Wert (Indifferenz)]])/(Tabelle2[[#This Row],[p-Wert (Präferenz)]]-Tabelle2[[#This Row],[q-Wert (Indifferenz)]]))))),IF(ABS(Tabelle2[[#This Row],[Urban Sprawl]]-Tabelle2[[#This Row],[Smart City]])<Tabelle2[[#This Row],[q-Wert (Indifferenz)]], 0,IF(ABS(Tabelle2[[#This Row],[Urban Sprawl]]-Tabelle2[[#This Row],[Smart City]])>Tabelle2[[#This Row],[p-Wert (Präferenz)]],1,IF(AND(ABS(Tabelle2[[#This Row],[Urban Sprawl]]-Tabelle2[[#This Row],[Smart City]])<=Tabelle2[[#This Row],[p-Wert (Präferenz)]],ABS(Tabelle2[[#This Row],[Urban Sprawl]]-Tabelle2[[#This Row],[Smart City]])>=Tabelle2[[#This Row],[q-Wert (Indifferenz)]]),((ABS(Tabelle2[[#This Row],[Urban Sprawl]]-Tabelle2[[#This Row],[Smart City]])-Tabelle2[[#This Row],[q-Wert (Indifferenz)]])/(Tabelle2[[#This Row],[p-Wert (Präferenz)]]-Tabelle2[[#This Row],[q-Wert (Indifferenz)]])))))))","v":0},{"$f":"IF(Tabelle2[[#This Row],[min/max]]=\"min\",-1*IF(Tabelle2[[#This Row],[Urban Sprawl]]-Tabelle2[[#This Row],[Healthy City]]<0,-1*IF(ABS(Tabelle2[[#This Row],[Urban Sprawl]]-Tabelle2[[#This Row],[Healthy City]])<Tabelle2[[#This Row],[q-Wert (Indifferenz)]], 0,IF(ABS(Tabelle2[[#This Row],[Urban Sprawl]]-Tabelle2[[#This Row],[Healthy City]])>Tabelle2[[#This Row],[p-Wert (Präferenz)]],1,IF(AND(ABS(Tabelle2[[#This Row],[Urban Sprawl]]-Tabelle2[[#This Row],[Healthy City]])<=Tabelle2[[#This Row],[p-Wert (Präferenz)]],ABS(Tabelle2[[#This Row],[Urban Sprawl]]-Tabelle2[[#This Row],[Healthy City]])>=Tabelle2[[#This Row],[q-Wert (Indifferenz)]]),((ABS(Tabelle2[[#This Row],[Urban Sprawl]]-Tabelle2[[#This Row],[Healthy City]])-Tabelle2[[#This Row],[q-Wert (Indifferenz)]])/(Tabelle2[[#This Row],[p-Wert (Präferenz)]]-Tabelle2[[#This Row],[q-Wert (Indifferenz)]]))))),IF(ABS(Tabelle2[[#This Row],[Urban Sprawl]]-Tabelle2[[#This Row],[Healthy City]])<Tabelle2[[#This Row],[q-Wert (Indifferenz)]], 0,IF(ABS(Tabelle2[[#This Row],[Urban Sprawl]]-Tabelle2[[#This Row],[Healthy City]])>Tabelle2[[#This Row],[p-Wert (Präferenz)]],1,IF(AND(ABS(Tabelle2[[#This Row],[Urban Sprawl]]-Tabelle2[[#This Row],[Healthy City]])<=Tabelle2[[#This Row],[p-Wert (Präferenz)]],ABS(Tabelle2[[#This Row],[Urban Sprawl]]-Tabelle2[[#This Row],[Healthy City]])>=Tabelle2[[#This Row],[q-Wert (Indifferenz)]]),((ABS(Tabelle2[[#This Row],[Urban Sprawl]]-Tabelle2[[#This Row],[Healthy City]])-Tabelle2[[#This Row],[q-Wert (Indifferenz)]])/(Tabelle2[[#This Row],[p-Wert (Präferenz)]]-Tabelle2[[#This Row],[q-Wert (Indifferenz)]])))))),IF(Tabelle2[[#This Row],[Urban Sprawl]]-Tabelle2[[#This Row],[Healthy City]]<0,-1*IF(ABS(Tabelle2[[#This Row],[Urban Sprawl]]-Tabelle2[[#This Row],[Healthy City]])<Tabelle2[[#This Row],[q-Wert (Indifferenz)]], 0,IF(ABS(Tabelle2[[#This Row],[Urban Sprawl]]-Tabelle2[[#This Row],[Healthy City]])>Tabelle2[[#This Row],[p-Wert (Präferenz)]],1,IF(AND(ABS(Tabelle2[[#This Row],[Urban Sprawl]]-Tabelle2[[#This Row],[Healthy City]])<=Tabelle2[[#This Row],[p-Wert (Präferenz)]],ABS(Tabelle2[[#This Row],[Urban Sprawl]]-Tabelle2[[#This Row],[Healthy City]])>=Tabelle2[[#This Row],[q-Wert (Indifferenz)]]),((ABS(Tabelle2[[#This Row],[Urban Sprawl]]-Tabelle2[[#This Row],[Healthy City]])-Tabelle2[[#This Row],[q-Wert (Indifferenz)]])/(Tabelle2[[#This Row],[p-Wert (Präferenz)]]-Tabelle2[[#This Row],[q-Wert (Indifferenz)]]))))),IF(ABS(Tabelle2[[#This Row],[Urban Sprawl]]-Tabelle2[[#This Row],[Healthy City]])<Tabelle2[[#This Row],[q-Wert (Indifferenz)]], 0,IF(ABS(Tabelle2[[#This Row],[Urban Sprawl]]-Tabelle2[[#This Row],[Healthy City]])>Tabelle2[[#This Row],[p-Wert (Präferenz)]],1,IF(AND(ABS(Tabelle2[[#This Row],[Urban Sprawl]]-Tabelle2[[#This Row],[Healthy City]])<=Tabelle2[[#This Row],[p-Wert (Präferenz)]],ABS(Tabelle2[[#This Row],[Urban Sprawl]]-Tabelle2[[#This Row],[Healthy City]])>=Tabelle2[[#This Row],[q-Wert (Indifferenz)]]),((ABS(Tabelle2[[#This Row],[Urban Sprawl]]-Tabelle2[[#This Row],[Healthy City]])-Tabelle2[[#This Row],[q-Wert (Indifferenz)]])/(Tabelle2[[#This Row],[p-Wert (Präferenz)]]-Tabelle2[[#This Row],[q-Wert (Indifferenz)]])))))))","v":-0.69333333333333336},{"$f":"IF(Tabelle2[[#This Row],[min/max]]=\"min\",-1*IF(Tabelle2[[#This Row],[Urban Sprawl]]-Tabelle2[[#This Row],[Business as usual]]<0,-1*IF(ABS(Tabelle2[[#This Row],[Urban Sprawl]]-Tabelle2[[#This Row],[Business as usual]])<Tabelle2[[#This Row],[q-Wert (Indifferenz)]], 0,IF(ABS(Tabelle2[[#This Row],[Urban Sprawl]]-Tabelle2[[#This Row],[Business as usual]])>Tabelle2[[#This Row],[p-Wert (Präferenz)]],1,IF(AND(ABS(Tabelle2[[#This Row],[Urban Sprawl]]-Tabelle2[[#This Row],[Business as usual]])<=Tabelle2[[#This Row],[p-Wert (Präferenz)]],ABS(Tabelle2[[#This Row],[Urban Sprawl]]-Tabelle2[[#This Row],[Business as usual]])>=Tabelle2[[#This Row],[q-Wert (Indifferenz)]]),((ABS(Tabelle2[[#This Row],[Urban Sprawl]]-Tabelle2[[#This Row],[Business as usual]])-Tabelle2[[#This Row],[q-Wert (Indifferenz)]])/(Tabelle2[[#This Row],[p-Wert (Präferenz)]]-Tabelle2[[#This Row],[q-Wert (Indifferenz)]]))))),IF(ABS(Tabelle2[[#This Row],[Urban Sprawl]]-Tabelle2[[#This Row],[Business as usual]])<Tabelle2[[#This Row],[q-Wert (Indifferenz)]], 0,IF(ABS(Tabelle2[[#This Row],[Urban Sprawl]]-Tabelle2[[#This Row],[Business as usual]])>Tabelle2[[#This Row],[p-Wert (Präferenz)]],1,IF(AND(ABS(Tabelle2[[#This Row],[Urban Sprawl]]-Tabelle2[[#This Row],[Business as usual]])<=Tabelle2[[#This Row],[p-Wert (Präferenz)]],ABS(Tabelle2[[#This Row],[Urban Sprawl]]-Tabelle2[[#This Row],[Business as usual]])>=Tabelle2[[#This Row],[q-Wert (Indifferenz)]]),((ABS(Tabelle2[[#This Row],[Urban Sprawl]]-Tabelle2[[#This Row],[Business as usual]])-Tabelle2[[#This Row],[q-Wert (Indifferenz)]])/(Tabelle2[[#This Row],[p-Wert (Präferenz)]]-Tabelle2[[#This Row],[q-Wert (Indifferenz)]])))))),IF(Tabelle2[[#This Row],[Urban Sprawl]]-Tabelle2[[#This Row],[Business as usual]]<0,-1*IF(ABS(Tabelle2[[#This Row],[Urban Sprawl]]-Tabelle2[[#This Row],[Business as usual]])<Tabelle2[[#This Row],[q-Wert (Indifferenz)]], 0,IF(ABS(Tabelle2[[#This Row],[Urban Sprawl]]-Tabelle2[[#This Row],[Business as usual]])>Tabelle2[[#This Row],[p-Wert (Präferenz)]],1,IF(AND(ABS(Tabelle2[[#This Row],[Urban Sprawl]]-Tabelle2[[#This Row],[Business as usual]])<=Tabelle2[[#This Row],[p-Wert (Präferenz)]],ABS(Tabelle2[[#This Row],[Urban Sprawl]]-Tabelle2[[#This Row],[Business as usual]])>=Tabelle2[[#This Row],[q-Wert (Indifferenz)]]),((ABS(Tabelle2[[#This Row],[Urban Sprawl]]-Tabelle2[[#This Row],[Business as usual]])-Tabelle2[[#This Row],[q-Wert (Indifferenz)]])/(Tabelle2[[#This Row],[p-Wert (Präferenz)]]-Tabelle2[[#This Row],[q-Wert (Indifferenz)]]))))),IF(ABS(Tabelle2[[#This Row],[Urban Sprawl]]-Tabelle2[[#This Row],[Business as usual]])<Tabelle2[[#This Row],[q-Wert (Indifferenz)]], 0,IF(ABS(Tabelle2[[#This Row],[Urban Sprawl]]-Tabelle2[[#This Row],[Business as usual]])>Tabelle2[[#This Row],[p-Wert (Präferenz)]],1,IF(AND(ABS(Tabelle2[[#This Row],[Urban Sprawl]]-Tabelle2[[#This Row],[Business as usual]])<=Tabelle2[[#This Row],[p-Wert (Präferenz)]],ABS(Tabelle2[[#This Row],[Urban Sprawl]]-Tabelle2[[#This Row],[Business as usual]])>=Tabelle2[[#This Row],[q-Wert (Indifferenz)]]),((ABS(Tabelle2[[#This Row],[Urban Sprawl]]-Tabelle2[[#This Row],[Business as usual]])-Tabelle2[[#This Row],[q-Wert (Indifferenz)]])/(Tabelle2[[#This Row],[p-Wert (Präferenz)]]-Tabelle2[[#This Row],[q-Wert (Indifferenz)]])))))))","v":2.6666666666666689E-2},null,{"$f":"IF(Tabelle2[[#This Row],[min/max]]=\"min\",-1*IF(Tabelle2[[#This Row],[Business as usual]]-Tabelle2[[#This Row],[Smart City]]<0,-1*IF(ABS(Tabelle2[[#This Row],[Business as usual]]-Tabelle2[[#This Row],[Smart City]])<Tabelle2[[#This Row],[q-Wert (Indifferenz)]], 0,IF(ABS(Tabelle2[[#This Row],[Business as usual]]-Tabelle2[[#This Row],[Smart City]])>Tabelle2[[#This Row],[p-Wert (Präferenz)]],1,IF(AND(ABS(Tabelle2[[#This Row],[Business as usual]]-Tabelle2[[#This Row],[Smart City]])<=Tabelle2[[#This Row],[p-Wert (Präferenz)]],ABS(Tabelle2[[#This Row],[Business as usual]]-Tabelle2[[#This Row],[Smart City]])>=Tabelle2[[#This Row],[q-Wert (Indifferenz)]]),((ABS(Tabelle2[[#This Row],[Business as usual]]-Tabelle2[[#This Row],[Smart City]])-Tabelle2[[#This Row],[q-Wert (Indifferenz)]])/(Tabelle2[[#This Row],[p-Wert (Präferenz)]]-Tabelle2[[#This Row],[q-Wert (Indifferenz)]]))))),IF(ABS(Tabelle2[[#This Row],[Business as usual]]-Tabelle2[[#This Row],[Smart City]])<Tabelle2[[#This Row],[q-Wert (Indifferenz)]], 0,IF(ABS(Tabelle2[[#This Row],[Business as usual]]-Tabelle2[[#This Row],[Smart City]])>Tabelle2[[#This Row],[p-Wert (Präferenz)]],1,IF(AND(ABS(Tabelle2[[#This Row],[Business as usual]]-Tabelle2[[#This Row],[Smart City]])<=Tabelle2[[#This Row],[p-Wert (Präferenz)]],ABS(Tabelle2[[#This Row],[Business as usual]]-Tabelle2[[#This Row],[Smart City]])>=Tabelle2[[#This Row],[q-Wert (Indifferenz)]]),((ABS(Tabelle2[[#This Row],[Business as usual]]-Tabelle2[[#This Row],[Smart City]])-Tabelle2[[#This Row],[q-Wert (Indifferenz)]])/(Tabelle2[[#This Row],[p-Wert (Präferenz)]]-Tabelle2[[#This Row],[q-Wert (Indifferenz)]])))))),IF(Tabelle2[[#This Row],[Business as usual]]-Tabelle2[[#This Row],[Smart City]]<0,-1*IF(ABS(Tabelle2[[#This Row],[Business as usual]]-Tabelle2[[#This Row],[Smart City]])<Tabelle2[[#This Row],[q-Wert (Indifferenz)]], 0,IF(ABS(Tabelle2[[#This Row],[Business as usual]]-Tabelle2[[#This Row],[Smart City]])>Tabelle2[[#This Row],[p-Wert (Präferenz)]],1,IF(AND(ABS(Tabelle2[[#This Row],[Business as usual]]-Tabelle2[[#This Row],[Smart City]])<=Tabelle2[[#This Row],[p-Wert (Präferenz)]],ABS(Tabelle2[[#This Row],[Business as usual]]-Tabelle2[[#This Row],[Smart City]])>=Tabelle2[[#This Row],[q-Wert (Indifferenz)]]),((ABS(Tabelle2[[#This Row],[Business as usual]]-Tabelle2[[#This Row],[Smart City]])-Tabelle2[[#This Row],[q-Wert (Indifferenz)]])/(Tabelle2[[#This Row],[p-Wert (Präferenz)]]-Tabelle2[[#This Row],[q-Wert (Indifferenz)]]))))),IF(ABS(Tabelle2[[#This Row],[Business as usual]]-Tabelle2[[#This Row],[Smart City]])<Tabelle2[[#This Row],[q-Wert (Indifferenz)]], 0,IF(ABS(Tabelle2[[#This Row],[Business as usual]]-Tabelle2[[#This Row],[Smart City]])>Tabelle2[[#This Row],[p-Wert (Präferenz)]],1,IF(AND(ABS(Tabelle2[[#This Row],[Business as usual]]-Tabelle2[[#This Row],[Smart City]])<=Tabelle2[[#This Row],[p-Wert (Präferenz)]],ABS(Tabelle2[[#This Row],[Business as usual]]-Tabelle2[[#This Row],[Smart City]])>=Tabelle2[[#This Row],[q-Wert (Indifferenz)]]),((ABS(Tabelle2[[#This Row],[Business as usual]]-Tabelle2[[#This Row],[Smart City]])-Tabelle2[[#This Row],[q-Wert (Indifferenz)]])/(Tabelle2[[#This Row],[p-Wert (Präferenz)]]-Tabelle2[[#This Row],[q-Wert (Indifferenz)]])))))))","v":-2.6666666666666689E-2},{"$f":"IF(Tabelle2[[#This Row],[min/max]]=\"min\",-1*IF(Tabelle2[[#This Row],[Business as usual]]-Tabelle2[[#This Row],[Healthy City]]<0,-1*IF(ABS(Tabelle2[[#This Row],[Business as usual]]-Tabelle2[[#This Row],[Healthy City]])<Tabelle2[[#This Row],[q-Wert (Indifferenz)]], 0,IF(ABS(Tabelle2[[#This Row],[Business as usual]]-Tabelle2[[#This Row],[Healthy City]])>Tabelle2[[#This Row],[p-Wert (Präferenz)]],1,IF(AND(ABS(Tabelle2[[#This Row],[Business as usual]]-Tabelle2[[#This Row],[Healthy City]])<=Tabelle2[[#This Row],[p-Wert (Präferenz)]],ABS(Tabelle2[[#This Row],[Business as usual]]-Tabelle2[[#This Row],[Healthy City]])>=Tabelle2[[#This Row],[q-Wert (Indifferenz)]]),((ABS(Tabelle2[[#This Row],[Business as usual]]-Tabelle2[[#This Row],[Healthy City]])-Tabelle2[[#This Row],[q-Wert (Indifferenz)]])/(Tabelle2[[#This Row],[p-Wert (Präferenz)]]-Tabelle2[[#This Row],[q-Wert (Indifferenz)]]))))),IF(ABS(Tabelle2[[#This Row],[Business as usual]]-Tabelle2[[#This Row],[Healthy City]])<Tabelle2[[#This Row],[q-Wert (Indifferenz)]], 0,IF(ABS(Tabelle2[[#This Row],[Business as usual]]-Tabelle2[[#This Row],[Healthy City]])>Tabelle2[[#This Row],[p-Wert (Präferenz)]],1,IF(AND(ABS(Tabelle2[[#This Row],[Business as usual]]-Tabelle2[[#This Row],[Healthy City]])<=Tabelle2[[#This Row],[p-Wert (Präferenz)]],ABS(Tabelle2[[#This Row],[Business as usual]]-Tabelle2[[#This Row],[Healthy City]])>=Tabelle2[[#This Row],[q-Wert (Indifferenz)]]),((ABS(Tabelle2[[#This Row],[Business as usual]]-Tabelle2[[#This Row],[Healthy City]])-Tabelle2[[#This Row],[q-Wert (Indifferenz)]])/(Tabelle2[[#This Row],[p-Wert (Präferenz)]]-Tabelle2[[#This Row],[q-Wert (Indifferenz)]])))))),IF(Tabelle2[[#This Row],[Business as usual]]-Tabelle2[[#This Row],[Healthy City]]<0,-1*IF(ABS(Tabelle2[[#This Row],[Business as usual]]-Tabelle2[[#This Row],[Healthy City]])<Tabelle2[[#This Row],[q-Wert (Indifferenz)]], 0,IF(ABS(Tabelle2[[#This Row],[Business as usual]]-Tabelle2[[#This Row],[Healthy City]])>Tabelle2[[#This Row],[p-Wert (Präferenz)]],1,IF(AND(ABS(Tabelle2[[#This Row],[Business as usual]]-Tabelle2[[#This Row],[Healthy City]])<=Tabelle2[[#This Row],[p-Wert (Präferenz)]],ABS(Tabelle2[[#This Row],[Business as usual]]-Tabelle2[[#This Row],[Healthy City]])>=Tabelle2[[#This Row],[q-Wert (Indifferenz)]]),((ABS(Tabelle2[[#This Row],[Business as usual]]-Tabelle2[[#This Row],[Healthy City]])-Tabelle2[[#This Row],[q-Wert (Indifferenz)]])/(Tabelle2[[#This Row],[p-Wert (Präferenz)]]-Tabelle2[[#This Row],[q-Wert (Indifferenz)]]))))),IF(ABS(Tabelle2[[#This Row],[Business as usual]]-Tabelle2[[#This Row],[Healthy City]])<Tabelle2[[#This Row],[q-Wert (Indifferenz)]], 0,IF(ABS(Tabelle2[[#This Row],[Business as usual]]-Tabelle2[[#This Row],[Healthy City]])>Tabelle2[[#This Row],[p-Wert (Präferenz)]],1,IF(AND(ABS(Tabelle2[[#This Row],[Business as usual]]-Tabelle2[[#This Row],[Healthy City]])<=Tabelle2[[#This Row],[p-Wert (Präferenz)]],ABS(Tabelle2[[#This Row],[Business as usual]]-Tabelle2[[#This Row],[Healthy City]])>=Tabelle2[[#This Row],[q-Wert (Indifferenz)]]),((ABS(Tabelle2[[#This Row],[Business as usual]]-Tabelle2[[#This Row],[Healthy City]])-Tabelle2[[#This Row],[q-Wert (Indifferenz)]])/(Tabelle2[[#This Row],[p-Wert (Präferenz)]]-Tabelle2[[#This Row],[q-Wert (Indifferenz)]])))))))","v":-1},{"$f":"IF(Tabelle2[[#This Row],[min/max]]=\"min\",-1*IF(Tabelle2[[#This Row],[Business as usual]]-Tabelle2[[#This Row],[Urban Sprawl]]<0,-1*IF(ABS(Tabelle2[[#This Row],[Business as usual]]-Tabelle2[[#This Row],[Urban Sprawl]])<Tabelle2[[#This Row],[q-Wert (Indifferenz)]], 0,IF(ABS(Tabelle2[[#This Row],[Business as usual]]-Tabelle2[[#This Row],[Urban Sprawl]])>Tabelle2[[#This Row],[p-Wert (Präferenz)]],1,IF(AND(ABS(Tabelle2[[#This Row],[Business as usual]]-Tabelle2[[#This Row],[Urban Sprawl]])<=Tabelle2[[#This Row],[p-Wert (Präferenz)]],ABS(Tabelle2[[#This Row],[Business as usual]]-Tabelle2[[#This Row],[Urban Sprawl]])>=Tabelle2[[#This Row],[q-Wert (Indifferenz)]]),((ABS(Tabelle2[[#This Row],[Business as usual]]-Tabelle2[[#This Row],[Urban Sprawl]])-Tabelle2[[#This Row],[q-Wert (Indifferenz)]])/(Tabelle2[[#This Row],[p-Wert (Präferenz)]]-Tabelle2[[#This Row],[q-Wert (Indifferenz)]]))))),IF(ABS(Tabelle2[[#This Row],[Business as usual]]-Tabelle2[[#This Row],[Urban Sprawl]])<Tabelle2[[#This Row],[q-Wert (Indifferenz)]], 0,IF(ABS(Tabelle2[[#This Row],[Business as usual]]-Tabelle2[[#This Row],[Urban Sprawl]])>Tabelle2[[#This Row],[p-Wert (Präferenz)]],1,IF(AND(ABS(Tabelle2[[#This Row],[Business as usual]]-Tabelle2[[#This Row],[Urban Sprawl]])<=Tabelle2[[#This Row],[p-Wert (Präferenz)]],ABS(Tabelle2[[#This Row],[Business as usual]]-Tabelle2[[#This Row],[Urban Sprawl]])>=Tabelle2[[#This Row],[q-Wert (Indifferenz)]]),((ABS(Tabelle2[[#This Row],[Business as usual]]-Tabelle2[[#This Row],[Urban Sprawl]])-Tabelle2[[#This Row],[q-Wert (Indifferenz)]])/(Tabelle2[[#This Row],[p-Wert (Präferenz)]]-Tabelle2[[#This Row],[q-Wert (Indifferenz)]])))))),IF(Tabelle2[[#This Row],[Business as usual]]-Tabelle2[[#This Row],[Urban Sprawl]]<0,-1*IF(ABS(Tabelle2[[#This Row],[Business as usual]]-Tabelle2[[#This Row],[Urban Sprawl]])<Tabelle2[[#This Row],[q-Wert (Indifferenz)]], 0,IF(ABS(Tabelle2[[#This Row],[Business as usual]]-Tabelle2[[#This Row],[Urban Sprawl]])>Tabelle2[[#This Row],[p-Wert (Präferenz)]],1,IF(AND(ABS(Tabelle2[[#This Row],[Business as usual]]-Tabelle2[[#This Row],[Urban Sprawl]])<=Tabelle2[[#This Row],[p-Wert (Präferenz)]],ABS(Tabelle2[[#This Row],[Business as usual]]-Tabelle2[[#This Row],[Urban Sprawl]])>=Tabelle2[[#This Row],[q-Wert (Indifferenz)]]),((ABS(Tabelle2[[#This Row],[Business as usual]]-Tabelle2[[#This Row],[Urban Sprawl]])-Tabelle2[[#This Row],[q-Wert (Indifferenz)]])/(Tabelle2[[#This Row],[p-Wert (Präferenz)]]-Tabelle2[[#This Row],[q-Wert (Indifferenz)]]))))),IF(ABS(Tabelle2[[#This Row],[Business as usual]]-Tabelle2[[#This Row],[Urban Sprawl]])<Tabelle2[[#This Row],[q-Wert (Indifferenz)]], 0,IF(ABS(Tabelle2[[#This Row],[Business as usual]]-Tabelle2[[#This Row],[Urban Sprawl]])>Tabelle2[[#This Row],[p-Wert (Präferenz)]],1,IF(AND(ABS(Tabelle2[[#This Row],[Business as usual]]-Tabelle2[[#This Row],[Urban Sprawl]])<=Tabelle2[[#This Row],[p-Wert (Präferenz)]],ABS(Tabelle2[[#This Row],[Business as usual]]-Tabelle2[[#This Row],[Urban Sprawl]])>=Tabelle2[[#This Row],[q-Wert (Indifferenz)]]),((ABS(Tabelle2[[#This Row],[Business as usual]]-Tabelle2[[#This Row],[Urban Sprawl]])-Tabelle2[[#This Row],[q-Wert (Indifferenz)]])/(Tabelle2[[#This Row],[p-Wert (Präferenz)]]-Tabelle2[[#This Row],[q-Wert (Indifferenz)]])))))))","v":-2.6666666666666689E-2}]
[null,null,null,"Fahrtkosten",{"$f":"('\"Walking Weights\"'!D12)/100","v":5.5555555555555552E-2},"min","Cent/km",15,22.5,7.5,7.5,"Typ 5",5.2,13.9,{"$f":"IF(Tabelle2[[#This Row],[min/max]]=\"min\",-1*IF(Tabelle2[[#This Row],[Smart City]]-Tabelle2[[#This Row],[Healthy City]]<0,-1*IF(ABS(Tabelle2[[#This Row],[Smart City]]-Tabelle2[[#This Row],[Healthy City]])<Tabelle2[[#This Row],[q-Wert (Indifferenz)]], 0,IF(ABS(Tabelle2[[#This Row],[Smart City]]-Tabelle2[[#This Row],[Healthy City]])>Tabelle2[[#This Row],[p-Wert (Präferenz)]],1,IF(AND(ABS(Tabelle2[[#This Row],[Smart City]]-Tabelle2[[#This Row],[Healthy City]])<=Tabelle2[[#This Row],[p-Wert (Präferenz)]],ABS(Tabelle2[[#This Row],[Smart City]]-Tabelle2[[#This Row],[Healthy City]])>=Tabelle2[[#This Row],[q-Wert (Indifferenz)]]),((ABS(Tabelle2[[#This Row],[Smart City]]-Tabelle2[[#This Row],[Healthy City]])-Tabelle2[[#This Row],[q-Wert (Indifferenz)]])/(Tabelle2[[#This Row],[p-Wert (Präferenz)]]-Tabelle2[[#This Row],[q-Wert (Indifferenz)]]))))),IF(ABS(Tabelle2[[#This Row],[Smart City]]-Tabelle2[[#This Row],[Healthy City]])<Tabelle2[[#This Row],[q-Wert (Indifferenz)]], 0,IF(ABS(Tabelle2[[#This Row],[Smart City]]-Tabelle2[[#This Row],[Healthy City]])>Tabelle2[[#This Row],[p-Wert (Präferenz)]],1,IF(AND(ABS(Tabelle2[[#This Row],[Smart City]]-Tabelle2[[#This Row],[Healthy City]])<=Tabelle2[[#This Row],[p-Wert (Präferenz)]],ABS(Tabelle2[[#This Row],[Smart City]]-Tabelle2[[#This Row],[Healthy City]])>=Tabelle2[[#This Row],[q-Wert (Indifferenz)]]),((ABS(Tabelle2[[#This Row],[Smart City]]-Tabelle2[[#This Row],[Healthy City]])-Tabelle2[[#This Row],[q-Wert (Indifferenz)]])/(Tabelle2[[#This Row],[p-Wert (Präferenz)]]-Tabelle2[[#This Row],[q-Wert (Indifferenz)]])))))),IF(Tabelle2[[#This Row],[Smart City]]-Tabelle2[[#This Row],[Healthy City]]<0,-1*IF(ABS(Tabelle2[[#This Row],[Smart City]]-Tabelle2[[#This Row],[Healthy City]])<Tabelle2[[#This Row],[q-Wert (Indifferenz)]], 0,IF(ABS(Tabelle2[[#This Row],[Smart City]]-Tabelle2[[#This Row],[Healthy City]])>Tabelle2[[#This Row],[p-Wert (Präferenz)]],1,IF(AND(ABS(Tabelle2[[#This Row],[Smart City]]-Tabelle2[[#This Row],[Healthy City]])<=Tabelle2[[#This Row],[p-Wert (Präferenz)]],ABS(Tabelle2[[#This Row],[Smart City]]-Tabelle2[[#This Row],[Healthy City]])>=Tabelle2[[#This Row],[q-Wert (Indifferenz)]]),((ABS(Tabelle2[[#This Row],[Smart City]]-Tabelle2[[#This Row],[Healthy City]])-Tabelle2[[#This Row],[q-Wert (Indifferenz)]])/(Tabelle2[[#This Row],[p-Wert (Präferenz)]]-Tabelle2[[#This Row],[q-Wert (Indifferenz)]]))))),IF(ABS(Tabelle2[[#This Row],[Smart City]]-Tabelle2[[#This Row],[Healthy City]])<Tabelle2[[#This Row],[q-Wert (Indifferenz)]], 0,IF(ABS(Tabelle2[[#This Row],[Smart City]]-Tabelle2[[#This Row],[Healthy City]])>Tabelle2[[#This Row],[p-Wert (Präferenz)]],1,IF(AND(ABS(Tabelle2[[#This Row],[Smart City]]-Tabelle2[[#This Row],[Healthy City]])<=Tabelle2[[#This Row],[p-Wert (Präferenz)]],ABS(Tabelle2[[#This Row],[Smart City]]-Tabelle2[[#This Row],[Healthy City]])>=Tabelle2[[#This Row],[q-Wert (Indifferenz)]]),((ABS(Tabelle2[[#This Row],[Smart City]]-Tabelle2[[#This Row],[Healthy City]])-Tabelle2[[#This Row],[q-Wert (Indifferenz)]])/(Tabelle2[[#This Row],[p-Wert (Präferenz)]]-Tabelle2[[#This Row],[q-Wert (Indifferenz)]])))))))","v":0.26436781609195403},{"$f":"IF(Tabelle2[[#This Row],[min/max]]=\"min\",-1*IF(Tabelle2[[#This Row],[Smart City]]-Tabelle2[[#This Row],[Urban Sprawl]]<0,-1*IF(ABS(Tabelle2[[#This Row],[Smart City]]-Tabelle2[[#This Row],[Urban Sprawl]])<Tabelle2[[#This Row],[q-Wert (Indifferenz)]], 0,IF(ABS(Tabelle2[[#This Row],[Smart City]]-Tabelle2[[#This Row],[Urban Sprawl]])>Tabelle2[[#This Row],[p-Wert (Präferenz)]],1,IF(AND(ABS(Tabelle2[[#This Row],[Smart City]]-Tabelle2[[#This Row],[Urban Sprawl]])<=Tabelle2[[#This Row],[p-Wert (Präferenz)]],ABS(Tabelle2[[#This Row],[Smart City]]-Tabelle2[[#This Row],[Urban Sprawl]])>=Tabelle2[[#This Row],[q-Wert (Indifferenz)]]),((ABS(Tabelle2[[#This Row],[Smart City]]-Tabelle2[[#This Row],[Urban Sprawl]])-Tabelle2[[#This Row],[q-Wert (Indifferenz)]])/(Tabelle2[[#This Row],[p-Wert (Präferenz)]]-Tabelle2[[#This Row],[q-Wert (Indifferenz)]]))))),IF(ABS(Tabelle2[[#This Row],[Smart City]]-Tabelle2[[#This Row],[Urban Sprawl]])<Tabelle2[[#This Row],[q-Wert (Indifferenz)]], 0,IF(ABS(Tabelle2[[#This Row],[Smart City]]-Tabelle2[[#This Row],[Urban Sprawl]])>Tabelle2[[#This Row],[p-Wert (Präferenz)]],1,IF(AND(ABS(Tabelle2[[#This Row],[Smart City]]-Tabelle2[[#This Row],[Urban Sprawl]])<=Tabelle2[[#This Row],[p-Wert (Präferenz)]],ABS(Tabelle2[[#This Row],[Smart City]]-Tabelle2[[#This Row],[Urban Sprawl]])>=Tabelle2[[#This Row],[q-Wert (Indifferenz)]]),((ABS(Tabelle2[[#This Row],[Smart City]]-Tabelle2[[#This Row],[Urban Sprawl]])-Tabelle2[[#This Row],[q-Wert (Indifferenz)]])/(Tabelle2[[#This Row],[p-Wert (Präferenz)]]-Tabelle2[[#This Row],[q-Wert (Indifferenz)]])))))),IF(Tabelle2[[#This Row],[Smart City]]-Tabelle2[[#This Row],[Urban Sprawl]]<0,-1*IF(ABS(Tabelle2[[#This Row],[Smart City]]-Tabelle2[[#This Row],[Urban Sprawl]])<Tabelle2[[#This Row],[q-Wert (Indifferenz)]], 0,IF(ABS(Tabelle2[[#This Row],[Smart City]]-Tabelle2[[#This Row],[Urban Sprawl]])>Tabelle2[[#This Row],[p-Wert (Präferenz)]],1,IF(AND(ABS(Tabelle2[[#This Row],[Smart City]]-Tabelle2[[#This Row],[Urban Sprawl]])<=Tabelle2[[#This Row],[p-Wert (Präferenz)]],ABS(Tabelle2[[#This Row],[Smart City]]-Tabelle2[[#This Row],[Urban Sprawl]])>=Tabelle2[[#This Row],[q-Wert (Indifferenz)]]),((ABS(Tabelle2[[#This Row],[Smart City]]-Tabelle2[[#This Row],[Urban Sprawl]])-Tabelle2[[#This Row],[q-Wert (Indifferenz)]])/(Tabelle2[[#This Row],[p-Wert (Präferenz)]]-Tabelle2[[#This Row],[q-Wert (Indifferenz)]]))))),IF(ABS(Tabelle2[[#This Row],[Smart City]]-Tabelle2[[#This Row],[Urban Sprawl]])<Tabelle2[[#This Row],[q-Wert (Indifferenz)]], 0,IF(ABS(Tabelle2[[#This Row],[Smart City]]-Tabelle2[[#This Row],[Urban Sprawl]])>Tabelle2[[#This Row],[p-Wert (Präferenz)]],1,IF(AND(ABS(Tabelle2[[#This Row],[Smart City]]-Tabelle2[[#This Row],[Urban Sprawl]])<=Tabelle2[[#This Row],[p-Wert (Präferenz)]],ABS(Tabelle2[[#This Row],[Smart City]]-Tabelle2[[#This Row],[Urban Sprawl]])>=Tabelle2[[#This Row],[q-Wert (Indifferenz)]]),((ABS(Tabelle2[[#This Row],[Smart City]]-Tabelle2[[#This Row],[Urban Sprawl]])-Tabelle2[[#This Row],[q-Wert (Indifferenz)]])/(Tabelle2[[#This Row],[p-Wert (Präferenz)]]-Tabelle2[[#This Row],[q-Wert (Indifferenz)]])))))))","v":-0.26436781609195403},{"$f":"IF(Tabelle2[[#This Row],[min/max]]=\"min\",-1*IF(Tabelle2[[#This Row],[Smart City]]-Tabelle2[[#This Row],[Business as usual]]<0,-1*IF(ABS(Tabelle2[[#This Row],[Smart City]]-Tabelle2[[#This Row],[Business as usual]])<Tabelle2[[#This Row],[q-Wert (Indifferenz)]], 0,IF(ABS(Tabelle2[[#This Row],[Smart City]]-Tabelle2[[#This Row],[Business as usual]])>Tabelle2[[#This Row],[p-Wert (Präferenz)]],1,IF(AND(ABS(Tabelle2[[#This Row],[Smart City]]-Tabelle2[[#This Row],[Business as usual]])<=Tabelle2[[#This Row],[p-Wert (Präferenz)]],ABS(Tabelle2[[#This Row],[Smart City]]-Tabelle2[[#This Row],[Business as usual]])>=Tabelle2[[#This Row],[q-Wert (Indifferenz)]]),((ABS(Tabelle2[[#This Row],[Smart City]]-Tabelle2[[#This Row],[Business as usual]])-Tabelle2[[#This Row],[q-Wert (Indifferenz)]])/(Tabelle2[[#This Row],[p-Wert (Präferenz)]]-Tabelle2[[#This Row],[q-Wert (Indifferenz)]]))))),IF(ABS(Tabelle2[[#This Row],[Smart City]]-Tabelle2[[#This Row],[Business as usual]])<Tabelle2[[#This Row],[q-Wert (Indifferenz)]], 0,IF(ABS(Tabelle2[[#This Row],[Smart City]]-Tabelle2[[#This Row],[Business as usual]])>Tabelle2[[#This Row],[p-Wert (Präferenz)]],1,IF(AND(ABS(Tabelle2[[#This Row],[Smart City]]-Tabelle2[[#This Row],[Business as usual]])<=Tabelle2[[#This Row],[p-Wert (Präferenz)]],ABS(Tabelle2[[#This Row],[Smart City]]-Tabelle2[[#This Row],[Business as usual]])>=Tabelle2[[#This Row],[q-Wert (Indifferenz)]]),((ABS(Tabelle2[[#This Row],[Smart City]]-Tabelle2[[#This Row],[Business as usual]])-Tabelle2[[#This Row],[q-Wert (Indifferenz)]])/(Tabelle2[[#This Row],[p-Wert (Präferenz)]]-Tabelle2[[#This Row],[q-Wert (Indifferenz)]])))))),IF(Tabelle2[[#This Row],[Smart City]]-Tabelle2[[#This Row],[Business as usual]]<0,-1*IF(ABS(Tabelle2[[#This Row],[Smart City]]-Tabelle2[[#This Row],[Business as usual]])<Tabelle2[[#This Row],[q-Wert (Indifferenz)]], 0,IF(ABS(Tabelle2[[#This Row],[Smart City]]-Tabelle2[[#This Row],[Business as usual]])>Tabelle2[[#This Row],[p-Wert (Präferenz)]],1,IF(AND(ABS(Tabelle2[[#This Row],[Smart City]]-Tabelle2[[#This Row],[Business as usual]])<=Tabelle2[[#This Row],[p-Wert (Präferenz)]],ABS(Tabelle2[[#This Row],[Smart City]]-Tabelle2[[#This Row],[Business as usual]])>=Tabelle2[[#This Row],[q-Wert (Indifferenz)]]),((ABS(Tabelle2[[#This Row],[Smart City]]-Tabelle2[[#This Row],[Business as usual]])-Tabelle2[[#This Row],[q-Wert (Indifferenz)]])/(Tabelle2[[#This Row],[p-Wert (Präferenz)]]-Tabelle2[[#This Row],[q-Wert (Indifferenz)]]))))),IF(ABS(Tabelle2[[#This Row],[Smart City]]-Tabelle2[[#This Row],[Business as usual]])<Tabelle2[[#This Row],[q-Wert (Indifferenz)]], 0,IF(ABS(Tabelle2[[#This Row],[Smart City]]-Tabelle2[[#This Row],[Business as usual]])>Tabelle2[[#This Row],[p-Wert (Präferenz)]],1,IF(AND(ABS(Tabelle2[[#This Row],[Smart City]]-Tabelle2[[#This Row],[Business as usual]])<=Tabelle2[[#This Row],[p-Wert (Präferenz)]],ABS(Tabelle2[[#This Row],[Smart City]]-Tabelle2[[#This Row],[Business as usual]])>=Tabelle2[[#This Row],[q-Wert (Indifferenz)]]),((ABS(Tabelle2[[#This Row],[Smart City]]-Tabelle2[[#This Row],[Business as usual]])-Tabelle2[[#This Row],[q-Wert (Indifferenz)]])/(Tabelle2[[#This Row],[p-Wert (Präferenz)]]-Tabelle2[[#This Row],[q-Wert (Indifferenz)]])))))))","v":-0.26436781609195403},null,{"$f":"IF(Tabelle2[[#This Row],[min/max]]=\"min\",-1*IF(Tabelle2[[#This Row],[Healthy City]]-Tabelle2[[#This Row],[Smart City]]<0,-1*IF(ABS(Tabelle2[[#This Row],[Healthy City]]-Tabelle2[[#This Row],[Smart City]])<Tabelle2[[#This Row],[q-Wert (Indifferenz)]], 0,IF(ABS(Tabelle2[[#This Row],[Healthy City]]-Tabelle2[[#This Row],[Smart City]])>Tabelle2[[#This Row],[p-Wert (Präferenz)]],1,IF(AND(ABS(Tabelle2[[#This Row],[Healthy City]]-Tabelle2[[#This Row],[Smart City]])<=Tabelle2[[#This Row],[p-Wert (Präferenz)]],ABS(Tabelle2[[#This Row],[Healthy City]]-Tabelle2[[#This Row],[Smart City]])>=Tabelle2[[#This Row],[q-Wert (Indifferenz)]]),((ABS(Tabelle2[[#This Row],[Healthy City]]-Tabelle2[[#This Row],[Smart City]])-Tabelle2[[#This Row],[q-Wert (Indifferenz)]])/(Tabelle2[[#This Row],[p-Wert (Präferenz)]]-Tabelle2[[#This Row],[q-Wert (Indifferenz)]]))))),IF(ABS(Tabelle2[[#This Row],[Healthy City]]-Tabelle2[[#This Row],[Smart City]])<Tabelle2[[#This Row],[q-Wert (Indifferenz)]], 0,IF(ABS(Tabelle2[[#This Row],[Healthy City]]-Tabelle2[[#This Row],[Smart City]])>Tabelle2[[#This Row],[p-Wert (Präferenz)]],1,IF(AND(ABS(Tabelle2[[#This Row],[Healthy City]]-Tabelle2[[#This Row],[Smart City]])<=Tabelle2[[#This Row],[p-Wert (Präferenz)]],ABS(Tabelle2[[#This Row],[Healthy City]]-Tabelle2[[#This Row],[Smart City]])>=Tabelle2[[#This Row],[q-Wert (Indifferenz)]]),((ABS(Tabelle2[[#This Row],[Healthy City]]-Tabelle2[[#This Row],[Smart City]])-Tabelle2[[#This Row],[q-Wert (Indifferenz)]])/(Tabelle2[[#This Row],[p-Wert (Präferenz)]]-Tabelle2[[#This Row],[q-Wert (Indifferenz)]])))))),IF(Tabelle2[[#This Row],[Healthy City]]-Tabelle2[[#This Row],[Smart City]]<0,-1*IF(ABS(Tabelle2[[#This Row],[Healthy City]]-Tabelle2[[#This Row],[Smart City]])<Tabelle2[[#This Row],[q-Wert (Indifferenz)]], 0,IF(ABS(Tabelle2[[#This Row],[Healthy City]]-Tabelle2[[#This Row],[Smart City]])>Tabelle2[[#This Row],[p-Wert (Präferenz)]],1,IF(AND(ABS(Tabelle2[[#This Row],[Healthy City]]-Tabelle2[[#This Row],[Smart City]])<=Tabelle2[[#This Row],[p-Wert (Präferenz)]],ABS(Tabelle2[[#This Row],[Healthy City]]-Tabelle2[[#This Row],[Smart City]])>=Tabelle2[[#This Row],[q-Wert (Indifferenz)]]),((ABS(Tabelle2[[#This Row],[Healthy City]]-Tabelle2[[#This Row],[Smart City]])-Tabelle2[[#This Row],[q-Wert (Indifferenz)]])/(Tabelle2[[#This Row],[p-Wert (Präferenz)]]-Tabelle2[[#This Row],[q-Wert (Indifferenz)]]))))),IF(ABS(Tabelle2[[#This Row],[Healthy City]]-Tabelle2[[#This Row],[Smart City]])<Tabelle2[[#This Row],[q-Wert (Indifferenz)]], 0,IF(ABS(Tabelle2[[#This Row],[Healthy City]]-Tabelle2[[#This Row],[Smart City]])>Tabelle2[[#This Row],[p-Wert (Präferenz)]],1,IF(AND(ABS(Tabelle2[[#This Row],[Healthy City]]-Tabelle2[[#This Row],[Smart City]])<=Tabelle2[[#This Row],[p-Wert (Präferenz)]],ABS(Tabelle2[[#This Row],[Healthy City]]-Tabelle2[[#This Row],[Smart City]])>=Tabelle2[[#This Row],[q-Wert (Indifferenz)]]),((ABS(Tabelle2[[#This Row],[Healthy City]]-Tabelle2[[#This Row],[Smart City]])-Tabelle2[[#This Row],[q-Wert (Indifferenz)]])/(Tabelle2[[#This Row],[p-Wert (Präferenz)]]-Tabelle2[[#This Row],[q-Wert (Indifferenz)]])))))))","v":-0.26436781609195403},{"$f":"IF(Tabelle2[[#This Row],[min/max]]=\"min\",-1*IF(Tabelle2[[#This Row],[Healthy City]]-Tabelle2[[#This Row],[Urban Sprawl]]<0,-1*IF(ABS(Tabelle2[[#This Row],[Healthy City]]-Tabelle2[[#This Row],[Urban Sprawl]])<Tabelle2[[#This Row],[q-Wert (Indifferenz)]], 0,IF(ABS(Tabelle2[[#This Row],[Healthy City]]-Tabelle2[[#This Row],[Urban Sprawl]])>Tabelle2[[#This Row],[p-Wert (Präferenz)]],1,IF(AND(ABS(Tabelle2[[#This Row],[Healthy City]]-Tabelle2[[#This Row],[Urban Sprawl]])<=Tabelle2[[#This Row],[p-Wert (Präferenz)]],ABS(Tabelle2[[#This Row],[Healthy City]]-Tabelle2[[#This Row],[Urban Sprawl]])>=Tabelle2[[#This Row],[q-Wert (Indifferenz)]]),((ABS(Tabelle2[[#This Row],[Healthy City]]-Tabelle2[[#This Row],[Urban Sprawl]])-Tabelle2[[#This Row],[q-Wert (Indifferenz)]])/(Tabelle2[[#This Row],[p-Wert (Präferenz)]]-Tabelle2[[#This Row],[q-Wert (Indifferenz)]]))))),IF(ABS(Tabelle2[[#This Row],[Healthy City]]-Tabelle2[[#This Row],[Urban Sprawl]])<Tabelle2[[#This Row],[q-Wert (Indifferenz)]], 0,IF(ABS(Tabelle2[[#This Row],[Healthy City]]-Tabelle2[[#This Row],[Urban Sprawl]])>Tabelle2[[#This Row],[p-Wert (Präferenz)]],1,IF(AND(ABS(Tabelle2[[#This Row],[Healthy City]]-Tabelle2[[#This Row],[Urban Sprawl]])<=Tabelle2[[#This Row],[p-Wert (Präferenz)]],ABS(Tabelle2[[#This Row],[Healthy City]]-Tabelle2[[#This Row],[Urban Sprawl]])>=Tabelle2[[#This Row],[q-Wert (Indifferenz)]]),((ABS(Tabelle2[[#This Row],[Healthy City]]-Tabelle2[[#This Row],[Urban Sprawl]])-Tabelle2[[#This Row],[q-Wert (Indifferenz)]])/(Tabelle2[[#This Row],[p-Wert (Präferenz)]]-Tabelle2[[#This Row],[q-Wert (Indifferenz)]])))))),IF(Tabelle2[[#This Row],[Healthy City]]-Tabelle2[[#This Row],[Urban Sprawl]]<0,-1*IF(ABS(Tabelle2[[#This Row],[Healthy City]]-Tabelle2[[#This Row],[Urban Sprawl]])<Tabelle2[[#This Row],[q-Wert (Indifferenz)]], 0,IF(ABS(Tabelle2[[#This Row],[Healthy City]]-Tabelle2[[#This Row],[Urban Sprawl]])>Tabelle2[[#This Row],[p-Wert (Präferenz)]],1,IF(AND(ABS(Tabelle2[[#This Row],[Healthy City]]-Tabelle2[[#This Row],[Urban Sprawl]])<=Tabelle2[[#This Row],[p-Wert (Präferenz)]],ABS(Tabelle2[[#This Row],[Healthy City]]-Tabelle2[[#This Row],[Urban Sprawl]])>=Tabelle2[[#This Row],[q-Wert (Indifferenz)]]),((ABS(Tabelle2[[#This Row],[Healthy City]]-Tabelle2[[#This Row],[Urban Sprawl]])-Tabelle2[[#This Row],[q-Wert (Indifferenz)]])/(Tabelle2[[#This Row],[p-Wert (Präferenz)]]-Tabelle2[[#This Row],[q-Wert (Indifferenz)]]))))),IF(ABS(Tabelle2[[#This Row],[Healthy City]]-Tabelle2[[#This Row],[Urban Sprawl]])<Tabelle2[[#This Row],[q-Wert (Indifferenz)]], 0,IF(ABS(Tabelle2[[#This Row],[Healthy City]]-Tabelle2[[#This Row],[Urban Sprawl]])>Tabelle2[[#This Row],[p-Wert (Präferenz)]],1,IF(AND(ABS(Tabelle2[[#This Row],[Healthy City]]-Tabelle2[[#This Row],[Urban Sprawl]])<=Tabelle2[[#This Row],[p-Wert (Präferenz)]],ABS(Tabelle2[[#This Row],[Healthy City]]-Tabelle2[[#This Row],[Urban Sprawl]])>=Tabelle2[[#This Row],[q-Wert (Indifferenz)]]),((ABS(Tabelle2[[#This Row],[Healthy City]]-Tabelle2[[#This Row],[Urban Sprawl]])-Tabelle2[[#This Row],[q-Wert (Indifferenz)]])/(Tabelle2[[#This Row],[p-Wert (Präferenz)]]-Tabelle2[[#This Row],[q-Wert (Indifferenz)]])))))))","v":-1},{"$f":"IF(Tabelle2[[#This Row],[min/max]]=\"min\",-1*IF(Tabelle2[[#This Row],[Healthy City]]-Tabelle2[[#This Row],[Business as usual]]<0,-1*IF(ABS(Tabelle2[[#This Row],[Healthy City]]-Tabelle2[[#This Row],[Business as usual]])<Tabelle2[[#This Row],[q-Wert (Indifferenz)]], 0,IF(ABS(Tabelle2[[#This Row],[Healthy City]]-Tabelle2[[#This Row],[Business as usual]])>Tabelle2[[#This Row],[p-Wert (Präferenz)]],1,IF(AND(ABS(Tabelle2[[#This Row],[Healthy City]]-Tabelle2[[#This Row],[Business as usual]])<=Tabelle2[[#This Row],[p-Wert (Präferenz)]],ABS(Tabelle2[[#This Row],[Healthy City]]-Tabelle2[[#This Row],[Business as usual]])>=Tabelle2[[#This Row],[q-Wert (Indifferenz)]]),((ABS(Tabelle2[[#This Row],[Healthy City]]-Tabelle2[[#This Row],[Business as usual]])-Tabelle2[[#This Row],[q-Wert (Indifferenz)]])/(Tabelle2[[#This Row],[p-Wert (Präferenz)]]-Tabelle2[[#This Row],[q-Wert (Indifferenz)]]))))),IF(ABS(Tabelle2[[#This Row],[Healthy City]]-Tabelle2[[#This Row],[Business as usual]])<Tabelle2[[#This Row],[q-Wert (Indifferenz)]], 0,IF(ABS(Tabelle2[[#This Row],[Healthy City]]-Tabelle2[[#This Row],[Business as usual]])>Tabelle2[[#This Row],[p-Wert (Präferenz)]],1,IF(AND(ABS(Tabelle2[[#This Row],[Healthy City]]-Tabelle2[[#This Row],[Business as usual]])<=Tabelle2[[#This Row],[p-Wert (Präferenz)]],ABS(Tabelle2[[#This Row],[Healthy City]]-Tabelle2[[#This Row],[Business as usual]])>=Tabelle2[[#This Row],[q-Wert (Indifferenz)]]),((ABS(Tabelle2[[#This Row],[Healthy City]]-Tabelle2[[#This Row],[Business as usual]])-Tabelle2[[#This Row],[q-Wert (Indifferenz)]])/(Tabelle2[[#This Row],[p-Wert (Präferenz)]]-Tabelle2[[#This Row],[q-Wert (Indifferenz)]])))))),IF(Tabelle2[[#This Row],[Healthy City]]-Tabelle2[[#This Row],[Business as usual]]<0,-1*IF(ABS(Tabelle2[[#This Row],[Healthy City]]-Tabelle2[[#This Row],[Business as usual]])<Tabelle2[[#This Row],[q-Wert (Indifferenz)]], 0,IF(ABS(Tabelle2[[#This Row],[Healthy City]]-Tabelle2[[#This Row],[Business as usual]])>Tabelle2[[#This Row],[p-Wert (Präferenz)]],1,IF(AND(ABS(Tabelle2[[#This Row],[Healthy City]]-Tabelle2[[#This Row],[Business as usual]])<=Tabelle2[[#This Row],[p-Wert (Präferenz)]],ABS(Tabelle2[[#This Row],[Healthy City]]-Tabelle2[[#This Row],[Business as usual]])>=Tabelle2[[#This Row],[q-Wert (Indifferenz)]]),((ABS(Tabelle2[[#This Row],[Healthy City]]-Tabelle2[[#This Row],[Business as usual]])-Tabelle2[[#This Row],[q-Wert (Indifferenz)]])/(Tabelle2[[#This Row],[p-Wert (Präferenz)]]-Tabelle2[[#This Row],[q-Wert (Indifferenz)]]))))),IF(ABS(Tabelle2[[#This Row],[Healthy City]]-Tabelle2[[#This Row],[Business as usual]])<Tabelle2[[#This Row],[q-Wert (Indifferenz)]], 0,IF(ABS(Tabelle2[[#This Row],[Healthy City]]-Tabelle2[[#This Row],[Business as usual]])>Tabelle2[[#This Row],[p-Wert (Präferenz)]],1,IF(AND(ABS(Tabelle2[[#This Row],[Healthy City]]-Tabelle2[[#This Row],[Business as usual]])<=Tabelle2[[#This Row],[p-Wert (Präferenz)]],ABS(Tabelle2[[#This Row],[Healthy City]]-Tabelle2[[#This Row],[Business as usual]])>=Tabelle2[[#This Row],[q-Wert (Indifferenz)]]),((ABS(Tabelle2[[#This Row],[Healthy City]]-Tabelle2[[#This Row],[Business as usual]])-Tabelle2[[#This Row],[q-Wert (Indifferenz)]])/(Tabelle2[[#This Row],[p-Wert (Präferenz)]]-Tabelle2[[#This Row],[q-Wert (Indifferenz)]])))))))","v":-1},null,{"$f":"IF(Tabelle2[[#This Row],[min/max]]=\"min\",-1*IF(Tabelle2[[#This Row],[Urban Sprawl]]-Tabelle2[[#This Row],[Smart City]]<0,-1*IF(ABS(Tabelle2[[#This Row],[Urban Sprawl]]-Tabelle2[[#This Row],[Smart City]])<Tabelle2[[#This Row],[q-Wert (Indifferenz)]], 0,IF(ABS(Tabelle2[[#This Row],[Urban Sprawl]]-Tabelle2[[#This Row],[Smart City]])>Tabelle2[[#This Row],[p-Wert (Präferenz)]],1,IF(AND(ABS(Tabelle2[[#This Row],[Urban Sprawl]]-Tabelle2[[#This Row],[Smart City]])<=Tabelle2[[#This Row],[p-Wert (Präferenz)]],ABS(Tabelle2[[#This Row],[Urban Sprawl]]-Tabelle2[[#This Row],[Smart City]])>=Tabelle2[[#This Row],[q-Wert (Indifferenz)]]),((ABS(Tabelle2[[#This Row],[Urban Sprawl]]-Tabelle2[[#This Row],[Smart City]])-Tabelle2[[#This Row],[q-Wert (Indifferenz)]])/(Tabelle2[[#This Row],[p-Wert (Präferenz)]]-Tabelle2[[#This Row],[q-Wert (Indifferenz)]]))))),IF(ABS(Tabelle2[[#This Row],[Urban Sprawl]]-Tabelle2[[#This Row],[Smart City]])<Tabelle2[[#This Row],[q-Wert (Indifferenz)]], 0,IF(ABS(Tabelle2[[#This Row],[Urban Sprawl]]-Tabelle2[[#This Row],[Smart City]])>Tabelle2[[#This Row],[p-Wert (Präferenz)]],1,IF(AND(ABS(Tabelle2[[#This Row],[Urban Sprawl]]-Tabelle2[[#This Row],[Smart City]])<=Tabelle2[[#This Row],[p-Wert (Präferenz)]],ABS(Tabelle2[[#This Row],[Urban Sprawl]]-Tabelle2[[#This Row],[Smart City]])>=Tabelle2[[#This Row],[q-Wert (Indifferenz)]]),((ABS(Tabelle2[[#This Row],[Urban Sprawl]]-Tabelle2[[#This Row],[Smart City]])-Tabelle2[[#This Row],[q-Wert (Indifferenz)]])/(Tabelle2[[#This Row],[p-Wert (Präferenz)]]-Tabelle2[[#This Row],[q-Wert (Indifferenz)]])))))),IF(Tabelle2[[#This Row],[Urban Sprawl]]-Tabelle2[[#This Row],[Smart City]]<0,-1*IF(ABS(Tabelle2[[#This Row],[Urban Sprawl]]-Tabelle2[[#This Row],[Smart City]])<Tabelle2[[#This Row],[q-Wert (Indifferenz)]], 0,IF(ABS(Tabelle2[[#This Row],[Urban Sprawl]]-Tabelle2[[#This Row],[Smart City]])>Tabelle2[[#This Row],[p-Wert (Präferenz)]],1,IF(AND(ABS(Tabelle2[[#This Row],[Urban Sprawl]]-Tabelle2[[#This Row],[Smart City]])<=Tabelle2[[#This Row],[p-Wert (Präferenz)]],ABS(Tabelle2[[#This Row],[Urban Sprawl]]-Tabelle2[[#This Row],[Smart City]])>=Tabelle2[[#This Row],[q-Wert (Indifferenz)]]),((ABS(Tabelle2[[#This Row],[Urban Sprawl]]-Tabelle2[[#This Row],[Smart City]])-Tabelle2[[#This Row],[q-Wert (Indifferenz)]])/(Tabelle2[[#This Row],[p-Wert (Präferenz)]]-Tabelle2[[#This Row],[q-Wert (Indifferenz)]]))))),IF(ABS(Tabelle2[[#This Row],[Urban Sprawl]]-Tabelle2[[#This Row],[Smart City]])<Tabelle2[[#This Row],[q-Wert (Indifferenz)]], 0,IF(ABS(Tabelle2[[#This Row],[Urban Sprawl]]-Tabelle2[[#This Row],[Smart City]])>Tabelle2[[#This Row],[p-Wert (Präferenz)]],1,IF(AND(ABS(Tabelle2[[#This Row],[Urban Sprawl]]-Tabelle2[[#This Row],[Smart City]])<=Tabelle2[[#This Row],[p-Wert (Präferenz)]],ABS(Tabelle2[[#This Row],[Urban Sprawl]]-Tabelle2[[#This Row],[Smart City]])>=Tabelle2[[#This Row],[q-Wert (Indifferenz)]]),((ABS(Tabelle2[[#This Row],[Urban Sprawl]]-Tabelle2[[#This Row],[Smart City]])-Tabelle2[[#This Row],[q-Wert (Indifferenz)]])/(Tabelle2[[#This Row],[p-Wert (Präferenz)]]-Tabelle2[[#This Row],[q-Wert (Indifferenz)]])))))))","v":0.26436781609195403},{"$f":"IF(Tabelle2[[#This Row],[min/max]]=\"min\",-1*IF(Tabelle2[[#This Row],[Urban Sprawl]]-Tabelle2[[#This Row],[Healthy City]]<0,-1*IF(ABS(Tabelle2[[#This Row],[Urban Sprawl]]-Tabelle2[[#This Row],[Healthy City]])<Tabelle2[[#This Row],[q-Wert (Indifferenz)]], 0,IF(ABS(Tabelle2[[#This Row],[Urban Sprawl]]-Tabelle2[[#This Row],[Healthy City]])>Tabelle2[[#This Row],[p-Wert (Präferenz)]],1,IF(AND(ABS(Tabelle2[[#This Row],[Urban Sprawl]]-Tabelle2[[#This Row],[Healthy City]])<=Tabelle2[[#This Row],[p-Wert (Präferenz)]],ABS(Tabelle2[[#This Row],[Urban Sprawl]]-Tabelle2[[#This Row],[Healthy City]])>=Tabelle2[[#This Row],[q-Wert (Indifferenz)]]),((ABS(Tabelle2[[#This Row],[Urban Sprawl]]-Tabelle2[[#This Row],[Healthy City]])-Tabelle2[[#This Row],[q-Wert (Indifferenz)]])/(Tabelle2[[#This Row],[p-Wert (Präferenz)]]-Tabelle2[[#This Row],[q-Wert (Indifferenz)]]))))),IF(ABS(Tabelle2[[#This Row],[Urban Sprawl]]-Tabelle2[[#This Row],[Healthy City]])<Tabelle2[[#This Row],[q-Wert (Indifferenz)]], 0,IF(ABS(Tabelle2[[#This Row],[Urban Sprawl]]-Tabelle2[[#This Row],[Healthy City]])>Tabelle2[[#This Row],[p-Wert (Präferenz)]],1,IF(AND(ABS(Tabelle2[[#This Row],[Urban Sprawl]]-Tabelle2[[#This Row],[Healthy City]])<=Tabelle2[[#This Row],[p-Wert (Präferenz)]],ABS(Tabelle2[[#This Row],[Urban Sprawl]]-Tabelle2[[#This Row],[Healthy City]])>=Tabelle2[[#This Row],[q-Wert (Indifferenz)]]),((ABS(Tabelle2[[#This Row],[Urban Sprawl]]-Tabelle2[[#This Row],[Healthy City]])-Tabelle2[[#This Row],[q-Wert (Indifferenz)]])/(Tabelle2[[#This Row],[p-Wert (Präferenz)]]-Tabelle2[[#This Row],[q-Wert (Indifferenz)]])))))),IF(Tabelle2[[#This Row],[Urban Sprawl]]-Tabelle2[[#This Row],[Healthy City]]<0,-1*IF(ABS(Tabelle2[[#This Row],[Urban Sprawl]]-Tabelle2[[#This Row],[Healthy City]])<Tabelle2[[#This Row],[q-Wert (Indifferenz)]], 0,IF(ABS(Tabelle2[[#This Row],[Urban Sprawl]]-Tabelle2[[#This Row],[Healthy City]])>Tabelle2[[#This Row],[p-Wert (Präferenz)]],1,IF(AND(ABS(Tabelle2[[#This Row],[Urban Sprawl]]-Tabelle2[[#This Row],[Healthy City]])<=Tabelle2[[#This Row],[p-Wert (Präferenz)]],ABS(Tabelle2[[#This Row],[Urban Sprawl]]-Tabelle2[[#This Row],[Healthy City]])>=Tabelle2[[#This Row],[q-Wert (Indifferenz)]]),((ABS(Tabelle2[[#This Row],[Urban Sprawl]]-Tabelle2[[#This Row],[Healthy City]])-Tabelle2[[#This Row],[q-Wert (Indifferenz)]])/(Tabelle2[[#This Row],[p-Wert (Präferenz)]]-Tabelle2[[#This Row],[q-Wert (Indifferenz)]]))))),IF(ABS(Tabelle2[[#This Row],[Urban Sprawl]]-Tabelle2[[#This Row],[Healthy City]])<Tabelle2[[#This Row],[q-Wert (Indifferenz)]], 0,IF(ABS(Tabelle2[[#This Row],[Urban Sprawl]]-Tabelle2[[#This Row],[Healthy City]])>Tabelle2[[#This Row],[p-Wert (Präferenz)]],1,IF(AND(ABS(Tabelle2[[#This Row],[Urban Sprawl]]-Tabelle2[[#This Row],[Healthy City]])<=Tabelle2[[#This Row],[p-Wert (Präferenz)]],ABS(Tabelle2[[#This Row],[Urban Sprawl]]-Tabelle2[[#This Row],[Healthy City]])>=Tabelle2[[#This Row],[q-Wert (Indifferenz)]]),((ABS(Tabelle2[[#This Row],[Urban Sprawl]]-Tabelle2[[#This Row],[Healthy City]])-Tabelle2[[#This Row],[q-Wert (Indifferenz)]])/(Tabelle2[[#This Row],[p-Wert (Präferenz)]]-Tabelle2[[#This Row],[q-Wert (Indifferenz)]])))))))","v":1},{"$f":"IF(Tabelle2[[#This Row],[min/max]]=\"min\",-1*IF(Tabelle2[[#This Row],[Urban Sprawl]]-Tabelle2[[#This Row],[Business as usual]]<0,-1*IF(ABS(Tabelle2[[#This Row],[Urban Sprawl]]-Tabelle2[[#This Row],[Business as usual]])<Tabelle2[[#This Row],[q-Wert (Indifferenz)]], 0,IF(ABS(Tabelle2[[#This Row],[Urban Sprawl]]-Tabelle2[[#This Row],[Business as usual]])>Tabelle2[[#This Row],[p-Wert (Präferenz)]],1,IF(AND(ABS(Tabelle2[[#This Row],[Urban Sprawl]]-Tabelle2[[#This Row],[Business as usual]])<=Tabelle2[[#This Row],[p-Wert (Präferenz)]],ABS(Tabelle2[[#This Row],[Urban Sprawl]]-Tabelle2[[#This Row],[Business as usual]])>=Tabelle2[[#This Row],[q-Wert (Indifferenz)]]),((ABS(Tabelle2[[#This Row],[Urban Sprawl]]-Tabelle2[[#This Row],[Business as usual]])-Tabelle2[[#This Row],[q-Wert (Indifferenz)]])/(Tabelle2[[#This Row],[p-Wert (Präferenz)]]-Tabelle2[[#This Row],[q-Wert (Indifferenz)]]))))),IF(ABS(Tabelle2[[#This Row],[Urban Sprawl]]-Tabelle2[[#This Row],[Business as usual]])<Tabelle2[[#This Row],[q-Wert (Indifferenz)]], 0,IF(ABS(Tabelle2[[#This Row],[Urban Sprawl]]-Tabelle2[[#This Row],[Business as usual]])>Tabelle2[[#This Row],[p-Wert (Präferenz)]],1,IF(AND(ABS(Tabelle2[[#This Row],[Urban Sprawl]]-Tabelle2[[#This Row],[Business as usual]])<=Tabelle2[[#This Row],[p-Wert (Präferenz)]],ABS(Tabelle2[[#This Row],[Urban Sprawl]]-Tabelle2[[#This Row],[Business as usual]])>=Tabelle2[[#This Row],[q-Wert (Indifferenz)]]),((ABS(Tabelle2[[#This Row],[Urban Sprawl]]-Tabelle2[[#This Row],[Business as usual]])-Tabelle2[[#This Row],[q-Wert (Indifferenz)]])/(Tabelle2[[#This Row],[p-Wert (Präferenz)]]-Tabelle2[[#This Row],[q-Wert (Indifferenz)]])))))),IF(Tabelle2[[#This Row],[Urban Sprawl]]-Tabelle2[[#This Row],[Business as usual]]<0,-1*IF(ABS(Tabelle2[[#This Row],[Urban Sprawl]]-Tabelle2[[#This Row],[Business as usual]])<Tabelle2[[#This Row],[q-Wert (Indifferenz)]], 0,IF(ABS(Tabelle2[[#This Row],[Urban Sprawl]]-Tabelle2[[#This Row],[Business as usual]])>Tabelle2[[#This Row],[p-Wert (Präferenz)]],1,IF(AND(ABS(Tabelle2[[#This Row],[Urban Sprawl]]-Tabelle2[[#This Row],[Business as usual]])<=Tabelle2[[#This Row],[p-Wert (Präferenz)]],ABS(Tabelle2[[#This Row],[Urban Sprawl]]-Tabelle2[[#This Row],[Business as usual]])>=Tabelle2[[#This Row],[q-Wert (Indifferenz)]]),((ABS(Tabelle2[[#This Row],[Urban Sprawl]]-Tabelle2[[#This Row],[Business as usual]])-Tabelle2[[#This Row],[q-Wert (Indifferenz)]])/(Tabelle2[[#This Row],[p-Wert (Präferenz)]]-Tabelle2[[#This Row],[q-Wert (Indifferenz)]]))))),IF(ABS(Tabelle2[[#This Row],[Urban Sprawl]]-Tabelle2[[#This Row],[Business as usual]])<Tabelle2[[#This Row],[q-Wert (Indifferenz)]], 0,IF(ABS(Tabelle2[[#This Row],[Urban Sprawl]]-Tabelle2[[#This Row],[Business as usual]])>Tabelle2[[#This Row],[p-Wert (Präferenz)]],1,IF(AND(ABS(Tabelle2[[#This Row],[Urban Sprawl]]-Tabelle2[[#This Row],[Business as usual]])<=Tabelle2[[#This Row],[p-Wert (Präferenz)]],ABS(Tabelle2[[#This Row],[Urban Sprawl]]-Tabelle2[[#This Row],[Business as usual]])>=Tabelle2[[#This Row],[q-Wert (Indifferenz)]]),((ABS(Tabelle2[[#This Row],[Urban Sprawl]]-Tabelle2[[#This Row],[Business as usual]])-Tabelle2[[#This Row],[q-Wert (Indifferenz)]])/(Tabelle2[[#This Row],[p-Wert (Präferenz)]]-Tabelle2[[#This Row],[q-Wert (Indifferenz)]])))))))","v":0},null,{"$f":"IF(Tabelle2[[#This Row],[min/max]]=\"min\",-1*IF(Tabelle2[[#This Row],[Business as usual]]-Tabelle2[[#This Row],[Smart City]]<0,-1*IF(ABS(Tabelle2[[#This Row],[Business as usual]]-Tabelle2[[#This Row],[Smart City]])<Tabelle2[[#This Row],[q-Wert (Indifferenz)]], 0,IF(ABS(Tabelle2[[#This Row],[Business as usual]]-Tabelle2[[#This Row],[Smart City]])>Tabelle2[[#This Row],[p-Wert (Präferenz)]],1,IF(AND(ABS(Tabelle2[[#This Row],[Business as usual]]-Tabelle2[[#This Row],[Smart City]])<=Tabelle2[[#This Row],[p-Wert (Präferenz)]],ABS(Tabelle2[[#This Row],[Business as usual]]-Tabelle2[[#This Row],[Smart City]])>=Tabelle2[[#This Row],[q-Wert (Indifferenz)]]),((ABS(Tabelle2[[#This Row],[Business as usual]]-Tabelle2[[#This Row],[Smart City]])-Tabelle2[[#This Row],[q-Wert (Indifferenz)]])/(Tabelle2[[#This Row],[p-Wert (Präferenz)]]-Tabelle2[[#This Row],[q-Wert (Indifferenz)]]))))),IF(ABS(Tabelle2[[#This Row],[Business as usual]]-Tabelle2[[#This Row],[Smart City]])<Tabelle2[[#This Row],[q-Wert (Indifferenz)]], 0,IF(ABS(Tabelle2[[#This Row],[Business as usual]]-Tabelle2[[#This Row],[Smart City]])>Tabelle2[[#This Row],[p-Wert (Präferenz)]],1,IF(AND(ABS(Tabelle2[[#This Row],[Business as usual]]-Tabelle2[[#This Row],[Smart City]])<=Tabelle2[[#This Row],[p-Wert (Präferenz)]],ABS(Tabelle2[[#This Row],[Business as usual]]-Tabelle2[[#This Row],[Smart City]])>=Tabelle2[[#This Row],[q-Wert (Indifferenz)]]),((ABS(Tabelle2[[#This Row],[Business as usual]]-Tabelle2[[#This Row],[Smart City]])-Tabelle2[[#This Row],[q-Wert (Indifferenz)]])/(Tabelle2[[#This Row],[p-Wert (Präferenz)]]-Tabelle2[[#This Row],[q-Wert (Indifferenz)]])))))),IF(Tabelle2[[#This Row],[Business as usual]]-Tabelle2[[#This Row],[Smart City]]<0,-1*IF(ABS(Tabelle2[[#This Row],[Business as usual]]-Tabelle2[[#This Row],[Smart City]])<Tabelle2[[#This Row],[q-Wert (Indifferenz)]], 0,IF(ABS(Tabelle2[[#This Row],[Business as usual]]-Tabelle2[[#This Row],[Smart City]])>Tabelle2[[#This Row],[p-Wert (Präferenz)]],1,IF(AND(ABS(Tabelle2[[#This Row],[Business as usual]]-Tabelle2[[#This Row],[Smart City]])<=Tabelle2[[#This Row],[p-Wert (Präferenz)]],ABS(Tabelle2[[#This Row],[Business as usual]]-Tabelle2[[#This Row],[Smart City]])>=Tabelle2[[#This Row],[q-Wert (Indifferenz)]]),((ABS(Tabelle2[[#This Row],[Business as usual]]-Tabelle2[[#This Row],[Smart City]])-Tabelle2[[#This Row],[q-Wert (Indifferenz)]])/(Tabelle2[[#This Row],[p-Wert (Präferenz)]]-Tabelle2[[#This Row],[q-Wert (Indifferenz)]]))))),IF(ABS(Tabelle2[[#This Row],[Business as usual]]-Tabelle2[[#This Row],[Smart City]])<Tabelle2[[#This Row],[q-Wert (Indifferenz)]], 0,IF(ABS(Tabelle2[[#This Row],[Business as usual]]-Tabelle2[[#This Row],[Smart City]])>Tabelle2[[#This Row],[p-Wert (Präferenz)]],1,IF(AND(ABS(Tabelle2[[#This Row],[Business as usual]]-Tabelle2[[#This Row],[Smart City]])<=Tabelle2[[#This Row],[p-Wert (Präferenz)]],ABS(Tabelle2[[#This Row],[Business as usual]]-Tabelle2[[#This Row],[Smart City]])>=Tabelle2[[#This Row],[q-Wert (Indifferenz)]]),((ABS(Tabelle2[[#This Row],[Business as usual]]-Tabelle2[[#This Row],[Smart City]])-Tabelle2[[#This Row],[q-Wert (Indifferenz)]])/(Tabelle2[[#This Row],[p-Wert (Präferenz)]]-Tabelle2[[#This Row],[q-Wert (Indifferenz)]])))))))","v":0.26436781609195403},{"$f":"IF(Tabelle2[[#This Row],[min/max]]=\"min\",-1*IF(Tabelle2[[#This Row],[Business as usual]]-Tabelle2[[#This Row],[Healthy City]]<0,-1*IF(ABS(Tabelle2[[#This Row],[Business as usual]]-Tabelle2[[#This Row],[Healthy City]])<Tabelle2[[#This Row],[q-Wert (Indifferenz)]], 0,IF(ABS(Tabelle2[[#This Row],[Business as usual]]-Tabelle2[[#This Row],[Healthy City]])>Tabelle2[[#This Row],[p-Wert (Präferenz)]],1,IF(AND(ABS(Tabelle2[[#This Row],[Business as usual]]-Tabelle2[[#This Row],[Healthy City]])<=Tabelle2[[#This Row],[p-Wert (Präferenz)]],ABS(Tabelle2[[#This Row],[Business as usual]]-Tabelle2[[#This Row],[Healthy City]])>=Tabelle2[[#This Row],[q-Wert (Indifferenz)]]),((ABS(Tabelle2[[#This Row],[Business as usual]]-Tabelle2[[#This Row],[Healthy City]])-Tabelle2[[#This Row],[q-Wert (Indifferenz)]])/(Tabelle2[[#This Row],[p-Wert (Präferenz)]]-Tabelle2[[#This Row],[q-Wert (Indifferenz)]]))))),IF(ABS(Tabelle2[[#This Row],[Business as usual]]-Tabelle2[[#This Row],[Healthy City]])<Tabelle2[[#This Row],[q-Wert (Indifferenz)]], 0,IF(ABS(Tabelle2[[#This Row],[Business as usual]]-Tabelle2[[#This Row],[Healthy City]])>Tabelle2[[#This Row],[p-Wert (Präferenz)]],1,IF(AND(ABS(Tabelle2[[#This Row],[Business as usual]]-Tabelle2[[#This Row],[Healthy City]])<=Tabelle2[[#This Row],[p-Wert (Präferenz)]],ABS(Tabelle2[[#This Row],[Business as usual]]-Tabelle2[[#This Row],[Healthy City]])>=Tabelle2[[#This Row],[q-Wert (Indifferenz)]]),((ABS(Tabelle2[[#This Row],[Business as usual]]-Tabelle2[[#This Row],[Healthy City]])-Tabelle2[[#This Row],[q-Wert (Indifferenz)]])/(Tabelle2[[#This Row],[p-Wert (Präferenz)]]-Tabelle2[[#This Row],[q-Wert (Indifferenz)]])))))),IF(Tabelle2[[#This Row],[Business as usual]]-Tabelle2[[#This Row],[Healthy City]]<0,-1*IF(ABS(Tabelle2[[#This Row],[Business as usual]]-Tabelle2[[#This Row],[Healthy City]])<Tabelle2[[#This Row],[q-Wert (Indifferenz)]], 0,IF(ABS(Tabelle2[[#This Row],[Business as usual]]-Tabelle2[[#This Row],[Healthy City]])>Tabelle2[[#This Row],[p-Wert (Präferenz)]],1,IF(AND(ABS(Tabelle2[[#This Row],[Business as usual]]-Tabelle2[[#This Row],[Healthy City]])<=Tabelle2[[#This Row],[p-Wert (Präferenz)]],ABS(Tabelle2[[#This Row],[Business as usual]]-Tabelle2[[#This Row],[Healthy City]])>=Tabelle2[[#This Row],[q-Wert (Indifferenz)]]),((ABS(Tabelle2[[#This Row],[Business as usual]]-Tabelle2[[#This Row],[Healthy City]])-Tabelle2[[#This Row],[q-Wert (Indifferenz)]])/(Tabelle2[[#This Row],[p-Wert (Präferenz)]]-Tabelle2[[#This Row],[q-Wert (Indifferenz)]]))))),IF(ABS(Tabelle2[[#This Row],[Business as usual]]-Tabelle2[[#This Row],[Healthy City]])<Tabelle2[[#This Row],[q-Wert (Indifferenz)]], 0,IF(ABS(Tabelle2[[#This Row],[Business as usual]]-Tabelle2[[#This Row],[Healthy City]])>Tabelle2[[#This Row],[p-Wert (Präferenz)]],1,IF(AND(ABS(Tabelle2[[#This Row],[Business as usual]]-Tabelle2[[#This Row],[Healthy City]])<=Tabelle2[[#This Row],[p-Wert (Präferenz)]],ABS(Tabelle2[[#This Row],[Business as usual]]-Tabelle2[[#This Row],[Healthy City]])>=Tabelle2[[#This Row],[q-Wert (Indifferenz)]]),((ABS(Tabelle2[[#This Row],[Business as usual]]-Tabelle2[[#This Row],[Healthy City]])-Tabelle2[[#This Row],[q-Wert (Indifferenz)]])/(Tabelle2[[#This Row],[p-Wert (Präferenz)]]-Tabelle2[[#This Row],[q-Wert (Indifferenz)]])))))))","v":1},{"$f":"IF(Tabelle2[[#This Row],[min/max]]=\"min\",-1*IF(Tabelle2[[#This Row],[Business as usual]]-Tabelle2[[#This Row],[Urban Sprawl]]<0,-1*IF(ABS(Tabelle2[[#This Row],[Business as usual]]-Tabelle2[[#This Row],[Urban Sprawl]])<Tabelle2[[#This Row],[q-Wert (Indifferenz)]], 0,IF(ABS(Tabelle2[[#This Row],[Business as usual]]-Tabelle2[[#This Row],[Urban Sprawl]])>Tabelle2[[#This Row],[p-Wert (Präferenz)]],1,IF(AND(ABS(Tabelle2[[#This Row],[Business as usual]]-Tabelle2[[#This Row],[Urban Sprawl]])<=Tabelle2[[#This Row],[p-Wert (Präferenz)]],ABS(Tabelle2[[#This Row],[Business as usual]]-Tabelle2[[#This Row],[Urban Sprawl]])>=Tabelle2[[#This Row],[q-Wert (Indifferenz)]]),((ABS(Tabelle2[[#This Row],[Business as usual]]-Tabelle2[[#This Row],[Urban Sprawl]])-Tabelle2[[#This Row],[q-Wert (Indifferenz)]])/(Tabelle2[[#This Row],[p-Wert (Präferenz)]]-Tabelle2[[#This Row],[q-Wert (Indifferenz)]]))))),IF(ABS(Tabelle2[[#This Row],[Business as usual]]-Tabelle2[[#This Row],[Urban Sprawl]])<Tabelle2[[#This Row],[q-Wert (Indifferenz)]], 0,IF(ABS(Tabelle2[[#This Row],[Business as usual]]-Tabelle2[[#This Row],[Urban Sprawl]])>Tabelle2[[#This Row],[p-Wert (Präferenz)]],1,IF(AND(ABS(Tabelle2[[#This Row],[Business as usual]]-Tabelle2[[#This Row],[Urban Sprawl]])<=Tabelle2[[#This Row],[p-Wert (Präferenz)]],ABS(Tabelle2[[#This Row],[Business as usual]]-Tabelle2[[#This Row],[Urban Sprawl]])>=Tabelle2[[#This Row],[q-Wert (Indifferenz)]]),((ABS(Tabelle2[[#This Row],[Business as usual]]-Tabelle2[[#This Row],[Urban Sprawl]])-Tabelle2[[#This Row],[q-Wert (Indifferenz)]])/(Tabelle2[[#This Row],[p-Wert (Präferenz)]]-Tabelle2[[#This Row],[q-Wert (Indifferenz)]])))))),IF(Tabelle2[[#This Row],[Business as usual]]-Tabelle2[[#This Row],[Urban Sprawl]]<0,-1*IF(ABS(Tabelle2[[#This Row],[Business as usual]]-Tabelle2[[#This Row],[Urban Sprawl]])<Tabelle2[[#This Row],[q-Wert (Indifferenz)]], 0,IF(ABS(Tabelle2[[#This Row],[Business as usual]]-Tabelle2[[#This Row],[Urban Sprawl]])>Tabelle2[[#This Row],[p-Wert (Präferenz)]],1,IF(AND(ABS(Tabelle2[[#This Row],[Business as usual]]-Tabelle2[[#This Row],[Urban Sprawl]])<=Tabelle2[[#This Row],[p-Wert (Präferenz)]],ABS(Tabelle2[[#This Row],[Business as usual]]-Tabelle2[[#This Row],[Urban Sprawl]])>=Tabelle2[[#This Row],[q-Wert (Indifferenz)]]),((ABS(Tabelle2[[#This Row],[Business as usual]]-Tabelle2[[#This Row],[Urban Sprawl]])-Tabelle2[[#This Row],[q-Wert (Indifferenz)]])/(Tabelle2[[#This Row],[p-Wert (Präferenz)]]-Tabelle2[[#This Row],[q-Wert (Indifferenz)]]))))),IF(ABS(Tabelle2[[#This Row],[Business as usual]]-Tabelle2[[#This Row],[Urban Sprawl]])<Tabelle2[[#This Row],[q-Wert (Indifferenz)]], 0,IF(ABS(Tabelle2[[#This Row],[Business as usual]]-Tabelle2[[#This Row],[Urban Sprawl]])>Tabelle2[[#This Row],[p-Wert (Präferenz)]],1,IF(AND(ABS(Tabelle2[[#This Row],[Business as usual]]-Tabelle2[[#This Row],[Urban Sprawl]])<=Tabelle2[[#This Row],[p-Wert (Präferenz)]],ABS(Tabelle2[[#This Row],[Business as usual]]-Tabelle2[[#This Row],[Urban Sprawl]])>=Tabelle2[[#This Row],[q-Wert (Indifferenz)]]),((ABS(Tabelle2[[#This Row],[Business as usual]]-Tabelle2[[#This Row],[Urban Sprawl]])-Tabelle2[[#This Row],[q-Wert (Indifferenz)]])/(Tabelle2[[#This Row],[p-Wert (Präferenz)]]-Tabelle2[[#This Row],[q-Wert (Indifferenz)]])))))))","v":0}]
[null,null,null,"CO2-Preis",{"$f":"('\"Walking Weights\"'!D13)/100","v":5.5555555555555552E-2},"max","€/Tonne CO2",162,200,0,0,"Typ 5",79,206,{"$f":"IF(Tabelle2[[#This Row],[min/max]]=\"min\",-1*IF(Tabelle2[[#This Row],[Smart City]]-Tabelle2[[#This Row],[Healthy City]]<0,-1*IF(ABS(Tabelle2[[#This Row],[Smart City]]-Tabelle2[[#This Row],[Healthy City]])<Tabelle2[[#This Row],[q-Wert (Indifferenz)]], 0,IF(ABS(Tabelle2[[#This Row],[Smart City]]-Tabelle2[[#This Row],[Healthy City]])>Tabelle2[[#This Row],[p-Wert (Präferenz)]],1,IF(AND(ABS(Tabelle2[[#This Row],[Smart City]]-Tabelle2[[#This Row],[Healthy City]])<=Tabelle2[[#This Row],[p-Wert (Präferenz)]],ABS(Tabelle2[[#This Row],[Smart City]]-Tabelle2[[#This Row],[Healthy City]])>=Tabelle2[[#This Row],[q-Wert (Indifferenz)]]),((ABS(Tabelle2[[#This Row],[Smart City]]-Tabelle2[[#This Row],[Healthy City]])-Tabelle2[[#This Row],[q-Wert (Indifferenz)]])/(Tabelle2[[#This Row],[p-Wert (Präferenz)]]-Tabelle2[[#This Row],[q-Wert (Indifferenz)]]))))),IF(ABS(Tabelle2[[#This Row],[Smart City]]-Tabelle2[[#This Row],[Healthy City]])<Tabelle2[[#This Row],[q-Wert (Indifferenz)]], 0,IF(ABS(Tabelle2[[#This Row],[Smart City]]-Tabelle2[[#This Row],[Healthy City]])>Tabelle2[[#This Row],[p-Wert (Präferenz)]],1,IF(AND(ABS(Tabelle2[[#This Row],[Smart City]]-Tabelle2[[#This Row],[Healthy City]])<=Tabelle2[[#This Row],[p-Wert (Präferenz)]],ABS(Tabelle2[[#This Row],[Smart City]]-Tabelle2[[#This Row],[Healthy City]])>=Tabelle2[[#This Row],[q-Wert (Indifferenz)]]),((ABS(Tabelle2[[#This Row],[Smart City]]-Tabelle2[[#This Row],[Healthy City]])-Tabelle2[[#This Row],[q-Wert (Indifferenz)]])/(Tabelle2[[#This Row],[p-Wert (Präferenz)]]-Tabelle2[[#This Row],[q-Wert (Indifferenz)]])))))),IF(Tabelle2[[#This Row],[Smart City]]-Tabelle2[[#This Row],[Healthy City]]<0,-1*IF(ABS(Tabelle2[[#This Row],[Smart City]]-Tabelle2[[#This Row],[Healthy City]])<Tabelle2[[#This Row],[q-Wert (Indifferenz)]], 0,IF(ABS(Tabelle2[[#This Row],[Smart City]]-Tabelle2[[#This Row],[Healthy City]])>Tabelle2[[#This Row],[p-Wert (Präferenz)]],1,IF(AND(ABS(Tabelle2[[#This Row],[Smart City]]-Tabelle2[[#This Row],[Healthy City]])<=Tabelle2[[#This Row],[p-Wert (Präferenz)]],ABS(Tabelle2[[#This Row],[Smart City]]-Tabelle2[[#This Row],[Healthy City]])>=Tabelle2[[#This Row],[q-Wert (Indifferenz)]]),((ABS(Tabelle2[[#This Row],[Smart City]]-Tabelle2[[#This Row],[Healthy City]])-Tabelle2[[#This Row],[q-Wert (Indifferenz)]])/(Tabelle2[[#This Row],[p-Wert (Präferenz)]]-Tabelle2[[#This Row],[q-Wert (Indifferenz)]]))))),IF(ABS(Tabelle2[[#This Row],[Smart City]]-Tabelle2[[#This Row],[Healthy City]])<Tabelle2[[#This Row],[q-Wert (Indifferenz)]], 0,IF(ABS(Tabelle2[[#This Row],[Smart City]]-Tabelle2[[#This Row],[Healthy City]])>Tabelle2[[#This Row],[p-Wert (Präferenz)]],1,IF(AND(ABS(Tabelle2[[#This Row],[Smart City]]-Tabelle2[[#This Row],[Healthy City]])<=Tabelle2[[#This Row],[p-Wert (Präferenz)]],ABS(Tabelle2[[#This Row],[Smart City]]-Tabelle2[[#This Row],[Healthy City]])>=Tabelle2[[#This Row],[q-Wert (Indifferenz)]]),((ABS(Tabelle2[[#This Row],[Smart City]]-Tabelle2[[#This Row],[Healthy City]])-Tabelle2[[#This Row],[q-Wert (Indifferenz)]])/(Tabelle2[[#This Row],[p-Wert (Präferenz)]]-Tabelle2[[#This Row],[q-Wert (Indifferenz)]])))))))","v":0},{"$f":"IF(Tabelle2[[#This Row],[min/max]]=\"min\",-1*IF(Tabelle2[[#This Row],[Smart City]]-Tabelle2[[#This Row],[Urban Sprawl]]<0,-1*IF(ABS(Tabelle2[[#This Row],[Smart City]]-Tabelle2[[#This Row],[Urban Sprawl]])<Tabelle2[[#This Row],[q-Wert (Indifferenz)]], 0,IF(ABS(Tabelle2[[#This Row],[Smart City]]-Tabelle2[[#This Row],[Urban Sprawl]])>Tabelle2[[#This Row],[p-Wert (Präferenz)]],1,IF(AND(ABS(Tabelle2[[#This Row],[Smart City]]-Tabelle2[[#This Row],[Urban Sprawl]])<=Tabelle2[[#This Row],[p-Wert (Präferenz)]],ABS(Tabelle2[[#This Row],[Smart City]]-Tabelle2[[#This Row],[Urban Sprawl]])>=Tabelle2[[#This Row],[q-Wert (Indifferenz)]]),((ABS(Tabelle2[[#This Row],[Smart City]]-Tabelle2[[#This Row],[Urban Sprawl]])-Tabelle2[[#This Row],[q-Wert (Indifferenz)]])/(Tabelle2[[#This Row],[p-Wert (Präferenz)]]-Tabelle2[[#This Row],[q-Wert (Indifferenz)]]))))),IF(ABS(Tabelle2[[#This Row],[Smart City]]-Tabelle2[[#This Row],[Urban Sprawl]])<Tabelle2[[#This Row],[q-Wert (Indifferenz)]], 0,IF(ABS(Tabelle2[[#This Row],[Smart City]]-Tabelle2[[#This Row],[Urban Sprawl]])>Tabelle2[[#This Row],[p-Wert (Präferenz)]],1,IF(AND(ABS(Tabelle2[[#This Row],[Smart City]]-Tabelle2[[#This Row],[Urban Sprawl]])<=Tabelle2[[#This Row],[p-Wert (Präferenz)]],ABS(Tabelle2[[#This Row],[Smart City]]-Tabelle2[[#This Row],[Urban Sprawl]])>=Tabelle2[[#This Row],[q-Wert (Indifferenz)]]),((ABS(Tabelle2[[#This Row],[Smart City]]-Tabelle2[[#This Row],[Urban Sprawl]])-Tabelle2[[#This Row],[q-Wert (Indifferenz)]])/(Tabelle2[[#This Row],[p-Wert (Präferenz)]]-Tabelle2[[#This Row],[q-Wert (Indifferenz)]])))))),IF(Tabelle2[[#This Row],[Smart City]]-Tabelle2[[#This Row],[Urban Sprawl]]<0,-1*IF(ABS(Tabelle2[[#This Row],[Smart City]]-Tabelle2[[#This Row],[Urban Sprawl]])<Tabelle2[[#This Row],[q-Wert (Indifferenz)]], 0,IF(ABS(Tabelle2[[#This Row],[Smart City]]-Tabelle2[[#This Row],[Urban Sprawl]])>Tabelle2[[#This Row],[p-Wert (Präferenz)]],1,IF(AND(ABS(Tabelle2[[#This Row],[Smart City]]-Tabelle2[[#This Row],[Urban Sprawl]])<=Tabelle2[[#This Row],[p-Wert (Präferenz)]],ABS(Tabelle2[[#This Row],[Smart City]]-Tabelle2[[#This Row],[Urban Sprawl]])>=Tabelle2[[#This Row],[q-Wert (Indifferenz)]]),((ABS(Tabelle2[[#This Row],[Smart City]]-Tabelle2[[#This Row],[Urban Sprawl]])-Tabelle2[[#This Row],[q-Wert (Indifferenz)]])/(Tabelle2[[#This Row],[p-Wert (Präferenz)]]-Tabelle2[[#This Row],[q-Wert (Indifferenz)]]))))),IF(ABS(Tabelle2[[#This Row],[Smart City]]-Tabelle2[[#This Row],[Urban Sprawl]])<Tabelle2[[#This Row],[q-Wert (Indifferenz)]], 0,IF(ABS(Tabelle2[[#This Row],[Smart City]]-Tabelle2[[#This Row],[Urban Sprawl]])>Tabelle2[[#This Row],[p-Wert (Präferenz)]],1,IF(AND(ABS(Tabelle2[[#This Row],[Smart City]]-Tabelle2[[#This Row],[Urban Sprawl]])<=Tabelle2[[#This Row],[p-Wert (Präferenz)]],ABS(Tabelle2[[#This Row],[Smart City]]-Tabelle2[[#This Row],[Urban Sprawl]])>=Tabelle2[[#This Row],[q-Wert (Indifferenz)]]),((ABS(Tabelle2[[#This Row],[Smart City]]-Tabelle2[[#This Row],[Urban Sprawl]])-Tabelle2[[#This Row],[q-Wert (Indifferenz)]])/(Tabelle2[[#This Row],[p-Wert (Präferenz)]]-Tabelle2[[#This Row],[q-Wert (Indifferenz)]])))))))","v":0.65354330708661412},{"$f":"IF(Tabelle2[[#This Row],[min/max]]=\"min\",-1*IF(Tabelle2[[#This Row],[Smart City]]-Tabelle2[[#This Row],[Business as usual]]<0,-1*IF(ABS(Tabelle2[[#This Row],[Smart City]]-Tabelle2[[#This Row],[Business as usual]])<Tabelle2[[#This Row],[q-Wert (Indifferenz)]], 0,IF(ABS(Tabelle2[[#This Row],[Smart City]]-Tabelle2[[#This Row],[Business as usual]])>Tabelle2[[#This Row],[p-Wert (Präferenz)]],1,IF(AND(ABS(Tabelle2[[#This Row],[Smart City]]-Tabelle2[[#This Row],[Business as usual]])<=Tabelle2[[#This Row],[p-Wert (Präferenz)]],ABS(Tabelle2[[#This Row],[Smart City]]-Tabelle2[[#This Row],[Business as usual]])>=Tabelle2[[#This Row],[q-Wert (Indifferenz)]]),((ABS(Tabelle2[[#This Row],[Smart City]]-Tabelle2[[#This Row],[Business as usual]])-Tabelle2[[#This Row],[q-Wert (Indifferenz)]])/(Tabelle2[[#This Row],[p-Wert (Präferenz)]]-Tabelle2[[#This Row],[q-Wert (Indifferenz)]]))))),IF(ABS(Tabelle2[[#This Row],[Smart City]]-Tabelle2[[#This Row],[Business as usual]])<Tabelle2[[#This Row],[q-Wert (Indifferenz)]], 0,IF(ABS(Tabelle2[[#This Row],[Smart City]]-Tabelle2[[#This Row],[Business as usual]])>Tabelle2[[#This Row],[p-Wert (Präferenz)]],1,IF(AND(ABS(Tabelle2[[#This Row],[Smart City]]-Tabelle2[[#This Row],[Business as usual]])<=Tabelle2[[#This Row],[p-Wert (Präferenz)]],ABS(Tabelle2[[#This Row],[Smart City]]-Tabelle2[[#This Row],[Business as usual]])>=Tabelle2[[#This Row],[q-Wert (Indifferenz)]]),((ABS(Tabelle2[[#This Row],[Smart City]]-Tabelle2[[#This Row],[Business as usual]])-Tabelle2[[#This Row],[q-Wert (Indifferenz)]])/(Tabelle2[[#This Row],[p-Wert (Präferenz)]]-Tabelle2[[#This Row],[q-Wert (Indifferenz)]])))))),IF(Tabelle2[[#This Row],[Smart City]]-Tabelle2[[#This Row],[Business as usual]]<0,-1*IF(ABS(Tabelle2[[#This Row],[Smart City]]-Tabelle2[[#This Row],[Business as usual]])<Tabelle2[[#This Row],[q-Wert (Indifferenz)]], 0,IF(ABS(Tabelle2[[#This Row],[Smart City]]-Tabelle2[[#This Row],[Business as usual]])>Tabelle2[[#This Row],[p-Wert (Präferenz)]],1,IF(AND(ABS(Tabelle2[[#This Row],[Smart City]]-Tabelle2[[#This Row],[Business as usual]])<=Tabelle2[[#This Row],[p-Wert (Präferenz)]],ABS(Tabelle2[[#This Row],[Smart City]]-Tabelle2[[#This Row],[Business as usual]])>=Tabelle2[[#This Row],[q-Wert (Indifferenz)]]),((ABS(Tabelle2[[#This Row],[Smart City]]-Tabelle2[[#This Row],[Business as usual]])-Tabelle2[[#This Row],[q-Wert (Indifferenz)]])/(Tabelle2[[#This Row],[p-Wert (Präferenz)]]-Tabelle2[[#This Row],[q-Wert (Indifferenz)]]))))),IF(ABS(Tabelle2[[#This Row],[Smart City]]-Tabelle2[[#This Row],[Business as usual]])<Tabelle2[[#This Row],[q-Wert (Indifferenz)]], 0,IF(ABS(Tabelle2[[#This Row],[Smart City]]-Tabelle2[[#This Row],[Business as usual]])>Tabelle2[[#This Row],[p-Wert (Präferenz)]],1,IF(AND(ABS(Tabelle2[[#This Row],[Smart City]]-Tabelle2[[#This Row],[Business as usual]])<=Tabelle2[[#This Row],[p-Wert (Präferenz)]],ABS(Tabelle2[[#This Row],[Smart City]]-Tabelle2[[#This Row],[Business as usual]])>=Tabelle2[[#This Row],[q-Wert (Indifferenz)]]),((ABS(Tabelle2[[#This Row],[Smart City]]-Tabelle2[[#This Row],[Business as usual]])-Tabelle2[[#This Row],[q-Wert (Indifferenz)]])/(Tabelle2[[#This Row],[p-Wert (Präferenz)]]-Tabelle2[[#This Row],[q-Wert (Indifferenz)]])))))))","v":0.65354330708661412},null,{"$f":"IF(Tabelle2[[#This Row],[min/max]]=\"min\",-1*IF(Tabelle2[[#This Row],[Healthy City]]-Tabelle2[[#This Row],[Smart City]]<0,-1*IF(ABS(Tabelle2[[#This Row],[Healthy City]]-Tabelle2[[#This Row],[Smart City]])<Tabelle2[[#This Row],[q-Wert (Indifferenz)]], 0,IF(ABS(Tabelle2[[#This Row],[Healthy City]]-Tabelle2[[#This Row],[Smart City]])>Tabelle2[[#This Row],[p-Wert (Präferenz)]],1,IF(AND(ABS(Tabelle2[[#This Row],[Healthy City]]-Tabelle2[[#This Row],[Smart City]])<=Tabelle2[[#This Row],[p-Wert (Präferenz)]],ABS(Tabelle2[[#This Row],[Healthy City]]-Tabelle2[[#This Row],[Smart City]])>=Tabelle2[[#This Row],[q-Wert (Indifferenz)]]),((ABS(Tabelle2[[#This Row],[Healthy City]]-Tabelle2[[#This Row],[Smart City]])-Tabelle2[[#This Row],[q-Wert (Indifferenz)]])/(Tabelle2[[#This Row],[p-Wert (Präferenz)]]-Tabelle2[[#This Row],[q-Wert (Indifferenz)]]))))),IF(ABS(Tabelle2[[#This Row],[Healthy City]]-Tabelle2[[#This Row],[Smart City]])<Tabelle2[[#This Row],[q-Wert (Indifferenz)]], 0,IF(ABS(Tabelle2[[#This Row],[Healthy City]]-Tabelle2[[#This Row],[Smart City]])>Tabelle2[[#This Row],[p-Wert (Präferenz)]],1,IF(AND(ABS(Tabelle2[[#This Row],[Healthy City]]-Tabelle2[[#This Row],[Smart City]])<=Tabelle2[[#This Row],[p-Wert (Präferenz)]],ABS(Tabelle2[[#This Row],[Healthy City]]-Tabelle2[[#This Row],[Smart City]])>=Tabelle2[[#This Row],[q-Wert (Indifferenz)]]),((ABS(Tabelle2[[#This Row],[Healthy City]]-Tabelle2[[#This Row],[Smart City]])-Tabelle2[[#This Row],[q-Wert (Indifferenz)]])/(Tabelle2[[#This Row],[p-Wert (Präferenz)]]-Tabelle2[[#This Row],[q-Wert (Indifferenz)]])))))),IF(Tabelle2[[#This Row],[Healthy City]]-Tabelle2[[#This Row],[Smart City]]<0,-1*IF(ABS(Tabelle2[[#This Row],[Healthy City]]-Tabelle2[[#This Row],[Smart City]])<Tabelle2[[#This Row],[q-Wert (Indifferenz)]], 0,IF(ABS(Tabelle2[[#This Row],[Healthy City]]-Tabelle2[[#This Row],[Smart City]])>Tabelle2[[#This Row],[p-Wert (Präferenz)]],1,IF(AND(ABS(Tabelle2[[#This Row],[Healthy City]]-Tabelle2[[#This Row],[Smart City]])<=Tabelle2[[#This Row],[p-Wert (Präferenz)]],ABS(Tabelle2[[#This Row],[Healthy City]]-Tabelle2[[#This Row],[Smart City]])>=Tabelle2[[#This Row],[q-Wert (Indifferenz)]]),((ABS(Tabelle2[[#This Row],[Healthy City]]-Tabelle2[[#This Row],[Smart City]])-Tabelle2[[#This Row],[q-Wert (Indifferenz)]])/(Tabelle2[[#This Row],[p-Wert (Präferenz)]]-Tabelle2[[#This Row],[q-Wert (Indifferenz)]]))))),IF(ABS(Tabelle2[[#This Row],[Healthy City]]-Tabelle2[[#This Row],[Smart City]])<Tabelle2[[#This Row],[q-Wert (Indifferenz)]], 0,IF(ABS(Tabelle2[[#This Row],[Healthy City]]-Tabelle2[[#This Row],[Smart City]])>Tabelle2[[#This Row],[p-Wert (Präferenz)]],1,IF(AND(ABS(Tabelle2[[#This Row],[Healthy City]]-Tabelle2[[#This Row],[Smart City]])<=Tabelle2[[#This Row],[p-Wert (Präferenz)]],ABS(Tabelle2[[#This Row],[Healthy City]]-Tabelle2[[#This Row],[Smart City]])>=Tabelle2[[#This Row],[q-Wert (Indifferenz)]]),((ABS(Tabelle2[[#This Row],[Healthy City]]-Tabelle2[[#This Row],[Smart City]])-Tabelle2[[#This Row],[q-Wert (Indifferenz)]])/(Tabelle2[[#This Row],[p-Wert (Präferenz)]]-Tabelle2[[#This Row],[q-Wert (Indifferenz)]])))))))","v":0},{"$f":"IF(Tabelle2[[#This Row],[min/max]]=\"min\",-1*IF(Tabelle2[[#This Row],[Healthy City]]-Tabelle2[[#This Row],[Urban Sprawl]]<0,-1*IF(ABS(Tabelle2[[#This Row],[Healthy City]]-Tabelle2[[#This Row],[Urban Sprawl]])<Tabelle2[[#This Row],[q-Wert (Indifferenz)]], 0,IF(ABS(Tabelle2[[#This Row],[Healthy City]]-Tabelle2[[#This Row],[Urban Sprawl]])>Tabelle2[[#This Row],[p-Wert (Präferenz)]],1,IF(AND(ABS(Tabelle2[[#This Row],[Healthy City]]-Tabelle2[[#This Row],[Urban Sprawl]])<=Tabelle2[[#This Row],[p-Wert (Präferenz)]],ABS(Tabelle2[[#This Row],[Healthy City]]-Tabelle2[[#This Row],[Urban Sprawl]])>=Tabelle2[[#This Row],[q-Wert (Indifferenz)]]),((ABS(Tabelle2[[#This Row],[Healthy City]]-Tabelle2[[#This Row],[Urban Sprawl]])-Tabelle2[[#This Row],[q-Wert (Indifferenz)]])/(Tabelle2[[#This Row],[p-Wert (Präferenz)]]-Tabelle2[[#This Row],[q-Wert (Indifferenz)]]))))),IF(ABS(Tabelle2[[#This Row],[Healthy City]]-Tabelle2[[#This Row],[Urban Sprawl]])<Tabelle2[[#This Row],[q-Wert (Indifferenz)]], 0,IF(ABS(Tabelle2[[#This Row],[Healthy City]]-Tabelle2[[#This Row],[Urban Sprawl]])>Tabelle2[[#This Row],[p-Wert (Präferenz)]],1,IF(AND(ABS(Tabelle2[[#This Row],[Healthy City]]-Tabelle2[[#This Row],[Urban Sprawl]])<=Tabelle2[[#This Row],[p-Wert (Präferenz)]],ABS(Tabelle2[[#This Row],[Healthy City]]-Tabelle2[[#This Row],[Urban Sprawl]])>=Tabelle2[[#This Row],[q-Wert (Indifferenz)]]),((ABS(Tabelle2[[#This Row],[Healthy City]]-Tabelle2[[#This Row],[Urban Sprawl]])-Tabelle2[[#This Row],[q-Wert (Indifferenz)]])/(Tabelle2[[#This Row],[p-Wert (Präferenz)]]-Tabelle2[[#This Row],[q-Wert (Indifferenz)]])))))),IF(Tabelle2[[#This Row],[Healthy City]]-Tabelle2[[#This Row],[Urban Sprawl]]<0,-1*IF(ABS(Tabelle2[[#This Row],[Healthy City]]-Tabelle2[[#This Row],[Urban Sprawl]])<Tabelle2[[#This Row],[q-Wert (Indifferenz)]], 0,IF(ABS(Tabelle2[[#This Row],[Healthy City]]-Tabelle2[[#This Row],[Urban Sprawl]])>Tabelle2[[#This Row],[p-Wert (Präferenz)]],1,IF(AND(ABS(Tabelle2[[#This Row],[Healthy City]]-Tabelle2[[#This Row],[Urban Sprawl]])<=Tabelle2[[#This Row],[p-Wert (Präferenz)]],ABS(Tabelle2[[#This Row],[Healthy City]]-Tabelle2[[#This Row],[Urban Sprawl]])>=Tabelle2[[#This Row],[q-Wert (Indifferenz)]]),((ABS(Tabelle2[[#This Row],[Healthy City]]-Tabelle2[[#This Row],[Urban Sprawl]])-Tabelle2[[#This Row],[q-Wert (Indifferenz)]])/(Tabelle2[[#This Row],[p-Wert (Präferenz)]]-Tabelle2[[#This Row],[q-Wert (Indifferenz)]]))))),IF(ABS(Tabelle2[[#This Row],[Healthy City]]-Tabelle2[[#This Row],[Urban Sprawl]])<Tabelle2[[#This Row],[q-Wert (Indifferenz)]], 0,IF(ABS(Tabelle2[[#This Row],[Healthy City]]-Tabelle2[[#This Row],[Urban Sprawl]])>Tabelle2[[#This Row],[p-Wert (Präferenz)]],1,IF(AND(ABS(Tabelle2[[#This Row],[Healthy City]]-Tabelle2[[#This Row],[Urban Sprawl]])<=Tabelle2[[#This Row],[p-Wert (Präferenz)]],ABS(Tabelle2[[#This Row],[Healthy City]]-Tabelle2[[#This Row],[Urban Sprawl]])>=Tabelle2[[#This Row],[q-Wert (Indifferenz)]]),((ABS(Tabelle2[[#This Row],[Healthy City]]-Tabelle2[[#This Row],[Urban Sprawl]])-Tabelle2[[#This Row],[q-Wert (Indifferenz)]])/(Tabelle2[[#This Row],[p-Wert (Präferenz)]]-Tabelle2[[#This Row],[q-Wert (Indifferenz)]])))))))","v":0.952755905511811},{"$f":"IF(Tabelle2[[#This Row],[min/max]]=\"min\",-1*IF(Tabelle2[[#This Row],[Healthy City]]-Tabelle2[[#This Row],[Business as usual]]<0,-1*IF(ABS(Tabelle2[[#This Row],[Healthy City]]-Tabelle2[[#This Row],[Business as usual]])<Tabelle2[[#This Row],[q-Wert (Indifferenz)]], 0,IF(ABS(Tabelle2[[#This Row],[Healthy City]]-Tabelle2[[#This Row],[Business as usual]])>Tabelle2[[#This Row],[p-Wert (Präferenz)]],1,IF(AND(ABS(Tabelle2[[#This Row],[Healthy City]]-Tabelle2[[#This Row],[Business as usual]])<=Tabelle2[[#This Row],[p-Wert (Präferenz)]],ABS(Tabelle2[[#This Row],[Healthy City]]-Tabelle2[[#This Row],[Business as usual]])>=Tabelle2[[#This Row],[q-Wert (Indifferenz)]]),((ABS(Tabelle2[[#This Row],[Healthy City]]-Tabelle2[[#This Row],[Business as usual]])-Tabelle2[[#This Row],[q-Wert (Indifferenz)]])/(Tabelle2[[#This Row],[p-Wert (Präferenz)]]-Tabelle2[[#This Row],[q-Wert (Indifferenz)]]))))),IF(ABS(Tabelle2[[#This Row],[Healthy City]]-Tabelle2[[#This Row],[Business as usual]])<Tabelle2[[#This Row],[q-Wert (Indifferenz)]], 0,IF(ABS(Tabelle2[[#This Row],[Healthy City]]-Tabelle2[[#This Row],[Business as usual]])>Tabelle2[[#This Row],[p-Wert (Präferenz)]],1,IF(AND(ABS(Tabelle2[[#This Row],[Healthy City]]-Tabelle2[[#This Row],[Business as usual]])<=Tabelle2[[#This Row],[p-Wert (Präferenz)]],ABS(Tabelle2[[#This Row],[Healthy City]]-Tabelle2[[#This Row],[Business as usual]])>=Tabelle2[[#This Row],[q-Wert (Indifferenz)]]),((ABS(Tabelle2[[#This Row],[Healthy City]]-Tabelle2[[#This Row],[Business as usual]])-Tabelle2[[#This Row],[q-Wert (Indifferenz)]])/(Tabelle2[[#This Row],[p-Wert (Präferenz)]]-Tabelle2[[#This Row],[q-Wert (Indifferenz)]])))))),IF(Tabelle2[[#This Row],[Healthy City]]-Tabelle2[[#This Row],[Business as usual]]<0,-1*IF(ABS(Tabelle2[[#This Row],[Healthy City]]-Tabelle2[[#This Row],[Business as usual]])<Tabelle2[[#This Row],[q-Wert (Indifferenz)]], 0,IF(ABS(Tabelle2[[#This Row],[Healthy City]]-Tabelle2[[#This Row],[Business as usual]])>Tabelle2[[#This Row],[p-Wert (Präferenz)]],1,IF(AND(ABS(Tabelle2[[#This Row],[Healthy City]]-Tabelle2[[#This Row],[Business as usual]])<=Tabelle2[[#This Row],[p-Wert (Präferenz)]],ABS(Tabelle2[[#This Row],[Healthy City]]-Tabelle2[[#This Row],[Business as usual]])>=Tabelle2[[#This Row],[q-Wert (Indifferenz)]]),((ABS(Tabelle2[[#This Row],[Healthy City]]-Tabelle2[[#This Row],[Business as usual]])-Tabelle2[[#This Row],[q-Wert (Indifferenz)]])/(Tabelle2[[#This Row],[p-Wert (Präferenz)]]-Tabelle2[[#This Row],[q-Wert (Indifferenz)]]))))),IF(ABS(Tabelle2[[#This Row],[Healthy City]]-Tabelle2[[#This Row],[Business as usual]])<Tabelle2[[#This Row],[q-Wert (Indifferenz)]], 0,IF(ABS(Tabelle2[[#This Row],[Healthy City]]-Tabelle2[[#This Row],[Business as usual]])>Tabelle2[[#This Row],[p-Wert (Präferenz)]],1,IF(AND(ABS(Tabelle2[[#This Row],[Healthy City]]-Tabelle2[[#This Row],[Business as usual]])<=Tabelle2[[#This Row],[p-Wert (Präferenz)]],ABS(Tabelle2[[#This Row],[Healthy City]]-Tabelle2[[#This Row],[Business as usual]])>=Tabelle2[[#This Row],[q-Wert (Indifferenz)]]),((ABS(Tabelle2[[#This Row],[Healthy City]]-Tabelle2[[#This Row],[Business as usual]])-Tabelle2[[#This Row],[q-Wert (Indifferenz)]])/(Tabelle2[[#This Row],[p-Wert (Präferenz)]]-Tabelle2[[#This Row],[q-Wert (Indifferenz)]])))))))","v":0.952755905511811},null,{"$f":"IF(Tabelle2[[#This Row],[min/max]]=\"min\",-1*IF(Tabelle2[[#This Row],[Urban Sprawl]]-Tabelle2[[#This Row],[Smart City]]<0,-1*IF(ABS(Tabelle2[[#This Row],[Urban Sprawl]]-Tabelle2[[#This Row],[Smart City]])<Tabelle2[[#This Row],[q-Wert (Indifferenz)]], 0,IF(ABS(Tabelle2[[#This Row],[Urban Sprawl]]-Tabelle2[[#This Row],[Smart City]])>Tabelle2[[#This Row],[p-Wert (Präferenz)]],1,IF(AND(ABS(Tabelle2[[#This Row],[Urban Sprawl]]-Tabelle2[[#This Row],[Smart City]])<=Tabelle2[[#This Row],[p-Wert (Präferenz)]],ABS(Tabelle2[[#This Row],[Urban Sprawl]]-Tabelle2[[#This Row],[Smart City]])>=Tabelle2[[#This Row],[q-Wert (Indifferenz)]]),((ABS(Tabelle2[[#This Row],[Urban Sprawl]]-Tabelle2[[#This Row],[Smart City]])-Tabelle2[[#This Row],[q-Wert (Indifferenz)]])/(Tabelle2[[#This Row],[p-Wert (Präferenz)]]-Tabelle2[[#This Row],[q-Wert (Indifferenz)]]))))),IF(ABS(Tabelle2[[#This Row],[Urban Sprawl]]-Tabelle2[[#This Row],[Smart City]])<Tabelle2[[#This Row],[q-Wert (Indifferenz)]], 0,IF(ABS(Tabelle2[[#This Row],[Urban Sprawl]]-Tabelle2[[#This Row],[Smart City]])>Tabelle2[[#This Row],[p-Wert (Präferenz)]],1,IF(AND(ABS(Tabelle2[[#This Row],[Urban Sprawl]]-Tabelle2[[#This Row],[Smart City]])<=Tabelle2[[#This Row],[p-Wert (Präferenz)]],ABS(Tabelle2[[#This Row],[Urban Sprawl]]-Tabelle2[[#This Row],[Smart City]])>=Tabelle2[[#This Row],[q-Wert (Indifferenz)]]),((ABS(Tabelle2[[#This Row],[Urban Sprawl]]-Tabelle2[[#This Row],[Smart City]])-Tabelle2[[#This Row],[q-Wert (Indifferenz)]])/(Tabelle2[[#This Row],[p-Wert (Präferenz)]]-Tabelle2[[#This Row],[q-Wert (Indifferenz)]])))))),IF(Tabelle2[[#This Row],[Urban Sprawl]]-Tabelle2[[#This Row],[Smart City]]<0,-1*IF(ABS(Tabelle2[[#This Row],[Urban Sprawl]]-Tabelle2[[#This Row],[Smart City]])<Tabelle2[[#This Row],[q-Wert (Indifferenz)]], 0,IF(ABS(Tabelle2[[#This Row],[Urban Sprawl]]-Tabelle2[[#This Row],[Smart City]])>Tabelle2[[#This Row],[p-Wert (Präferenz)]],1,IF(AND(ABS(Tabelle2[[#This Row],[Urban Sprawl]]-Tabelle2[[#This Row],[Smart City]])<=Tabelle2[[#This Row],[p-Wert (Präferenz)]],ABS(Tabelle2[[#This Row],[Urban Sprawl]]-Tabelle2[[#This Row],[Smart City]])>=Tabelle2[[#This Row],[q-Wert (Indifferenz)]]),((ABS(Tabelle2[[#This Row],[Urban Sprawl]]-Tabelle2[[#This Row],[Smart City]])-Tabelle2[[#This Row],[q-Wert (Indifferenz)]])/(Tabelle2[[#This Row],[p-Wert (Präferenz)]]-Tabelle2[[#This Row],[q-Wert (Indifferenz)]]))))),IF(ABS(Tabelle2[[#This Row],[Urban Sprawl]]-Tabelle2[[#This Row],[Smart City]])<Tabelle2[[#This Row],[q-Wert (Indifferenz)]], 0,IF(ABS(Tabelle2[[#This Row],[Urban Sprawl]]-Tabelle2[[#This Row],[Smart City]])>Tabelle2[[#This Row],[p-Wert (Präferenz)]],1,IF(AND(ABS(Tabelle2[[#This Row],[Urban Sprawl]]-Tabelle2[[#This Row],[Smart City]])<=Tabelle2[[#This Row],[p-Wert (Präferenz)]],ABS(Tabelle2[[#This Row],[Urban Sprawl]]-Tabelle2[[#This Row],[Smart City]])>=Tabelle2[[#This Row],[q-Wert (Indifferenz)]]),((ABS(Tabelle2[[#This Row],[Urban Sprawl]]-Tabelle2[[#This Row],[Smart City]])-Tabelle2[[#This Row],[q-Wert (Indifferenz)]])/(Tabelle2[[#This Row],[p-Wert (Präferenz)]]-Tabelle2[[#This Row],[q-Wert (Indifferenz)]])))))))","v":-0.65354330708661412},{"$f":"IF(Tabelle2[[#This Row],[min/max]]=\"min\",-1*IF(Tabelle2[[#This Row],[Urban Sprawl]]-Tabelle2[[#This Row],[Healthy City]]<0,-1*IF(ABS(Tabelle2[[#This Row],[Urban Sprawl]]-Tabelle2[[#This Row],[Healthy City]])<Tabelle2[[#This Row],[q-Wert (Indifferenz)]], 0,IF(ABS(Tabelle2[[#This Row],[Urban Sprawl]]-Tabelle2[[#This Row],[Healthy City]])>Tabelle2[[#This Row],[p-Wert (Präferenz)]],1,IF(AND(ABS(Tabelle2[[#This Row],[Urban Sprawl]]-Tabelle2[[#This Row],[Healthy City]])<=Tabelle2[[#This Row],[p-Wert (Präferenz)]],ABS(Tabelle2[[#This Row],[Urban Sprawl]]-Tabelle2[[#This Row],[Healthy City]])>=Tabelle2[[#This Row],[q-Wert (Indifferenz)]]),((ABS(Tabelle2[[#This Row],[Urban Sprawl]]-Tabelle2[[#This Row],[Healthy City]])-Tabelle2[[#This Row],[q-Wert (Indifferenz)]])/(Tabelle2[[#This Row],[p-Wert (Präferenz)]]-Tabelle2[[#This Row],[q-Wert (Indifferenz)]]))))),IF(ABS(Tabelle2[[#This Row],[Urban Sprawl]]-Tabelle2[[#This Row],[Healthy City]])<Tabelle2[[#This Row],[q-Wert (Indifferenz)]], 0,IF(ABS(Tabelle2[[#This Row],[Urban Sprawl]]-Tabelle2[[#This Row],[Healthy City]])>Tabelle2[[#This Row],[p-Wert (Präferenz)]],1,IF(AND(ABS(Tabelle2[[#This Row],[Urban Sprawl]]-Tabelle2[[#This Row],[Healthy City]])<=Tabelle2[[#This Row],[p-Wert (Präferenz)]],ABS(Tabelle2[[#This Row],[Urban Sprawl]]-Tabelle2[[#This Row],[Healthy City]])>=Tabelle2[[#This Row],[q-Wert (Indifferenz)]]),((ABS(Tabelle2[[#This Row],[Urban Sprawl]]-Tabelle2[[#This Row],[Healthy City]])-Tabelle2[[#This Row],[q-Wert (Indifferenz)]])/(Tabelle2[[#This Row],[p-Wert (Präferenz)]]-Tabelle2[[#This Row],[q-Wert (Indifferenz)]])))))),IF(Tabelle2[[#This Row],[Urban Sprawl]]-Tabelle2[[#This Row],[Healthy City]]<0,-1*IF(ABS(Tabelle2[[#This Row],[Urban Sprawl]]-Tabelle2[[#This Row],[Healthy City]])<Tabelle2[[#This Row],[q-Wert (Indifferenz)]], 0,IF(ABS(Tabelle2[[#This Row],[Urban Sprawl]]-Tabelle2[[#This Row],[Healthy City]])>Tabelle2[[#This Row],[p-Wert (Präferenz)]],1,IF(AND(ABS(Tabelle2[[#This Row],[Urban Sprawl]]-Tabelle2[[#This Row],[Healthy City]])<=Tabelle2[[#This Row],[p-Wert (Präferenz)]],ABS(Tabelle2[[#This Row],[Urban Sprawl]]-Tabelle2[[#This Row],[Healthy City]])>=Tabelle2[[#This Row],[q-Wert (Indifferenz)]]),((ABS(Tabelle2[[#This Row],[Urban Sprawl]]-Tabelle2[[#This Row],[Healthy City]])-Tabelle2[[#This Row],[q-Wert (Indifferenz)]])/(Tabelle2[[#This Row],[p-Wert (Präferenz)]]-Tabelle2[[#This Row],[q-Wert (Indifferenz)]]))))),IF(ABS(Tabelle2[[#This Row],[Urban Sprawl]]-Tabelle2[[#This Row],[Healthy City]])<Tabelle2[[#This Row],[q-Wert (Indifferenz)]], 0,IF(ABS(Tabelle2[[#This Row],[Urban Sprawl]]-Tabelle2[[#This Row],[Healthy City]])>Tabelle2[[#This Row],[p-Wert (Präferenz)]],1,IF(AND(ABS(Tabelle2[[#This Row],[Urban Sprawl]]-Tabelle2[[#This Row],[Healthy City]])<=Tabelle2[[#This Row],[p-Wert (Präferenz)]],ABS(Tabelle2[[#This Row],[Urban Sprawl]]-Tabelle2[[#This Row],[Healthy City]])>=Tabelle2[[#This Row],[q-Wert (Indifferenz)]]),((ABS(Tabelle2[[#This Row],[Urban Sprawl]]-Tabelle2[[#This Row],[Healthy City]])-Tabelle2[[#This Row],[q-Wert (Indifferenz)]])/(Tabelle2[[#This Row],[p-Wert (Präferenz)]]-Tabelle2[[#This Row],[q-Wert (Indifferenz)]])))))))","v":-0.952755905511811},{"$f":"IF(Tabelle2[[#This Row],[min/max]]=\"min\",-1*IF(Tabelle2[[#This Row],[Urban Sprawl]]-Tabelle2[[#This Row],[Business as usual]]<0,-1*IF(ABS(Tabelle2[[#This Row],[Urban Sprawl]]-Tabelle2[[#This Row],[Business as usual]])<Tabelle2[[#This Row],[q-Wert (Indifferenz)]], 0,IF(ABS(Tabelle2[[#This Row],[Urban Sprawl]]-Tabelle2[[#This Row],[Business as usual]])>Tabelle2[[#This Row],[p-Wert (Präferenz)]],1,IF(AND(ABS(Tabelle2[[#This Row],[Urban Sprawl]]-Tabelle2[[#This Row],[Business as usual]])<=Tabelle2[[#This Row],[p-Wert (Präferenz)]],ABS(Tabelle2[[#This Row],[Urban Sprawl]]-Tabelle2[[#This Row],[Business as usual]])>=Tabelle2[[#This Row],[q-Wert (Indifferenz)]]),((ABS(Tabelle2[[#This Row],[Urban Sprawl]]-Tabelle2[[#This Row],[Business as usual]])-Tabelle2[[#This Row],[q-Wert (Indifferenz)]])/(Tabelle2[[#This Row],[p-Wert (Präferenz)]]-Tabelle2[[#This Row],[q-Wert (Indifferenz)]]))))),IF(ABS(Tabelle2[[#This Row],[Urban Sprawl]]-Tabelle2[[#This Row],[Business as usual]])<Tabelle2[[#This Row],[q-Wert (Indifferenz)]], 0,IF(ABS(Tabelle2[[#This Row],[Urban Sprawl]]-Tabelle2[[#This Row],[Business as usual]])>Tabelle2[[#This Row],[p-Wert (Präferenz)]],1,IF(AND(ABS(Tabelle2[[#This Row],[Urban Sprawl]]-Tabelle2[[#This Row],[Business as usual]])<=Tabelle2[[#This Row],[p-Wert (Präferenz)]],ABS(Tabelle2[[#This Row],[Urban Sprawl]]-Tabelle2[[#This Row],[Business as usual]])>=Tabelle2[[#This Row],[q-Wert (Indifferenz)]]),((ABS(Tabelle2[[#This Row],[Urban Sprawl]]-Tabelle2[[#This Row],[Business as usual]])-Tabelle2[[#This Row],[q-Wert (Indifferenz)]])/(Tabelle2[[#This Row],[p-Wert (Präferenz)]]-Tabelle2[[#This Row],[q-Wert (Indifferenz)]])))))),IF(Tabelle2[[#This Row],[Urban Sprawl]]-Tabelle2[[#This Row],[Business as usual]]<0,-1*IF(ABS(Tabelle2[[#This Row],[Urban Sprawl]]-Tabelle2[[#This Row],[Business as usual]])<Tabelle2[[#This Row],[q-Wert (Indifferenz)]], 0,IF(ABS(Tabelle2[[#This Row],[Urban Sprawl]]-Tabelle2[[#This Row],[Business as usual]])>Tabelle2[[#This Row],[p-Wert (Präferenz)]],1,IF(AND(ABS(Tabelle2[[#This Row],[Urban Sprawl]]-Tabelle2[[#This Row],[Business as usual]])<=Tabelle2[[#This Row],[p-Wert (Präferenz)]],ABS(Tabelle2[[#This Row],[Urban Sprawl]]-Tabelle2[[#This Row],[Business as usual]])>=Tabelle2[[#This Row],[q-Wert (Indifferenz)]]),((ABS(Tabelle2[[#This Row],[Urban Sprawl]]-Tabelle2[[#This Row],[Business as usual]])-Tabelle2[[#This Row],[q-Wert (Indifferenz)]])/(Tabelle2[[#This Row],[p-Wert (Präferenz)]]-Tabelle2[[#This Row],[q-Wert (Indifferenz)]]))))),IF(ABS(Tabelle2[[#This Row],[Urban Sprawl]]-Tabelle2[[#This Row],[Business as usual]])<Tabelle2[[#This Row],[q-Wert (Indifferenz)]], 0,IF(ABS(Tabelle2[[#This Row],[Urban Sprawl]]-Tabelle2[[#This Row],[Business as usual]])>Tabelle2[[#This Row],[p-Wert (Präferenz)]],1,IF(AND(ABS(Tabelle2[[#This Row],[Urban Sprawl]]-Tabelle2[[#This Row],[Business as usual]])<=Tabelle2[[#This Row],[p-Wert (Präferenz)]],ABS(Tabelle2[[#This Row],[Urban Sprawl]]-Tabelle2[[#This Row],[Business as usual]])>=Tabelle2[[#This Row],[q-Wert (Indifferenz)]]),((ABS(Tabelle2[[#This Row],[Urban Sprawl]]-Tabelle2[[#This Row],[Business as usual]])-Tabelle2[[#This Row],[q-Wert (Indifferenz)]])/(Tabelle2[[#This Row],[p-Wert (Präferenz)]]-Tabelle2[[#This Row],[q-Wert (Indifferenz)]])))))))","v":0},null,{"$f":"IF(Tabelle2[[#This Row],[min/max]]=\"min\",-1*IF(Tabelle2[[#This Row],[Business as usual]]-Tabelle2[[#This Row],[Smart City]]<0,-1*IF(ABS(Tabelle2[[#This Row],[Business as usual]]-Tabelle2[[#This Row],[Smart City]])<Tabelle2[[#This Row],[q-Wert (Indifferenz)]], 0,IF(ABS(Tabelle2[[#This Row],[Business as usual]]-Tabelle2[[#This Row],[Smart City]])>Tabelle2[[#This Row],[p-Wert (Präferenz)]],1,IF(AND(ABS(Tabelle2[[#This Row],[Business as usual]]-Tabelle2[[#This Row],[Smart City]])<=Tabelle2[[#This Row],[p-Wert (Präferenz)]],ABS(Tabelle2[[#This Row],[Business as usual]]-Tabelle2[[#This Row],[Smart City]])>=Tabelle2[[#This Row],[q-Wert (Indifferenz)]]),((ABS(Tabelle2[[#This Row],[Business as usual]]-Tabelle2[[#This Row],[Smart City]])-Tabelle2[[#This Row],[q-Wert (Indifferenz)]])/(Tabelle2[[#This Row],[p-Wert (Präferenz)]]-Tabelle2[[#This Row],[q-Wert (Indifferenz)]]))))),IF(ABS(Tabelle2[[#This Row],[Business as usual]]-Tabelle2[[#This Row],[Smart City]])<Tabelle2[[#This Row],[q-Wert (Indifferenz)]], 0,IF(ABS(Tabelle2[[#This Row],[Business as usual]]-Tabelle2[[#This Row],[Smart City]])>Tabelle2[[#This Row],[p-Wert (Präferenz)]],1,IF(AND(ABS(Tabelle2[[#This Row],[Business as usual]]-Tabelle2[[#This Row],[Smart City]])<=Tabelle2[[#This Row],[p-Wert (Präferenz)]],ABS(Tabelle2[[#This Row],[Business as usual]]-Tabelle2[[#This Row],[Smart City]])>=Tabelle2[[#This Row],[q-Wert (Indifferenz)]]),((ABS(Tabelle2[[#This Row],[Business as usual]]-Tabelle2[[#This Row],[Smart City]])-Tabelle2[[#This Row],[q-Wert (Indifferenz)]])/(Tabelle2[[#This Row],[p-Wert (Präferenz)]]-Tabelle2[[#This Row],[q-Wert (Indifferenz)]])))))),IF(Tabelle2[[#This Row],[Business as usual]]-Tabelle2[[#This Row],[Smart City]]<0,-1*IF(ABS(Tabelle2[[#This Row],[Business as usual]]-Tabelle2[[#This Row],[Smart City]])<Tabelle2[[#This Row],[q-Wert (Indifferenz)]], 0,IF(ABS(Tabelle2[[#This Row],[Business as usual]]-Tabelle2[[#This Row],[Smart City]])>Tabelle2[[#This Row],[p-Wert (Präferenz)]],1,IF(AND(ABS(Tabelle2[[#This Row],[Business as usual]]-Tabelle2[[#This Row],[Smart City]])<=Tabelle2[[#This Row],[p-Wert (Präferenz)]],ABS(Tabelle2[[#This Row],[Business as usual]]-Tabelle2[[#This Row],[Smart City]])>=Tabelle2[[#This Row],[q-Wert (Indifferenz)]]),((ABS(Tabelle2[[#This Row],[Business as usual]]-Tabelle2[[#This Row],[Smart City]])-Tabelle2[[#This Row],[q-Wert (Indifferenz)]])/(Tabelle2[[#This Row],[p-Wert (Präferenz)]]-Tabelle2[[#This Row],[q-Wert (Indifferenz)]]))))),IF(ABS(Tabelle2[[#This Row],[Business as usual]]-Tabelle2[[#This Row],[Smart City]])<Tabelle2[[#This Row],[q-Wert (Indifferenz)]], 0,IF(ABS(Tabelle2[[#This Row],[Business as usual]]-Tabelle2[[#This Row],[Smart City]])>Tabelle2[[#This Row],[p-Wert (Präferenz)]],1,IF(AND(ABS(Tabelle2[[#This Row],[Business as usual]]-Tabelle2[[#This Row],[Smart City]])<=Tabelle2[[#This Row],[p-Wert (Präferenz)]],ABS(Tabelle2[[#This Row],[Business as usual]]-Tabelle2[[#This Row],[Smart City]])>=Tabelle2[[#This Row],[q-Wert (Indifferenz)]]),((ABS(Tabelle2[[#This Row],[Business as usual]]-Tabelle2[[#This Row],[Smart City]])-Tabelle2[[#This Row],[q-Wert (Indifferenz)]])/(Tabelle2[[#This Row],[p-Wert (Präferenz)]]-Tabelle2[[#This Row],[q-Wert (Indifferenz)]])))))))","v":-0.65354330708661412},{"$f":"IF(Tabelle2[[#This Row],[min/max]]=\"min\",-1*IF(Tabelle2[[#This Row],[Business as usual]]-Tabelle2[[#This Row],[Healthy City]]<0,-1*IF(ABS(Tabelle2[[#This Row],[Business as usual]]-Tabelle2[[#This Row],[Healthy City]])<Tabelle2[[#This Row],[q-Wert (Indifferenz)]], 0,IF(ABS(Tabelle2[[#This Row],[Business as usual]]-Tabelle2[[#This Row],[Healthy City]])>Tabelle2[[#This Row],[p-Wert (Präferenz)]],1,IF(AND(ABS(Tabelle2[[#This Row],[Business as usual]]-Tabelle2[[#This Row],[Healthy City]])<=Tabelle2[[#This Row],[p-Wert (Präferenz)]],ABS(Tabelle2[[#This Row],[Business as usual]]-Tabelle2[[#This Row],[Healthy City]])>=Tabelle2[[#This Row],[q-Wert (Indifferenz)]]),((ABS(Tabelle2[[#This Row],[Business as usual]]-Tabelle2[[#This Row],[Healthy City]])-Tabelle2[[#This Row],[q-Wert (Indifferenz)]])/(Tabelle2[[#This Row],[p-Wert (Präferenz)]]-Tabelle2[[#This Row],[q-Wert (Indifferenz)]]))))),IF(ABS(Tabelle2[[#This Row],[Business as usual]]-Tabelle2[[#This Row],[Healthy City]])<Tabelle2[[#This Row],[q-Wert (Indifferenz)]], 0,IF(ABS(Tabelle2[[#This Row],[Business as usual]]-Tabelle2[[#This Row],[Healthy City]])>Tabelle2[[#This Row],[p-Wert (Präferenz)]],1,IF(AND(ABS(Tabelle2[[#This Row],[Business as usual]]-Tabelle2[[#This Row],[Healthy City]])<=Tabelle2[[#This Row],[p-Wert (Präferenz)]],ABS(Tabelle2[[#This Row],[Business as usual]]-Tabelle2[[#This Row],[Healthy City]])>=Tabelle2[[#This Row],[q-Wert (Indifferenz)]]),((ABS(Tabelle2[[#This Row],[Business as usual]]-Tabelle2[[#This Row],[Healthy City]])-Tabelle2[[#This Row],[q-Wert (Indifferenz)]])/(Tabelle2[[#This Row],[p-Wert (Präferenz)]]-Tabelle2[[#This Row],[q-Wert (Indifferenz)]])))))),IF(Tabelle2[[#This Row],[Business as usual]]-Tabelle2[[#This Row],[Healthy City]]<0,-1*IF(ABS(Tabelle2[[#This Row],[Business as usual]]-Tabelle2[[#This Row],[Healthy City]])<Tabelle2[[#This Row],[q-Wert (Indifferenz)]], 0,IF(ABS(Tabelle2[[#This Row],[Business as usual]]-Tabelle2[[#This Row],[Healthy City]])>Tabelle2[[#This Row],[p-Wert (Präferenz)]],1,IF(AND(ABS(Tabelle2[[#This Row],[Business as usual]]-Tabelle2[[#This Row],[Healthy City]])<=Tabelle2[[#This Row],[p-Wert (Präferenz)]],ABS(Tabelle2[[#This Row],[Business as usual]]-Tabelle2[[#This Row],[Healthy City]])>=Tabelle2[[#This Row],[q-Wert (Indifferenz)]]),((ABS(Tabelle2[[#This Row],[Business as usual]]-Tabelle2[[#This Row],[Healthy City]])-Tabelle2[[#This Row],[q-Wert (Indifferenz)]])/(Tabelle2[[#This Row],[p-Wert (Präferenz)]]-Tabelle2[[#This Row],[q-Wert (Indifferenz)]]))))),IF(ABS(Tabelle2[[#This Row],[Business as usual]]-Tabelle2[[#This Row],[Healthy City]])<Tabelle2[[#This Row],[q-Wert (Indifferenz)]], 0,IF(ABS(Tabelle2[[#This Row],[Business as usual]]-Tabelle2[[#This Row],[Healthy City]])>Tabelle2[[#This Row],[p-Wert (Präferenz)]],1,IF(AND(ABS(Tabelle2[[#This Row],[Business as usual]]-Tabelle2[[#This Row],[Healthy City]])<=Tabelle2[[#This Row],[p-Wert (Präferenz)]],ABS(Tabelle2[[#This Row],[Business as usual]]-Tabelle2[[#This Row],[Healthy City]])>=Tabelle2[[#This Row],[q-Wert (Indifferenz)]]),((ABS(Tabelle2[[#This Row],[Business as usual]]-Tabelle2[[#This Row],[Healthy City]])-Tabelle2[[#This Row],[q-Wert (Indifferenz)]])/(Tabelle2[[#This Row],[p-Wert (Präferenz)]]-Tabelle2[[#This Row],[q-Wert (Indifferenz)]])))))))","v":-0.952755905511811},{"$f":"IF(Tabelle2[[#This Row],[min/max]]=\"min\",-1*IF(Tabelle2[[#This Row],[Business as usual]]-Tabelle2[[#This Row],[Urban Sprawl]]<0,-1*IF(ABS(Tabelle2[[#This Row],[Business as usual]]-Tabelle2[[#This Row],[Urban Sprawl]])<Tabelle2[[#This Row],[q-Wert (Indifferenz)]], 0,IF(ABS(Tabelle2[[#This Row],[Business as usual]]-Tabelle2[[#This Row],[Urban Sprawl]])>Tabelle2[[#This Row],[p-Wert (Präferenz)]],1,IF(AND(ABS(Tabelle2[[#This Row],[Business as usual]]-Tabelle2[[#This Row],[Urban Sprawl]])<=Tabelle2[[#This Row],[p-Wert (Präferenz)]],ABS(Tabelle2[[#This Row],[Business as usual]]-Tabelle2[[#This Row],[Urban Sprawl]])>=Tabelle2[[#This Row],[q-Wert (Indifferenz)]]),((ABS(Tabelle2[[#This Row],[Business as usual]]-Tabelle2[[#This Row],[Urban Sprawl]])-Tabelle2[[#This Row],[q-Wert (Indifferenz)]])/(Tabelle2[[#This Row],[p-Wert (Präferenz)]]-Tabelle2[[#This Row],[q-Wert (Indifferenz)]]))))),IF(ABS(Tabelle2[[#This Row],[Business as usual]]-Tabelle2[[#This Row],[Urban Sprawl]])<Tabelle2[[#This Row],[q-Wert (Indifferenz)]], 0,IF(ABS(Tabelle2[[#This Row],[Business as usual]]-Tabelle2[[#This Row],[Urban Sprawl]])>Tabelle2[[#This Row],[p-Wert (Präferenz)]],1,IF(AND(ABS(Tabelle2[[#This Row],[Business as usual]]-Tabelle2[[#This Row],[Urban Sprawl]])<=Tabelle2[[#This Row],[p-Wert (Präferenz)]],ABS(Tabelle2[[#This Row],[Business as usual]]-Tabelle2[[#This Row],[Urban Sprawl]])>=Tabelle2[[#This Row],[q-Wert (Indifferenz)]]),((ABS(Tabelle2[[#This Row],[Business as usual]]-Tabelle2[[#This Row],[Urban Sprawl]])-Tabelle2[[#This Row],[q-Wert (Indifferenz)]])/(Tabelle2[[#This Row],[p-Wert (Präferenz)]]-Tabelle2[[#This Row],[q-Wert (Indifferenz)]])))))),IF(Tabelle2[[#This Row],[Business as usual]]-Tabelle2[[#This Row],[Urban Sprawl]]<0,-1*IF(ABS(Tabelle2[[#This Row],[Business as usual]]-Tabelle2[[#This Row],[Urban Sprawl]])<Tabelle2[[#This Row],[q-Wert (Indifferenz)]], 0,IF(ABS(Tabelle2[[#This Row],[Business as usual]]-Tabelle2[[#This Row],[Urban Sprawl]])>Tabelle2[[#This Row],[p-Wert (Präferenz)]],1,IF(AND(ABS(Tabelle2[[#This Row],[Business as usual]]-Tabelle2[[#This Row],[Urban Sprawl]])<=Tabelle2[[#This Row],[p-Wert (Präferenz)]],ABS(Tabelle2[[#This Row],[Business as usual]]-Tabelle2[[#This Row],[Urban Sprawl]])>=Tabelle2[[#This Row],[q-Wert (Indifferenz)]]),((ABS(Tabelle2[[#This Row],[Business as usual]]-Tabelle2[[#This Row],[Urban Sprawl]])-Tabelle2[[#This Row],[q-Wert (Indifferenz)]])/(Tabelle2[[#This Row],[p-Wert (Präferenz)]]-Tabelle2[[#This Row],[q-Wert (Indifferenz)]]))))),IF(ABS(Tabelle2[[#This Row],[Business as usual]]-Tabelle2[[#This Row],[Urban Sprawl]])<Tabelle2[[#This Row],[q-Wert (Indifferenz)]], 0,IF(ABS(Tabelle2[[#This Row],[Business as usual]]-Tabelle2[[#This Row],[Urban Sprawl]])>Tabelle2[[#This Row],[p-Wert (Präferenz)]],1,IF(AND(ABS(Tabelle2[[#This Row],[Business as usual]]-Tabelle2[[#This Row],[Urban Sprawl]])<=Tabelle2[[#This Row],[p-Wert (Präferenz)]],ABS(Tabelle2[[#This Row],[Business as usual]]-Tabelle2[[#This Row],[Urban Sprawl]])>=Tabelle2[[#This Row],[q-Wert (Indifferenz)]]),((ABS(Tabelle2[[#This Row],[Business as usual]]-Tabelle2[[#This Row],[Urban Sprawl]])-Tabelle2[[#This Row],[q-Wert (Indifferenz)]])/(Tabelle2[[#This Row],[p-Wert (Präferenz)]]-Tabelle2[[#This Row],[q-Wert (Indifferenz)]])))))))","v":0}]
[null,null,null,"Internetabdeckung",{"$f":"('\"Walking Weights\"'!D14)/100","v":5.5555555555555552E-2},"max","%",100,80,80,70,"Typ 5",10,25,{"$f":"IF(Tabelle2[[#This Row],[min/max]]=\"min\",-1*IF(Tabelle2[[#This Row],[Smart City]]-Tabelle2[[#This Row],[Healthy City]]<0,-1*IF(ABS(Tabelle2[[#This Row],[Smart City]]-Tabelle2[[#This Row],[Healthy City]])<Tabelle2[[#This Row],[q-Wert (Indifferenz)]], 0,IF(ABS(Tabelle2[[#This Row],[Smart City]]-Tabelle2[[#This Row],[Healthy City]])>Tabelle2[[#This Row],[p-Wert (Präferenz)]],1,IF(AND(ABS(Tabelle2[[#This Row],[Smart City]]-Tabelle2[[#This Row],[Healthy City]])<=Tabelle2[[#This Row],[p-Wert (Präferenz)]],ABS(Tabelle2[[#This Row],[Smart City]]-Tabelle2[[#This Row],[Healthy City]])>=Tabelle2[[#This Row],[q-Wert (Indifferenz)]]),((ABS(Tabelle2[[#This Row],[Smart City]]-Tabelle2[[#This Row],[Healthy City]])-Tabelle2[[#This Row],[q-Wert (Indifferenz)]])/(Tabelle2[[#This Row],[p-Wert (Präferenz)]]-Tabelle2[[#This Row],[q-Wert (Indifferenz)]]))))),IF(ABS(Tabelle2[[#This Row],[Smart City]]-Tabelle2[[#This Row],[Healthy City]])<Tabelle2[[#This Row],[q-Wert (Indifferenz)]], 0,IF(ABS(Tabelle2[[#This Row],[Smart City]]-Tabelle2[[#This Row],[Healthy City]])>Tabelle2[[#This Row],[p-Wert (Präferenz)]],1,IF(AND(ABS(Tabelle2[[#This Row],[Smart City]]-Tabelle2[[#This Row],[Healthy City]])<=Tabelle2[[#This Row],[p-Wert (Präferenz)]],ABS(Tabelle2[[#This Row],[Smart City]]-Tabelle2[[#This Row],[Healthy City]])>=Tabelle2[[#This Row],[q-Wert (Indifferenz)]]),((ABS(Tabelle2[[#This Row],[Smart City]]-Tabelle2[[#This Row],[Healthy City]])-Tabelle2[[#This Row],[q-Wert (Indifferenz)]])/(Tabelle2[[#This Row],[p-Wert (Präferenz)]]-Tabelle2[[#This Row],[q-Wert (Indifferenz)]])))))),IF(Tabelle2[[#This Row],[Smart City]]-Tabelle2[[#This Row],[Healthy City]]<0,-1*IF(ABS(Tabelle2[[#This Row],[Smart City]]-Tabelle2[[#This Row],[Healthy City]])<Tabelle2[[#This Row],[q-Wert (Indifferenz)]], 0,IF(ABS(Tabelle2[[#This Row],[Smart City]]-Tabelle2[[#This Row],[Healthy City]])>Tabelle2[[#This Row],[p-Wert (Präferenz)]],1,IF(AND(ABS(Tabelle2[[#This Row],[Smart City]]-Tabelle2[[#This Row],[Healthy City]])<=Tabelle2[[#This Row],[p-Wert (Präferenz)]],ABS(Tabelle2[[#This Row],[Smart City]]-Tabelle2[[#This Row],[Healthy City]])>=Tabelle2[[#This Row],[q-Wert (Indifferenz)]]),((ABS(Tabelle2[[#This Row],[Smart City]]-Tabelle2[[#This Row],[Healthy City]])-Tabelle2[[#This Row],[q-Wert (Indifferenz)]])/(Tabelle2[[#This Row],[p-Wert (Präferenz)]]-Tabelle2[[#This Row],[q-Wert (Indifferenz)]]))))),IF(ABS(Tabelle2[[#This Row],[Smart City]]-Tabelle2[[#This Row],[Healthy City]])<Tabelle2[[#This Row],[q-Wert (Indifferenz)]], 0,IF(ABS(Tabelle2[[#This Row],[Smart City]]-Tabelle2[[#This Row],[Healthy City]])>Tabelle2[[#This Row],[p-Wert (Präferenz)]],1,IF(AND(ABS(Tabelle2[[#This Row],[Smart City]]-Tabelle2[[#This Row],[Healthy City]])<=Tabelle2[[#This Row],[p-Wert (Präferenz)]],ABS(Tabelle2[[#This Row],[Smart City]]-Tabelle2[[#This Row],[Healthy City]])>=Tabelle2[[#This Row],[q-Wert (Indifferenz)]]),((ABS(Tabelle2[[#This Row],[Smart City]]-Tabelle2[[#This Row],[Healthy City]])-Tabelle2[[#This Row],[q-Wert (Indifferenz)]])/(Tabelle2[[#This Row],[p-Wert (Präferenz)]]-Tabelle2[[#This Row],[q-Wert (Indifferenz)]])))))))","v":0.66666666666666663},{"$f":"IF(Tabelle2[[#This Row],[min/max]]=\"min\",-1*IF(Tabelle2[[#This Row],[Smart City]]-Tabelle2[[#This Row],[Urban Sprawl]]<0,-1*IF(ABS(Tabelle2[[#This Row],[Smart City]]-Tabelle2[[#This Row],[Urban Sprawl]])<Tabelle2[[#This Row],[q-Wert (Indifferenz)]], 0,IF(ABS(Tabelle2[[#This Row],[Smart City]]-Tabelle2[[#This Row],[Urban Sprawl]])>Tabelle2[[#This Row],[p-Wert (Präferenz)]],1,IF(AND(ABS(Tabelle2[[#This Row],[Smart City]]-Tabelle2[[#This Row],[Urban Sprawl]])<=Tabelle2[[#This Row],[p-Wert (Präferenz)]],ABS(Tabelle2[[#This Row],[Smart City]]-Tabelle2[[#This Row],[Urban Sprawl]])>=Tabelle2[[#This Row],[q-Wert (Indifferenz)]]),((ABS(Tabelle2[[#This Row],[Smart City]]-Tabelle2[[#This Row],[Urban Sprawl]])-Tabelle2[[#This Row],[q-Wert (Indifferenz)]])/(Tabelle2[[#This Row],[p-Wert (Präferenz)]]-Tabelle2[[#This Row],[q-Wert (Indifferenz)]]))))),IF(ABS(Tabelle2[[#This Row],[Smart City]]-Tabelle2[[#This Row],[Urban Sprawl]])<Tabelle2[[#This Row],[q-Wert (Indifferenz)]], 0,IF(ABS(Tabelle2[[#This Row],[Smart City]]-Tabelle2[[#This Row],[Urban Sprawl]])>Tabelle2[[#This Row],[p-Wert (Präferenz)]],1,IF(AND(ABS(Tabelle2[[#This Row],[Smart City]]-Tabelle2[[#This Row],[Urban Sprawl]])<=Tabelle2[[#This Row],[p-Wert (Präferenz)]],ABS(Tabelle2[[#This Row],[Smart City]]-Tabelle2[[#This Row],[Urban Sprawl]])>=Tabelle2[[#This Row],[q-Wert (Indifferenz)]]),((ABS(Tabelle2[[#This Row],[Smart City]]-Tabelle2[[#This Row],[Urban Sprawl]])-Tabelle2[[#This Row],[q-Wert (Indifferenz)]])/(Tabelle2[[#This Row],[p-Wert (Präferenz)]]-Tabelle2[[#This Row],[q-Wert (Indifferenz)]])))))),IF(Tabelle2[[#This Row],[Smart City]]-Tabelle2[[#This Row],[Urban Sprawl]]<0,-1*IF(ABS(Tabelle2[[#This Row],[Smart City]]-Tabelle2[[#This Row],[Urban Sprawl]])<Tabelle2[[#This Row],[q-Wert (Indifferenz)]], 0,IF(ABS(Tabelle2[[#This Row],[Smart City]]-Tabelle2[[#This Row],[Urban Sprawl]])>Tabelle2[[#This Row],[p-Wert (Präferenz)]],1,IF(AND(ABS(Tabelle2[[#This Row],[Smart City]]-Tabelle2[[#This Row],[Urban Sprawl]])<=Tabelle2[[#This Row],[p-Wert (Präferenz)]],ABS(Tabelle2[[#This Row],[Smart City]]-Tabelle2[[#This Row],[Urban Sprawl]])>=Tabelle2[[#This Row],[q-Wert (Indifferenz)]]),((ABS(Tabelle2[[#This Row],[Smart City]]-Tabelle2[[#This Row],[Urban Sprawl]])-Tabelle2[[#This Row],[q-Wert (Indifferenz)]])/(Tabelle2[[#This Row],[p-Wert (Präferenz)]]-Tabelle2[[#This Row],[q-Wert (Indifferenz)]]))))),IF(ABS(Tabelle2[[#This Row],[Smart City]]-Tabelle2[[#This Row],[Urban Sprawl]])<Tabelle2[[#This Row],[q-Wert (Indifferenz)]], 0,IF(ABS(Tabelle2[[#This Row],[Smart City]]-Tabelle2[[#This Row],[Urban Sprawl]])>Tabelle2[[#This Row],[p-Wert (Präferenz)]],1,IF(AND(ABS(Tabelle2[[#This Row],[Smart City]]-Tabelle2[[#This Row],[Urban Sprawl]])<=Tabelle2[[#This Row],[p-Wert (Präferenz)]],ABS(Tabelle2[[#This Row],[Smart City]]-Tabelle2[[#This Row],[Urban Sprawl]])>=Tabelle2[[#This Row],[q-Wert (Indifferenz)]]),((ABS(Tabelle2[[#This Row],[Smart City]]-Tabelle2[[#This Row],[Urban Sprawl]])-Tabelle2[[#This Row],[q-Wert (Indifferenz)]])/(Tabelle2[[#This Row],[p-Wert (Präferenz)]]-Tabelle2[[#This Row],[q-Wert (Indifferenz)]])))))))","v":0.66666666666666663},{"$f":"IF(Tabelle2[[#This Row],[min/max]]=\"min\",-1*IF(Tabelle2[[#This Row],[Smart City]]-Tabelle2[[#This Row],[Business as usual]]<0,-1*IF(ABS(Tabelle2[[#This Row],[Smart City]]-Tabelle2[[#This Row],[Business as usual]])<Tabelle2[[#This Row],[q-Wert (Indifferenz)]], 0,IF(ABS(Tabelle2[[#This Row],[Smart City]]-Tabelle2[[#This Row],[Business as usual]])>Tabelle2[[#This Row],[p-Wert (Präferenz)]],1,IF(AND(ABS(Tabelle2[[#This Row],[Smart City]]-Tabelle2[[#This Row],[Business as usual]])<=Tabelle2[[#This Row],[p-Wert (Präferenz)]],ABS(Tabelle2[[#This Row],[Smart City]]-Tabelle2[[#This Row],[Business as usual]])>=Tabelle2[[#This Row],[q-Wert (Indifferenz)]]),((ABS(Tabelle2[[#This Row],[Smart City]]-Tabelle2[[#This Row],[Business as usual]])-Tabelle2[[#This Row],[q-Wert (Indifferenz)]])/(Tabelle2[[#This Row],[p-Wert (Präferenz)]]-Tabelle2[[#This Row],[q-Wert (Indifferenz)]]))))),IF(ABS(Tabelle2[[#This Row],[Smart City]]-Tabelle2[[#This Row],[Business as usual]])<Tabelle2[[#This Row],[q-Wert (Indifferenz)]], 0,IF(ABS(Tabelle2[[#This Row],[Smart City]]-Tabelle2[[#This Row],[Business as usual]])>Tabelle2[[#This Row],[p-Wert (Präferenz)]],1,IF(AND(ABS(Tabelle2[[#This Row],[Smart City]]-Tabelle2[[#This Row],[Business as usual]])<=Tabelle2[[#This Row],[p-Wert (Präferenz)]],ABS(Tabelle2[[#This Row],[Smart City]]-Tabelle2[[#This Row],[Business as usual]])>=Tabelle2[[#This Row],[q-Wert (Indifferenz)]]),((ABS(Tabelle2[[#This Row],[Smart City]]-Tabelle2[[#This Row],[Business as usual]])-Tabelle2[[#This Row],[q-Wert (Indifferenz)]])/(Tabelle2[[#This Row],[p-Wert (Präferenz)]]-Tabelle2[[#This Row],[q-Wert (Indifferenz)]])))))),IF(Tabelle2[[#This Row],[Smart City]]-Tabelle2[[#This Row],[Business as usual]]<0,-1*IF(ABS(Tabelle2[[#This Row],[Smart City]]-Tabelle2[[#This Row],[Business as usual]])<Tabelle2[[#This Row],[q-Wert (Indifferenz)]], 0,IF(ABS(Tabelle2[[#This Row],[Smart City]]-Tabelle2[[#This Row],[Business as usual]])>Tabelle2[[#This Row],[p-Wert (Präferenz)]],1,IF(AND(ABS(Tabelle2[[#This Row],[Smart City]]-Tabelle2[[#This Row],[Business as usual]])<=Tabelle2[[#This Row],[p-Wert (Präferenz)]],ABS(Tabelle2[[#This Row],[Smart City]]-Tabelle2[[#This Row],[Business as usual]])>=Tabelle2[[#This Row],[q-Wert (Indifferenz)]]),((ABS(Tabelle2[[#This Row],[Smart City]]-Tabelle2[[#This Row],[Business as usual]])-Tabelle2[[#This Row],[q-Wert (Indifferenz)]])/(Tabelle2[[#This Row],[p-Wert (Präferenz)]]-Tabelle2[[#This Row],[q-Wert (Indifferenz)]]))))),IF(ABS(Tabelle2[[#This Row],[Smart City]]-Tabelle2[[#This Row],[Business as usual]])<Tabelle2[[#This Row],[q-Wert (Indifferenz)]], 0,IF(ABS(Tabelle2[[#This Row],[Smart City]]-Tabelle2[[#This Row],[Business as usual]])>Tabelle2[[#This Row],[p-Wert (Präferenz)]],1,IF(AND(ABS(Tabelle2[[#This Row],[Smart City]]-Tabelle2[[#This Row],[Business as usual]])<=Tabelle2[[#This Row],[p-Wert (Präferenz)]],ABS(Tabelle2[[#This Row],[Smart City]]-Tabelle2[[#This Row],[Business as usual]])>=Tabelle2[[#This Row],[q-Wert (Indifferenz)]]),((ABS(Tabelle2[[#This Row],[Smart City]]-Tabelle2[[#This Row],[Business as usual]])-Tabelle2[[#This Row],[q-Wert (Indifferenz)]])/(Tabelle2[[#This Row],[p-Wert (Präferenz)]]-Tabelle2[[#This Row],[q-Wert (Indifferenz)]])))))))","v":1},null,{"$f":"IF(Tabelle2[[#This Row],[min/max]]=\"min\",-1*IF(Tabelle2[[#This Row],[Healthy City]]-Tabelle2[[#This Row],[Smart City]]<0,-1*IF(ABS(Tabelle2[[#This Row],[Healthy City]]-Tabelle2[[#This Row],[Smart City]])<Tabelle2[[#This Row],[q-Wert (Indifferenz)]], 0,IF(ABS(Tabelle2[[#This Row],[Healthy City]]-Tabelle2[[#This Row],[Smart City]])>Tabelle2[[#This Row],[p-Wert (Präferenz)]],1,IF(AND(ABS(Tabelle2[[#This Row],[Healthy City]]-Tabelle2[[#This Row],[Smart City]])<=Tabelle2[[#This Row],[p-Wert (Präferenz)]],ABS(Tabelle2[[#This Row],[Healthy City]]-Tabelle2[[#This Row],[Smart City]])>=Tabelle2[[#This Row],[q-Wert (Indifferenz)]]),((ABS(Tabelle2[[#This Row],[Healthy City]]-Tabelle2[[#This Row],[Smart City]])-Tabelle2[[#This Row],[q-Wert (Indifferenz)]])/(Tabelle2[[#This Row],[p-Wert (Präferenz)]]-Tabelle2[[#This Row],[q-Wert (Indifferenz)]]))))),IF(ABS(Tabelle2[[#This Row],[Healthy City]]-Tabelle2[[#This Row],[Smart City]])<Tabelle2[[#This Row],[q-Wert (Indifferenz)]], 0,IF(ABS(Tabelle2[[#This Row],[Healthy City]]-Tabelle2[[#This Row],[Smart City]])>Tabelle2[[#This Row],[p-Wert (Präferenz)]],1,IF(AND(ABS(Tabelle2[[#This Row],[Healthy City]]-Tabelle2[[#This Row],[Smart City]])<=Tabelle2[[#This Row],[p-Wert (Präferenz)]],ABS(Tabelle2[[#This Row],[Healthy City]]-Tabelle2[[#This Row],[Smart City]])>=Tabelle2[[#This Row],[q-Wert (Indifferenz)]]),((ABS(Tabelle2[[#This Row],[Healthy City]]-Tabelle2[[#This Row],[Smart City]])-Tabelle2[[#This Row],[q-Wert (Indifferenz)]])/(Tabelle2[[#This Row],[p-Wert (Präferenz)]]-Tabelle2[[#This Row],[q-Wert (Indifferenz)]])))))),IF(Tabelle2[[#This Row],[Healthy City]]-Tabelle2[[#This Row],[Smart City]]<0,-1*IF(ABS(Tabelle2[[#This Row],[Healthy City]]-Tabelle2[[#This Row],[Smart City]])<Tabelle2[[#This Row],[q-Wert (Indifferenz)]], 0,IF(ABS(Tabelle2[[#This Row],[Healthy City]]-Tabelle2[[#This Row],[Smart City]])>Tabelle2[[#This Row],[p-Wert (Präferenz)]],1,IF(AND(ABS(Tabelle2[[#This Row],[Healthy City]]-Tabelle2[[#This Row],[Smart City]])<=Tabelle2[[#This Row],[p-Wert (Präferenz)]],ABS(Tabelle2[[#This Row],[Healthy City]]-Tabelle2[[#This Row],[Smart City]])>=Tabelle2[[#This Row],[q-Wert (Indifferenz)]]),((ABS(Tabelle2[[#This Row],[Healthy City]]-Tabelle2[[#This Row],[Smart City]])-Tabelle2[[#This Row],[q-Wert (Indifferenz)]])/(Tabelle2[[#This Row],[p-Wert (Präferenz)]]-Tabelle2[[#This Row],[q-Wert (Indifferenz)]]))))),IF(ABS(Tabelle2[[#This Row],[Healthy City]]-Tabelle2[[#This Row],[Smart City]])<Tabelle2[[#This Row],[q-Wert (Indifferenz)]], 0,IF(ABS(Tabelle2[[#This Row],[Healthy City]]-Tabelle2[[#This Row],[Smart City]])>Tabelle2[[#This Row],[p-Wert (Präferenz)]],1,IF(AND(ABS(Tabelle2[[#This Row],[Healthy City]]-Tabelle2[[#This Row],[Smart City]])<=Tabelle2[[#This Row],[p-Wert (Präferenz)]],ABS(Tabelle2[[#This Row],[Healthy City]]-Tabelle2[[#This Row],[Smart City]])>=Tabelle2[[#This Row],[q-Wert (Indifferenz)]]),((ABS(Tabelle2[[#This Row],[Healthy City]]-Tabelle2[[#This Row],[Smart City]])-Tabelle2[[#This Row],[q-Wert (Indifferenz)]])/(Tabelle2[[#This Row],[p-Wert (Präferenz)]]-Tabelle2[[#This Row],[q-Wert (Indifferenz)]])))))))","v":-0.66666666666666663},{"$f":"IF(Tabelle2[[#This Row],[min/max]]=\"min\",-1*IF(Tabelle2[[#This Row],[Healthy City]]-Tabelle2[[#This Row],[Urban Sprawl]]<0,-1*IF(ABS(Tabelle2[[#This Row],[Healthy City]]-Tabelle2[[#This Row],[Urban Sprawl]])<Tabelle2[[#This Row],[q-Wert (Indifferenz)]], 0,IF(ABS(Tabelle2[[#This Row],[Healthy City]]-Tabelle2[[#This Row],[Urban Sprawl]])>Tabelle2[[#This Row],[p-Wert (Präferenz)]],1,IF(AND(ABS(Tabelle2[[#This Row],[Healthy City]]-Tabelle2[[#This Row],[Urban Sprawl]])<=Tabelle2[[#This Row],[p-Wert (Präferenz)]],ABS(Tabelle2[[#This Row],[Healthy City]]-Tabelle2[[#This Row],[Urban Sprawl]])>=Tabelle2[[#This Row],[q-Wert (Indifferenz)]]),((ABS(Tabelle2[[#This Row],[Healthy City]]-Tabelle2[[#This Row],[Urban Sprawl]])-Tabelle2[[#This Row],[q-Wert (Indifferenz)]])/(Tabelle2[[#This Row],[p-Wert (Präferenz)]]-Tabelle2[[#This Row],[q-Wert (Indifferenz)]]))))),IF(ABS(Tabelle2[[#This Row],[Healthy City]]-Tabelle2[[#This Row],[Urban Sprawl]])<Tabelle2[[#This Row],[q-Wert (Indifferenz)]], 0,IF(ABS(Tabelle2[[#This Row],[Healthy City]]-Tabelle2[[#This Row],[Urban Sprawl]])>Tabelle2[[#This Row],[p-Wert (Präferenz)]],1,IF(AND(ABS(Tabelle2[[#This Row],[Healthy City]]-Tabelle2[[#This Row],[Urban Sprawl]])<=Tabelle2[[#This Row],[p-Wert (Präferenz)]],ABS(Tabelle2[[#This Row],[Healthy City]]-Tabelle2[[#This Row],[Urban Sprawl]])>=Tabelle2[[#This Row],[q-Wert (Indifferenz)]]),((ABS(Tabelle2[[#This Row],[Healthy City]]-Tabelle2[[#This Row],[Urban Sprawl]])-Tabelle2[[#This Row],[q-Wert (Indifferenz)]])/(Tabelle2[[#This Row],[p-Wert (Präferenz)]]-Tabelle2[[#This Row],[q-Wert (Indifferenz)]])))))),IF(Tabelle2[[#This Row],[Healthy City]]-Tabelle2[[#This Row],[Urban Sprawl]]<0,-1*IF(ABS(Tabelle2[[#This Row],[Healthy City]]-Tabelle2[[#This Row],[Urban Sprawl]])<Tabelle2[[#This Row],[q-Wert (Indifferenz)]], 0,IF(ABS(Tabelle2[[#This Row],[Healthy City]]-Tabelle2[[#This Row],[Urban Sprawl]])>Tabelle2[[#This Row],[p-Wert (Präferenz)]],1,IF(AND(ABS(Tabelle2[[#This Row],[Healthy City]]-Tabelle2[[#This Row],[Urban Sprawl]])<=Tabelle2[[#This Row],[p-Wert (Präferenz)]],ABS(Tabelle2[[#This Row],[Healthy City]]-Tabelle2[[#This Row],[Urban Sprawl]])>=Tabelle2[[#This Row],[q-Wert (Indifferenz)]]),((ABS(Tabelle2[[#This Row],[Healthy City]]-Tabelle2[[#This Row],[Urban Sprawl]])-Tabelle2[[#This Row],[q-Wert (Indifferenz)]])/(Tabelle2[[#This Row],[p-Wert (Präferenz)]]-Tabelle2[[#This Row],[q-Wert (Indifferenz)]]))))),IF(ABS(Tabelle2[[#This Row],[Healthy City]]-Tabelle2[[#This Row],[Urban Sprawl]])<Tabelle2[[#This Row],[q-Wert (Indifferenz)]], 0,IF(ABS(Tabelle2[[#This Row],[Healthy City]]-Tabelle2[[#This Row],[Urban Sprawl]])>Tabelle2[[#This Row],[p-Wert (Präferenz)]],1,IF(AND(ABS(Tabelle2[[#This Row],[Healthy City]]-Tabelle2[[#This Row],[Urban Sprawl]])<=Tabelle2[[#This Row],[p-Wert (Präferenz)]],ABS(Tabelle2[[#This Row],[Healthy City]]-Tabelle2[[#This Row],[Urban Sprawl]])>=Tabelle2[[#This Row],[q-Wert (Indifferenz)]]),((ABS(Tabelle2[[#This Row],[Healthy City]]-Tabelle2[[#This Row],[Urban Sprawl]])-Tabelle2[[#This Row],[q-Wert (Indifferenz)]])/(Tabelle2[[#This Row],[p-Wert (Präferenz)]]-Tabelle2[[#This Row],[q-Wert (Indifferenz)]])))))))","v":0},{"$f":"IF(Tabelle2[[#This Row],[min/max]]=\"min\",-1*IF(Tabelle2[[#This Row],[Healthy City]]-Tabelle2[[#This Row],[Business as usual]]<0,-1*IF(ABS(Tabelle2[[#This Row],[Healthy City]]-Tabelle2[[#This Row],[Business as usual]])<Tabelle2[[#This Row],[q-Wert (Indifferenz)]], 0,IF(ABS(Tabelle2[[#This Row],[Healthy City]]-Tabelle2[[#This Row],[Business as usual]])>Tabelle2[[#This Row],[p-Wert (Präferenz)]],1,IF(AND(ABS(Tabelle2[[#This Row],[Healthy City]]-Tabelle2[[#This Row],[Business as usual]])<=Tabelle2[[#This Row],[p-Wert (Präferenz)]],ABS(Tabelle2[[#This Row],[Healthy City]]-Tabelle2[[#This Row],[Business as usual]])>=Tabelle2[[#This Row],[q-Wert (Indifferenz)]]),((ABS(Tabelle2[[#This Row],[Healthy City]]-Tabelle2[[#This Row],[Business as usual]])-Tabelle2[[#This Row],[q-Wert (Indifferenz)]])/(Tabelle2[[#This Row],[p-Wert (Präferenz)]]-Tabelle2[[#This Row],[q-Wert (Indifferenz)]]))))),IF(ABS(Tabelle2[[#This Row],[Healthy City]]-Tabelle2[[#This Row],[Business as usual]])<Tabelle2[[#This Row],[q-Wert (Indifferenz)]], 0,IF(ABS(Tabelle2[[#This Row],[Healthy City]]-Tabelle2[[#This Row],[Business as usual]])>Tabelle2[[#This Row],[p-Wert (Präferenz)]],1,IF(AND(ABS(Tabelle2[[#This Row],[Healthy City]]-Tabelle2[[#This Row],[Business as usual]])<=Tabelle2[[#This Row],[p-Wert (Präferenz)]],ABS(Tabelle2[[#This Row],[Healthy City]]-Tabelle2[[#This Row],[Business as usual]])>=Tabelle2[[#This Row],[q-Wert (Indifferenz)]]),((ABS(Tabelle2[[#This Row],[Healthy City]]-Tabelle2[[#This Row],[Business as usual]])-Tabelle2[[#This Row],[q-Wert (Indifferenz)]])/(Tabelle2[[#This Row],[p-Wert (Präferenz)]]-Tabelle2[[#This Row],[q-Wert (Indifferenz)]])))))),IF(Tabelle2[[#This Row],[Healthy City]]-Tabelle2[[#This Row],[Business as usual]]<0,-1*IF(ABS(Tabelle2[[#This Row],[Healthy City]]-Tabelle2[[#This Row],[Business as usual]])<Tabelle2[[#This Row],[q-Wert (Indifferenz)]], 0,IF(ABS(Tabelle2[[#This Row],[Healthy City]]-Tabelle2[[#This Row],[Business as usual]])>Tabelle2[[#This Row],[p-Wert (Präferenz)]],1,IF(AND(ABS(Tabelle2[[#This Row],[Healthy City]]-Tabelle2[[#This Row],[Business as usual]])<=Tabelle2[[#This Row],[p-Wert (Präferenz)]],ABS(Tabelle2[[#This Row],[Healthy City]]-Tabelle2[[#This Row],[Business as usual]])>=Tabelle2[[#This Row],[q-Wert (Indifferenz)]]),((ABS(Tabelle2[[#This Row],[Healthy City]]-Tabelle2[[#This Row],[Business as usual]])-Tabelle2[[#This Row],[q-Wert (Indifferenz)]])/(Tabelle2[[#This Row],[p-Wert (Präferenz)]]-Tabelle2[[#This Row],[q-Wert (Indifferenz)]]))))),IF(ABS(Tabelle2[[#This Row],[Healthy City]]-Tabelle2[[#This Row],[Business as usual]])<Tabelle2[[#This Row],[q-Wert (Indifferenz)]], 0,IF(ABS(Tabelle2[[#This Row],[Healthy City]]-Tabelle2[[#This Row],[Business as usual]])>Tabelle2[[#This Row],[p-Wert (Präferenz)]],1,IF(AND(ABS(Tabelle2[[#This Row],[Healthy City]]-Tabelle2[[#This Row],[Business as usual]])<=Tabelle2[[#This Row],[p-Wert (Präferenz)]],ABS(Tabelle2[[#This Row],[Healthy City]]-Tabelle2[[#This Row],[Business as usual]])>=Tabelle2[[#This Row],[q-Wert (Indifferenz)]]),((ABS(Tabelle2[[#This Row],[Healthy City]]-Tabelle2[[#This Row],[Business as usual]])-Tabelle2[[#This Row],[q-Wert (Indifferenz)]])/(Tabelle2[[#This Row],[p-Wert (Präferenz)]]-Tabelle2[[#This Row],[q-Wert (Indifferenz)]])))))))","v":0},null,{"$f":"IF(Tabelle2[[#This Row],[min/max]]=\"min\",-1*IF(Tabelle2[[#This Row],[Urban Sprawl]]-Tabelle2[[#This Row],[Smart City]]<0,-1*IF(ABS(Tabelle2[[#This Row],[Urban Sprawl]]-Tabelle2[[#This Row],[Smart City]])<Tabelle2[[#This Row],[q-Wert (Indifferenz)]], 0,IF(ABS(Tabelle2[[#This Row],[Urban Sprawl]]-Tabelle2[[#This Row],[Smart City]])>Tabelle2[[#This Row],[p-Wert (Präferenz)]],1,IF(AND(ABS(Tabelle2[[#This Row],[Urban Sprawl]]-Tabelle2[[#This Row],[Smart City]])<=Tabelle2[[#This Row],[p-Wert (Präferenz)]],ABS(Tabelle2[[#This Row],[Urban Sprawl]]-Tabelle2[[#This Row],[Smart City]])>=Tabelle2[[#This Row],[q-Wert (Indifferenz)]]),((ABS(Tabelle2[[#This Row],[Urban Sprawl]]-Tabelle2[[#This Row],[Smart City]])-Tabelle2[[#This Row],[q-Wert (Indifferenz)]])/(Tabelle2[[#This Row],[p-Wert (Präferenz)]]-Tabelle2[[#This Row],[q-Wert (Indifferenz)]]))))),IF(ABS(Tabelle2[[#This Row],[Urban Sprawl]]-Tabelle2[[#This Row],[Smart City]])<Tabelle2[[#This Row],[q-Wert (Indifferenz)]], 0,IF(ABS(Tabelle2[[#This Row],[Urban Sprawl]]-Tabelle2[[#This Row],[Smart City]])>Tabelle2[[#This Row],[p-Wert (Präferenz)]],1,IF(AND(ABS(Tabelle2[[#This Row],[Urban Sprawl]]-Tabelle2[[#This Row],[Smart City]])<=Tabelle2[[#This Row],[p-Wert (Präferenz)]],ABS(Tabelle2[[#This Row],[Urban Sprawl]]-Tabelle2[[#This Row],[Smart City]])>=Tabelle2[[#This Row],[q-Wert (Indifferenz)]]),((ABS(Tabelle2[[#This Row],[Urban Sprawl]]-Tabelle2[[#This Row],[Smart City]])-Tabelle2[[#This Row],[q-Wert (Indifferenz)]])/(Tabelle2[[#This Row],[p-Wert (Präferenz)]]-Tabelle2[[#This Row],[q-Wert (Indifferenz)]])))))),IF(Tabelle2[[#This Row],[Urban Sprawl]]-Tabelle2[[#This Row],[Smart City]]<0,-1*IF(ABS(Tabelle2[[#This Row],[Urban Sprawl]]-Tabelle2[[#This Row],[Smart City]])<Tabelle2[[#This Row],[q-Wert (Indifferenz)]], 0,IF(ABS(Tabelle2[[#This Row],[Urban Sprawl]]-Tabelle2[[#This Row],[Smart City]])>Tabelle2[[#This Row],[p-Wert (Präferenz)]],1,IF(AND(ABS(Tabelle2[[#This Row],[Urban Sprawl]]-Tabelle2[[#This Row],[Smart City]])<=Tabelle2[[#This Row],[p-Wert (Präferenz)]],ABS(Tabelle2[[#This Row],[Urban Sprawl]]-Tabelle2[[#This Row],[Smart City]])>=Tabelle2[[#This Row],[q-Wert (Indifferenz)]]),((ABS(Tabelle2[[#This Row],[Urban Sprawl]]-Tabelle2[[#This Row],[Smart City]])-Tabelle2[[#This Row],[q-Wert (Indifferenz)]])/(Tabelle2[[#This Row],[p-Wert (Präferenz)]]-Tabelle2[[#This Row],[q-Wert (Indifferenz)]]))))),IF(ABS(Tabelle2[[#This Row],[Urban Sprawl]]-Tabelle2[[#This Row],[Smart City]])<Tabelle2[[#This Row],[q-Wert (Indifferenz)]], 0,IF(ABS(Tabelle2[[#This Row],[Urban Sprawl]]-Tabelle2[[#This Row],[Smart City]])>Tabelle2[[#This Row],[p-Wert (Präferenz)]],1,IF(AND(ABS(Tabelle2[[#This Row],[Urban Sprawl]]-Tabelle2[[#This Row],[Smart City]])<=Tabelle2[[#This Row],[p-Wert (Präferenz)]],ABS(Tabelle2[[#This Row],[Urban Sprawl]]-Tabelle2[[#This Row],[Smart City]])>=Tabelle2[[#This Row],[q-Wert (Indifferenz)]]),((ABS(Tabelle2[[#This Row],[Urban Sprawl]]-Tabelle2[[#This Row],[Smart City]])-Tabelle2[[#This Row],[q-Wert (Indifferenz)]])/(Tabelle2[[#This Row],[p-Wert (Präferenz)]]-Tabelle2[[#This Row],[q-Wert (Indifferenz)]])))))))","v":-0.66666666666666663},{"$f":"IF(Tabelle2[[#This Row],[min/max]]=\"min\",-1*IF(Tabelle2[[#This Row],[Urban Sprawl]]-Tabelle2[[#This Row],[Healthy City]]<0,-1*IF(ABS(Tabelle2[[#This Row],[Urban Sprawl]]-Tabelle2[[#This Row],[Healthy City]])<Tabelle2[[#This Row],[q-Wert (Indifferenz)]], 0,IF(ABS(Tabelle2[[#This Row],[Urban Sprawl]]-Tabelle2[[#This Row],[Healthy City]])>Tabelle2[[#This Row],[p-Wert (Präferenz)]],1,IF(AND(ABS(Tabelle2[[#This Row],[Urban Sprawl]]-Tabelle2[[#This Row],[Healthy City]])<=Tabelle2[[#This Row],[p-Wert (Präferenz)]],ABS(Tabelle2[[#This Row],[Urban Sprawl]]-Tabelle2[[#This Row],[Healthy City]])>=Tabelle2[[#This Row],[q-Wert (Indifferenz)]]),((ABS(Tabelle2[[#This Row],[Urban Sprawl]]-Tabelle2[[#This Row],[Healthy City]])-Tabelle2[[#This Row],[q-Wert (Indifferenz)]])/(Tabelle2[[#This Row],[p-Wert (Präferenz)]]-Tabelle2[[#This Row],[q-Wert (Indifferenz)]]))))),IF(ABS(Tabelle2[[#This Row],[Urban Sprawl]]-Tabelle2[[#This Row],[Healthy City]])<Tabelle2[[#This Row],[q-Wert (Indifferenz)]], 0,IF(ABS(Tabelle2[[#This Row],[Urban Sprawl]]-Tabelle2[[#This Row],[Healthy City]])>Tabelle2[[#This Row],[p-Wert (Präferenz)]],1,IF(AND(ABS(Tabelle2[[#This Row],[Urban Sprawl]]-Tabelle2[[#This Row],[Healthy City]])<=Tabelle2[[#This Row],[p-Wert (Präferenz)]],ABS(Tabelle2[[#This Row],[Urban Sprawl]]-Tabelle2[[#This Row],[Healthy City]])>=Tabelle2[[#This Row],[q-Wert (Indifferenz)]]),((ABS(Tabelle2[[#This Row],[Urban Sprawl]]-Tabelle2[[#This Row],[Healthy City]])-Tabelle2[[#This Row],[q-Wert (Indifferenz)]])/(Tabelle2[[#This Row],[p-Wert (Präferenz)]]-Tabelle2[[#This Row],[q-Wert (Indifferenz)]])))))),IF(Tabelle2[[#This Row],[Urban Sprawl]]-Tabelle2[[#This Row],[Healthy City]]<0,-1*IF(ABS(Tabelle2[[#This Row],[Urban Sprawl]]-Tabelle2[[#This Row],[Healthy City]])<Tabelle2[[#This Row],[q-Wert (Indifferenz)]], 0,IF(ABS(Tabelle2[[#This Row],[Urban Sprawl]]-Tabelle2[[#This Row],[Healthy City]])>Tabelle2[[#This Row],[p-Wert (Präferenz)]],1,IF(AND(ABS(Tabelle2[[#This Row],[Urban Sprawl]]-Tabelle2[[#This Row],[Healthy City]])<=Tabelle2[[#This Row],[p-Wert (Präferenz)]],ABS(Tabelle2[[#This Row],[Urban Sprawl]]-Tabelle2[[#This Row],[Healthy City]])>=Tabelle2[[#This Row],[q-Wert (Indifferenz)]]),((ABS(Tabelle2[[#This Row],[Urban Sprawl]]-Tabelle2[[#This Row],[Healthy City]])-Tabelle2[[#This Row],[q-Wert (Indifferenz)]])/(Tabelle2[[#This Row],[p-Wert (Präferenz)]]-Tabelle2[[#This Row],[q-Wert (Indifferenz)]]))))),IF(ABS(Tabelle2[[#This Row],[Urban Sprawl]]-Tabelle2[[#This Row],[Healthy City]])<Tabelle2[[#This Row],[q-Wert (Indifferenz)]], 0,IF(ABS(Tabelle2[[#This Row],[Urban Sprawl]]-Tabelle2[[#This Row],[Healthy City]])>Tabelle2[[#This Row],[p-Wert (Präferenz)]],1,IF(AND(ABS(Tabelle2[[#This Row],[Urban Sprawl]]-Tabelle2[[#This Row],[Healthy City]])<=Tabelle2[[#This Row],[p-Wert (Präferenz)]],ABS(Tabelle2[[#This Row],[Urban Sprawl]]-Tabelle2[[#This Row],[Healthy City]])>=Tabelle2[[#This Row],[q-Wert (Indifferenz)]]),((ABS(Tabelle2[[#This Row],[Urban Sprawl]]-Tabelle2[[#This Row],[Healthy City]])-Tabelle2[[#This Row],[q-Wert (Indifferenz)]])/(Tabelle2[[#This Row],[p-Wert (Präferenz)]]-Tabelle2[[#This Row],[q-Wert (Indifferenz)]])))))))","v":0},{"$f":"IF(Tabelle2[[#This Row],[min/max]]=\"min\",-1*IF(Tabelle2[[#This Row],[Urban Sprawl]]-Tabelle2[[#This Row],[Business as usual]]<0,-1*IF(ABS(Tabelle2[[#This Row],[Urban Sprawl]]-Tabelle2[[#This Row],[Business as usual]])<Tabelle2[[#This Row],[q-Wert (Indifferenz)]], 0,IF(ABS(Tabelle2[[#This Row],[Urban Sprawl]]-Tabelle2[[#This Row],[Business as usual]])>Tabelle2[[#This Row],[p-Wert (Präferenz)]],1,IF(AND(ABS(Tabelle2[[#This Row],[Urban Sprawl]]-Tabelle2[[#This Row],[Business as usual]])<=Tabelle2[[#This Row],[p-Wert (Präferenz)]],ABS(Tabelle2[[#This Row],[Urban Sprawl]]-Tabelle2[[#This Row],[Business as usual]])>=Tabelle2[[#This Row],[q-Wert (Indifferenz)]]),((ABS(Tabelle2[[#This Row],[Urban Sprawl]]-Tabelle2[[#This Row],[Business as usual]])-Tabelle2[[#This Row],[q-Wert (Indifferenz)]])/(Tabelle2[[#This Row],[p-Wert (Präferenz)]]-Tabelle2[[#This Row],[q-Wert (Indifferenz)]]))))),IF(ABS(Tabelle2[[#This Row],[Urban Sprawl]]-Tabelle2[[#This Row],[Business as usual]])<Tabelle2[[#This Row],[q-Wert (Indifferenz)]], 0,IF(ABS(Tabelle2[[#This Row],[Urban Sprawl]]-Tabelle2[[#This Row],[Business as usual]])>Tabelle2[[#This Row],[p-Wert (Präferenz)]],1,IF(AND(ABS(Tabelle2[[#This Row],[Urban Sprawl]]-Tabelle2[[#This Row],[Business as usual]])<=Tabelle2[[#This Row],[p-Wert (Präferenz)]],ABS(Tabelle2[[#This Row],[Urban Sprawl]]-Tabelle2[[#This Row],[Business as usual]])>=Tabelle2[[#This Row],[q-Wert (Indifferenz)]]),((ABS(Tabelle2[[#This Row],[Urban Sprawl]]-Tabelle2[[#This Row],[Business as usual]])-Tabelle2[[#This Row],[q-Wert (Indifferenz)]])/(Tabelle2[[#This Row],[p-Wert (Präferenz)]]-Tabelle2[[#This Row],[q-Wert (Indifferenz)]])))))),IF(Tabelle2[[#This Row],[Urban Sprawl]]-Tabelle2[[#This Row],[Business as usual]]<0,-1*IF(ABS(Tabelle2[[#This Row],[Urban Sprawl]]-Tabelle2[[#This Row],[Business as usual]])<Tabelle2[[#This Row],[q-Wert (Indifferenz)]], 0,IF(ABS(Tabelle2[[#This Row],[Urban Sprawl]]-Tabelle2[[#This Row],[Business as usual]])>Tabelle2[[#This Row],[p-Wert (Präferenz)]],1,IF(AND(ABS(Tabelle2[[#This Row],[Urban Sprawl]]-Tabelle2[[#This Row],[Business as usual]])<=Tabelle2[[#This Row],[p-Wert (Präferenz)]],ABS(Tabelle2[[#This Row],[Urban Sprawl]]-Tabelle2[[#This Row],[Business as usual]])>=Tabelle2[[#This Row],[q-Wert (Indifferenz)]]),((ABS(Tabelle2[[#This Row],[Urban Sprawl]]-Tabelle2[[#This Row],[Business as usual]])-Tabelle2[[#This Row],[q-Wert (Indifferenz)]])/(Tabelle2[[#This Row],[p-Wert (Präferenz)]]-Tabelle2[[#This Row],[q-Wert (Indifferenz)]]))))),IF(ABS(Tabelle2[[#This Row],[Urban Sprawl]]-Tabelle2[[#This Row],[Business as usual]])<Tabelle2[[#This Row],[q-Wert (Indifferenz)]], 0,IF(ABS(Tabelle2[[#This Row],[Urban Sprawl]]-Tabelle2[[#This Row],[Business as usual]])>Tabelle2[[#This Row],[p-Wert (Präferenz)]],1,IF(AND(ABS(Tabelle2[[#This Row],[Urban Sprawl]]-Tabelle2[[#This Row],[Business as usual]])<=Tabelle2[[#This Row],[p-Wert (Präferenz)]],ABS(Tabelle2[[#This Row],[Urban Sprawl]]-Tabelle2[[#This Row],[Business as usual]])>=Tabelle2[[#This Row],[q-Wert (Indifferenz)]]),((ABS(Tabelle2[[#This Row],[Urban Sprawl]]-Tabelle2[[#This Row],[Business as usual]])-Tabelle2[[#This Row],[q-Wert (Indifferenz)]])/(Tabelle2[[#This Row],[p-Wert (Präferenz)]]-Tabelle2[[#This Row],[q-Wert (Indifferenz)]])))))))","v":0},null,{"$f":"IF(Tabelle2[[#This Row],[min/max]]=\"min\",-1*IF(Tabelle2[[#This Row],[Business as usual]]-Tabelle2[[#This Row],[Smart City]]<0,-1*IF(ABS(Tabelle2[[#This Row],[Business as usual]]-Tabelle2[[#This Row],[Smart City]])<Tabelle2[[#This Row],[q-Wert (Indifferenz)]], 0,IF(ABS(Tabelle2[[#This Row],[Business as usual]]-Tabelle2[[#This Row],[Smart City]])>Tabelle2[[#This Row],[p-Wert (Präferenz)]],1,IF(AND(ABS(Tabelle2[[#This Row],[Business as usual]]-Tabelle2[[#This Row],[Smart City]])<=Tabelle2[[#This Row],[p-Wert (Präferenz)]],ABS(Tabelle2[[#This Row],[Business as usual]]-Tabelle2[[#This Row],[Smart City]])>=Tabelle2[[#This Row],[q-Wert (Indifferenz)]]),((ABS(Tabelle2[[#This Row],[Business as usual]]-Tabelle2[[#This Row],[Smart City]])-Tabelle2[[#This Row],[q-Wert (Indifferenz)]])/(Tabelle2[[#This Row],[p-Wert (Präferenz)]]-Tabelle2[[#This Row],[q-Wert (Indifferenz)]]))))),IF(ABS(Tabelle2[[#This Row],[Business as usual]]-Tabelle2[[#This Row],[Smart City]])<Tabelle2[[#This Row],[q-Wert (Indifferenz)]], 0,IF(ABS(Tabelle2[[#This Row],[Business as usual]]-Tabelle2[[#This Row],[Smart City]])>Tabelle2[[#This Row],[p-Wert (Präferenz)]],1,IF(AND(ABS(Tabelle2[[#This Row],[Business as usual]]-Tabelle2[[#This Row],[Smart City]])<=Tabelle2[[#This Row],[p-Wert (Präferenz)]],ABS(Tabelle2[[#This Row],[Business as usual]]-Tabelle2[[#This Row],[Smart City]])>=Tabelle2[[#This Row],[q-Wert (Indifferenz)]]),((ABS(Tabelle2[[#This Row],[Business as usual]]-Tabelle2[[#This Row],[Smart City]])-Tabelle2[[#This Row],[q-Wert (Indifferenz)]])/(Tabelle2[[#This Row],[p-Wert (Präferenz)]]-Tabelle2[[#This Row],[q-Wert (Indifferenz)]])))))),IF(Tabelle2[[#This Row],[Business as usual]]-Tabelle2[[#This Row],[Smart City]]<0,-1*IF(ABS(Tabelle2[[#This Row],[Business as usual]]-Tabelle2[[#This Row],[Smart City]])<Tabelle2[[#This Row],[q-Wert (Indifferenz)]], 0,IF(ABS(Tabelle2[[#This Row],[Business as usual]]-Tabelle2[[#This Row],[Smart City]])>Tabelle2[[#This Row],[p-Wert (Präferenz)]],1,IF(AND(ABS(Tabelle2[[#This Row],[Business as usual]]-Tabelle2[[#This Row],[Smart City]])<=Tabelle2[[#This Row],[p-Wert (Präferenz)]],ABS(Tabelle2[[#This Row],[Business as usual]]-Tabelle2[[#This Row],[Smart City]])>=Tabelle2[[#This Row],[q-Wert (Indifferenz)]]),((ABS(Tabelle2[[#This Row],[Business as usual]]-Tabelle2[[#This Row],[Smart City]])-Tabelle2[[#This Row],[q-Wert (Indifferenz)]])/(Tabelle2[[#This Row],[p-Wert (Präferenz)]]-Tabelle2[[#This Row],[q-Wert (Indifferenz)]]))))),IF(ABS(Tabelle2[[#This Row],[Business as usual]]-Tabelle2[[#This Row],[Smart City]])<Tabelle2[[#This Row],[q-Wert (Indifferenz)]], 0,IF(ABS(Tabelle2[[#This Row],[Business as usual]]-Tabelle2[[#This Row],[Smart City]])>Tabelle2[[#This Row],[p-Wert (Präferenz)]],1,IF(AND(ABS(Tabelle2[[#This Row],[Business as usual]]-Tabelle2[[#This Row],[Smart City]])<=Tabelle2[[#This Row],[p-Wert (Präferenz)]],ABS(Tabelle2[[#This Row],[Business as usual]]-Tabelle2[[#This Row],[Smart City]])>=Tabelle2[[#This Row],[q-Wert (Indifferenz)]]),((ABS(Tabelle2[[#This Row],[Business as usual]]-Tabelle2[[#This Row],[Smart City]])-Tabelle2[[#This Row],[q-Wert (Indifferenz)]])/(Tabelle2[[#This Row],[p-Wert (Präferenz)]]-Tabelle2[[#This Row],[q-Wert (Indifferenz)]])))))))","v":-1},{"$f":"IF(Tabelle2[[#This Row],[min/max]]=\"min\",-1*IF(Tabelle2[[#This Row],[Business as usual]]-Tabelle2[[#This Row],[Healthy City]]<0,-1*IF(ABS(Tabelle2[[#This Row],[Business as usual]]-Tabelle2[[#This Row],[Healthy City]])<Tabelle2[[#This Row],[q-Wert (Indifferenz)]], 0,IF(ABS(Tabelle2[[#This Row],[Business as usual]]-Tabelle2[[#This Row],[Healthy City]])>Tabelle2[[#This Row],[p-Wert (Präferenz)]],1,IF(AND(ABS(Tabelle2[[#This Row],[Business as usual]]-Tabelle2[[#This Row],[Healthy City]])<=Tabelle2[[#This Row],[p-Wert (Präferenz)]],ABS(Tabelle2[[#This Row],[Business as usual]]-Tabelle2[[#This Row],[Healthy City]])>=Tabelle2[[#This Row],[q-Wert (Indifferenz)]]),((ABS(Tabelle2[[#This Row],[Business as usual]]-Tabelle2[[#This Row],[Healthy City]])-Tabelle2[[#This Row],[q-Wert (Indifferenz)]])/(Tabelle2[[#This Row],[p-Wert (Präferenz)]]-Tabelle2[[#This Row],[q-Wert (Indifferenz)]]))))),IF(ABS(Tabelle2[[#This Row],[Business as usual]]-Tabelle2[[#This Row],[Healthy City]])<Tabelle2[[#This Row],[q-Wert (Indifferenz)]], 0,IF(ABS(Tabelle2[[#This Row],[Business as usual]]-Tabelle2[[#This Row],[Healthy City]])>Tabelle2[[#This Row],[p-Wert (Präferenz)]],1,IF(AND(ABS(Tabelle2[[#This Row],[Business as usual]]-Tabelle2[[#This Row],[Healthy City]])<=Tabelle2[[#This Row],[p-Wert (Präferenz)]],ABS(Tabelle2[[#This Row],[Business as usual]]-Tabelle2[[#This Row],[Healthy City]])>=Tabelle2[[#This Row],[q-Wert (Indifferenz)]]),((ABS(Tabelle2[[#This Row],[Business as usual]]-Tabelle2[[#This Row],[Healthy City]])-Tabelle2[[#This Row],[q-Wert (Indifferenz)]])/(Tabelle2[[#This Row],[p-Wert (Präferenz)]]-Tabelle2[[#This Row],[q-Wert (Indifferenz)]])))))),IF(Tabelle2[[#This Row],[Business as usual]]-Tabelle2[[#This Row],[Healthy City]]<0,-1*IF(ABS(Tabelle2[[#This Row],[Business as usual]]-Tabelle2[[#This Row],[Healthy City]])<Tabelle2[[#This Row],[q-Wert (Indifferenz)]], 0,IF(ABS(Tabelle2[[#This Row],[Business as usual]]-Tabelle2[[#This Row],[Healthy City]])>Tabelle2[[#This Row],[p-Wert (Präferenz)]],1,IF(AND(ABS(Tabelle2[[#This Row],[Business as usual]]-Tabelle2[[#This Row],[Healthy City]])<=Tabelle2[[#This Row],[p-Wert (Präferenz)]],ABS(Tabelle2[[#This Row],[Business as usual]]-Tabelle2[[#This Row],[Healthy City]])>=Tabelle2[[#This Row],[q-Wert (Indifferenz)]]),((ABS(Tabelle2[[#This Row],[Business as usual]]-Tabelle2[[#This Row],[Healthy City]])-Tabelle2[[#This Row],[q-Wert (Indifferenz)]])/(Tabelle2[[#This Row],[p-Wert (Präferenz)]]-Tabelle2[[#This Row],[q-Wert (Indifferenz)]]))))),IF(ABS(Tabelle2[[#This Row],[Business as usual]]-Tabelle2[[#This Row],[Healthy City]])<Tabelle2[[#This Row],[q-Wert (Indifferenz)]], 0,IF(ABS(Tabelle2[[#This Row],[Business as usual]]-Tabelle2[[#This Row],[Healthy City]])>Tabelle2[[#This Row],[p-Wert (Präferenz)]],1,IF(AND(ABS(Tabelle2[[#This Row],[Business as usual]]-Tabelle2[[#This Row],[Healthy City]])<=Tabelle2[[#This Row],[p-Wert (Präferenz)]],ABS(Tabelle2[[#This Row],[Business as usual]]-Tabelle2[[#This Row],[Healthy City]])>=Tabelle2[[#This Row],[q-Wert (Indifferenz)]]),((ABS(Tabelle2[[#This Row],[Business as usual]]-Tabelle2[[#This Row],[Healthy City]])-Tabelle2[[#This Row],[q-Wert (Indifferenz)]])/(Tabelle2[[#This Row],[p-Wert (Präferenz)]]-Tabelle2[[#This Row],[q-Wert (Indifferenz)]])))))))","v":0},{"$f":"IF(Tabelle2[[#This Row],[min/max]]=\"min\",-1*IF(Tabelle2[[#This Row],[Business as usual]]-Tabelle2[[#This Row],[Urban Sprawl]]<0,-1*IF(ABS(Tabelle2[[#This Row],[Business as usual]]-Tabelle2[[#This Row],[Urban Sprawl]])<Tabelle2[[#This Row],[q-Wert (Indifferenz)]], 0,IF(ABS(Tabelle2[[#This Row],[Business as usual]]-Tabelle2[[#This Row],[Urban Sprawl]])>Tabelle2[[#This Row],[p-Wert (Präferenz)]],1,IF(AND(ABS(Tabelle2[[#This Row],[Business as usual]]-Tabelle2[[#This Row],[Urban Sprawl]])<=Tabelle2[[#This Row],[p-Wert (Präferenz)]],ABS(Tabelle2[[#This Row],[Business as usual]]-Tabelle2[[#This Row],[Urban Sprawl]])>=Tabelle2[[#This Row],[q-Wert (Indifferenz)]]),((ABS(Tabelle2[[#This Row],[Business as usual]]-Tabelle2[[#This Row],[Urban Sprawl]])-Tabelle2[[#This Row],[q-Wert (Indifferenz)]])/(Tabelle2[[#This Row],[p-Wert (Präferenz)]]-Tabelle2[[#This Row],[q-Wert (Indifferenz)]]))))),IF(ABS(Tabelle2[[#This Row],[Business as usual]]-Tabelle2[[#This Row],[Urban Sprawl]])<Tabelle2[[#This Row],[q-Wert (Indifferenz)]], 0,IF(ABS(Tabelle2[[#This Row],[Business as usual]]-Tabelle2[[#This Row],[Urban Sprawl]])>Tabelle2[[#This Row],[p-Wert (Präferenz)]],1,IF(AND(ABS(Tabelle2[[#This Row],[Business as usual]]-Tabelle2[[#This Row],[Urban Sprawl]])<=Tabelle2[[#This Row],[p-Wert (Präferenz)]],ABS(Tabelle2[[#This Row],[Business as usual]]-Tabelle2[[#This Row],[Urban Sprawl]])>=Tabelle2[[#This Row],[q-Wert (Indifferenz)]]),((ABS(Tabelle2[[#This Row],[Business as usual]]-Tabelle2[[#This Row],[Urban Sprawl]])-Tabelle2[[#This Row],[q-Wert (Indifferenz)]])/(Tabelle2[[#This Row],[p-Wert (Präferenz)]]-Tabelle2[[#This Row],[q-Wert (Indifferenz)]])))))),IF(Tabelle2[[#This Row],[Business as usual]]-Tabelle2[[#This Row],[Urban Sprawl]]<0,-1*IF(ABS(Tabelle2[[#This Row],[Business as usual]]-Tabelle2[[#This Row],[Urban Sprawl]])<Tabelle2[[#This Row],[q-Wert (Indifferenz)]], 0,IF(ABS(Tabelle2[[#This Row],[Business as usual]]-Tabelle2[[#This Row],[Urban Sprawl]])>Tabelle2[[#This Row],[p-Wert (Präferenz)]],1,IF(AND(ABS(Tabelle2[[#This Row],[Business as usual]]-Tabelle2[[#This Row],[Urban Sprawl]])<=Tabelle2[[#This Row],[p-Wert (Präferenz)]],ABS(Tabelle2[[#This Row],[Business as usual]]-Tabelle2[[#This Row],[Urban Sprawl]])>=Tabelle2[[#This Row],[q-Wert (Indifferenz)]]),((ABS(Tabelle2[[#This Row],[Business as usual]]-Tabelle2[[#This Row],[Urban Sprawl]])-Tabelle2[[#This Row],[q-Wert (Indifferenz)]])/(Tabelle2[[#This Row],[p-Wert (Präferenz)]]-Tabelle2[[#This Row],[q-Wert (Indifferenz)]]))))),IF(ABS(Tabelle2[[#This Row],[Business as usual]]-Tabelle2[[#This Row],[Urban Sprawl]])<Tabelle2[[#This Row],[q-Wert (Indifferenz)]], 0,IF(ABS(Tabelle2[[#This Row],[Business as usual]]-Tabelle2[[#This Row],[Urban Sprawl]])>Tabelle2[[#This Row],[p-Wert (Präferenz)]],1,IF(AND(ABS(Tabelle2[[#This Row],[Business as usual]]-Tabelle2[[#This Row],[Urban Sprawl]])<=Tabelle2[[#This Row],[p-Wert (Präferenz)]],ABS(Tabelle2[[#This Row],[Business as usual]]-Tabelle2[[#This Row],[Urban Sprawl]])>=Tabelle2[[#This Row],[q-Wert (Indifferenz)]]),((ABS(Tabelle2[[#This Row],[Business as usual]]-Tabelle2[[#This Row],[Urban Sprawl]])-Tabelle2[[#This Row],[q-Wert (Indifferenz)]])/(Tabelle2[[#This Row],[p-Wert (Präferenz)]]-Tabelle2[[#This Row],[q-Wert (Indifferenz)]])))))))","v":0}]
[null,null,null,"Mietpreis-Index",{"$f":"('\"Walking Weights\"'!D15)/100","v":5.5555555555555552E-2},"max","Index",4.5190000000000001,4.6859999999999999,4.1020000000000003,4,"Typ 5",0.17199999999999999,0.56100000000000005,{"$f":"IF(Tabelle2[[#This Row],[min/max]]=\"min\",-1*IF(Tabelle2[[#This Row],[Smart City]]-Tabelle2[[#This Row],[Healthy City]]<0,-1*IF(ABS(Tabelle2[[#This Row],[Smart City]]-Tabelle2[[#This Row],[Healthy City]])<Tabelle2[[#This Row],[q-Wert (Indifferenz)]], 0,IF(ABS(Tabelle2[[#This Row],[Smart City]]-Tabelle2[[#This Row],[Healthy City]])>Tabelle2[[#This Row],[p-Wert (Präferenz)]],1,IF(AND(ABS(Tabelle2[[#This Row],[Smart City]]-Tabelle2[[#This Row],[Healthy City]])<=Tabelle2[[#This Row],[p-Wert (Präferenz)]],ABS(Tabelle2[[#This Row],[Smart City]]-Tabelle2[[#This Row],[Healthy City]])>=Tabelle2[[#This Row],[q-Wert (Indifferenz)]]),((ABS(Tabelle2[[#This Row],[Smart City]]-Tabelle2[[#This Row],[Healthy City]])-Tabelle2[[#This Row],[q-Wert (Indifferenz)]])/(Tabelle2[[#This Row],[p-Wert (Präferenz)]]-Tabelle2[[#This Row],[q-Wert (Indifferenz)]]))))),IF(ABS(Tabelle2[[#This Row],[Smart City]]-Tabelle2[[#This Row],[Healthy City]])<Tabelle2[[#This Row],[q-Wert (Indifferenz)]], 0,IF(ABS(Tabelle2[[#This Row],[Smart City]]-Tabelle2[[#This Row],[Healthy City]])>Tabelle2[[#This Row],[p-Wert (Präferenz)]],1,IF(AND(ABS(Tabelle2[[#This Row],[Smart City]]-Tabelle2[[#This Row],[Healthy City]])<=Tabelle2[[#This Row],[p-Wert (Präferenz)]],ABS(Tabelle2[[#This Row],[Smart City]]-Tabelle2[[#This Row],[Healthy City]])>=Tabelle2[[#This Row],[q-Wert (Indifferenz)]]),((ABS(Tabelle2[[#This Row],[Smart City]]-Tabelle2[[#This Row],[Healthy City]])-Tabelle2[[#This Row],[q-Wert (Indifferenz)]])/(Tabelle2[[#This Row],[p-Wert (Präferenz)]]-Tabelle2[[#This Row],[q-Wert (Indifferenz)]])))))),IF(Tabelle2[[#This Row],[Smart City]]-Tabelle2[[#This Row],[Healthy City]]<0,-1*IF(ABS(Tabelle2[[#This Row],[Smart City]]-Tabelle2[[#This Row],[Healthy City]])<Tabelle2[[#This Row],[q-Wert (Indifferenz)]], 0,IF(ABS(Tabelle2[[#This Row],[Smart City]]-Tabelle2[[#This Row],[Healthy City]])>Tabelle2[[#This Row],[p-Wert (Präferenz)]],1,IF(AND(ABS(Tabelle2[[#This Row],[Smart City]]-Tabelle2[[#This Row],[Healthy City]])<=Tabelle2[[#This Row],[p-Wert (Präferenz)]],ABS(Tabelle2[[#This Row],[Smart City]]-Tabelle2[[#This Row],[Healthy City]])>=Tabelle2[[#This Row],[q-Wert (Indifferenz)]]),((ABS(Tabelle2[[#This Row],[Smart City]]-Tabelle2[[#This Row],[Healthy City]])-Tabelle2[[#This Row],[q-Wert (Indifferenz)]])/(Tabelle2[[#This Row],[p-Wert (Präferenz)]]-Tabelle2[[#This Row],[q-Wert (Indifferenz)]]))))),IF(ABS(Tabelle2[[#This Row],[Smart City]]-Tabelle2[[#This Row],[Healthy City]])<Tabelle2[[#This Row],[q-Wert (Indifferenz)]], 0,IF(ABS(Tabelle2[[#This Row],[Smart City]]-Tabelle2[[#This Row],[Healthy City]])>Tabelle2[[#This Row],[p-Wert (Präferenz)]],1,IF(AND(ABS(Tabelle2[[#This Row],[Smart City]]-Tabelle2[[#This Row],[Healthy City]])<=Tabelle2[[#This Row],[p-Wert (Präferenz)]],ABS(Tabelle2[[#This Row],[Smart City]]-Tabelle2[[#This Row],[Healthy City]])>=Tabelle2[[#This Row],[q-Wert (Indifferenz)]]),((ABS(Tabelle2[[#This Row],[Smart City]]-Tabelle2[[#This Row],[Healthy City]])-Tabelle2[[#This Row],[q-Wert (Indifferenz)]])/(Tabelle2[[#This Row],[p-Wert (Präferenz)]]-Tabelle2[[#This Row],[q-Wert (Indifferenz)]])))))))","v":0},{"$f":"IF(Tabelle2[[#This Row],[min/max]]=\"min\",-1*IF(Tabelle2[[#This Row],[Smart City]]-Tabelle2[[#This Row],[Urban Sprawl]]<0,-1*IF(ABS(Tabelle2[[#This Row],[Smart City]]-Tabelle2[[#This Row],[Urban Sprawl]])<Tabelle2[[#This Row],[q-Wert (Indifferenz)]], 0,IF(ABS(Tabelle2[[#This Row],[Smart City]]-Tabelle2[[#This Row],[Urban Sprawl]])>Tabelle2[[#This Row],[p-Wert (Präferenz)]],1,IF(AND(ABS(Tabelle2[[#This Row],[Smart City]]-Tabelle2[[#This Row],[Urban Sprawl]])<=Tabelle2[[#This Row],[p-Wert (Präferenz)]],ABS(Tabelle2[[#This Row],[Smart City]]-Tabelle2[[#This Row],[Urban Sprawl]])>=Tabelle2[[#This Row],[q-Wert (Indifferenz)]]),((ABS(Tabelle2[[#This Row],[Smart City]]-Tabelle2[[#This Row],[Urban Sprawl]])-Tabelle2[[#This Row],[q-Wert (Indifferenz)]])/(Tabelle2[[#This Row],[p-Wert (Präferenz)]]-Tabelle2[[#This Row],[q-Wert (Indifferenz)]]))))),IF(ABS(Tabelle2[[#This Row],[Smart City]]-Tabelle2[[#This Row],[Urban Sprawl]])<Tabelle2[[#This Row],[q-Wert (Indifferenz)]], 0,IF(ABS(Tabelle2[[#This Row],[Smart City]]-Tabelle2[[#This Row],[Urban Sprawl]])>Tabelle2[[#This Row],[p-Wert (Präferenz)]],1,IF(AND(ABS(Tabelle2[[#This Row],[Smart City]]-Tabelle2[[#This Row],[Urban Sprawl]])<=Tabelle2[[#This Row],[p-Wert (Präferenz)]],ABS(Tabelle2[[#This Row],[Smart City]]-Tabelle2[[#This Row],[Urban Sprawl]])>=Tabelle2[[#This Row],[q-Wert (Indifferenz)]]),((ABS(Tabelle2[[#This Row],[Smart City]]-Tabelle2[[#This Row],[Urban Sprawl]])-Tabelle2[[#This Row],[q-Wert (Indifferenz)]])/(Tabelle2[[#This Row],[p-Wert (Präferenz)]]-Tabelle2[[#This Row],[q-Wert (Indifferenz)]])))))),IF(Tabelle2[[#This Row],[Smart City]]-Tabelle2[[#This Row],[Urban Sprawl]]<0,-1*IF(ABS(Tabelle2[[#This Row],[Smart City]]-Tabelle2[[#This Row],[Urban Sprawl]])<Tabelle2[[#This Row],[q-Wert (Indifferenz)]], 0,IF(ABS(Tabelle2[[#This Row],[Smart City]]-Tabelle2[[#This Row],[Urban Sprawl]])>Tabelle2[[#This Row],[p-Wert (Präferenz)]],1,IF(AND(ABS(Tabelle2[[#This Row],[Smart City]]-Tabelle2[[#This Row],[Urban Sprawl]])<=Tabelle2[[#This Row],[p-Wert (Präferenz)]],ABS(Tabelle2[[#This Row],[Smart City]]-Tabelle2[[#This Row],[Urban Sprawl]])>=Tabelle2[[#This Row],[q-Wert (Indifferenz)]]),((ABS(Tabelle2[[#This Row],[Smart City]]-Tabelle2[[#This Row],[Urban Sprawl]])-Tabelle2[[#This Row],[q-Wert (Indifferenz)]])/(Tabelle2[[#This Row],[p-Wert (Präferenz)]]-Tabelle2[[#This Row],[q-Wert (Indifferenz)]]))))),IF(ABS(Tabelle2[[#This Row],[Smart City]]-Tabelle2[[#This Row],[Urban Sprawl]])<Tabelle2[[#This Row],[q-Wert (Indifferenz)]], 0,IF(ABS(Tabelle2[[#This Row],[Smart City]]-Tabelle2[[#This Row],[Urban Sprawl]])>Tabelle2[[#This Row],[p-Wert (Präferenz)]],1,IF(AND(ABS(Tabelle2[[#This Row],[Smart City]]-Tabelle2[[#This Row],[Urban Sprawl]])<=Tabelle2[[#This Row],[p-Wert (Präferenz)]],ABS(Tabelle2[[#This Row],[Smart City]]-Tabelle2[[#This Row],[Urban Sprawl]])>=Tabelle2[[#This Row],[q-Wert (Indifferenz)]]),((ABS(Tabelle2[[#This Row],[Smart City]]-Tabelle2[[#This Row],[Urban Sprawl]])-Tabelle2[[#This Row],[q-Wert (Indifferenz)]])/(Tabelle2[[#This Row],[p-Wert (Präferenz)]]-Tabelle2[[#This Row],[q-Wert (Indifferenz)]])))))))","v":0.6298200514138812},{"$f":"IF(Tabelle2[[#This Row],[min/max]]=\"min\",-1*IF(Tabelle2[[#This Row],[Smart City]]-Tabelle2[[#This Row],[Business as usual]]<0,-1*IF(ABS(Tabelle2[[#This Row],[Smart City]]-Tabelle2[[#This Row],[Business as usual]])<Tabelle2[[#This Row],[q-Wert (Indifferenz)]], 0,IF(ABS(Tabelle2[[#This Row],[Smart City]]-Tabelle2[[#This Row],[Business as usual]])>Tabelle2[[#This Row],[p-Wert (Präferenz)]],1,IF(AND(ABS(Tabelle2[[#This Row],[Smart City]]-Tabelle2[[#This Row],[Business as usual]])<=Tabelle2[[#This Row],[p-Wert (Präferenz)]],ABS(Tabelle2[[#This Row],[Smart City]]-Tabelle2[[#This Row],[Business as usual]])>=Tabelle2[[#This Row],[q-Wert (Indifferenz)]]),((ABS(Tabelle2[[#This Row],[Smart City]]-Tabelle2[[#This Row],[Business as usual]])-Tabelle2[[#This Row],[q-Wert (Indifferenz)]])/(Tabelle2[[#This Row],[p-Wert (Präferenz)]]-Tabelle2[[#This Row],[q-Wert (Indifferenz)]]))))),IF(ABS(Tabelle2[[#This Row],[Smart City]]-Tabelle2[[#This Row],[Business as usual]])<Tabelle2[[#This Row],[q-Wert (Indifferenz)]], 0,IF(ABS(Tabelle2[[#This Row],[Smart City]]-Tabelle2[[#This Row],[Business as usual]])>Tabelle2[[#This Row],[p-Wert (Präferenz)]],1,IF(AND(ABS(Tabelle2[[#This Row],[Smart City]]-Tabelle2[[#This Row],[Business as usual]])<=Tabelle2[[#This Row],[p-Wert (Präferenz)]],ABS(Tabelle2[[#This Row],[Smart City]]-Tabelle2[[#This Row],[Business as usual]])>=Tabelle2[[#This Row],[q-Wert (Indifferenz)]]),((ABS(Tabelle2[[#This Row],[Smart City]]-Tabelle2[[#This Row],[Business as usual]])-Tabelle2[[#This Row],[q-Wert (Indifferenz)]])/(Tabelle2[[#This Row],[p-Wert (Präferenz)]]-Tabelle2[[#This Row],[q-Wert (Indifferenz)]])))))),IF(Tabelle2[[#This Row],[Smart City]]-Tabelle2[[#This Row],[Business as usual]]<0,-1*IF(ABS(Tabelle2[[#This Row],[Smart City]]-Tabelle2[[#This Row],[Business as usual]])<Tabelle2[[#This Row],[q-Wert (Indifferenz)]], 0,IF(ABS(Tabelle2[[#This Row],[Smart City]]-Tabelle2[[#This Row],[Business as usual]])>Tabelle2[[#This Row],[p-Wert (Präferenz)]],1,IF(AND(ABS(Tabelle2[[#This Row],[Smart City]]-Tabelle2[[#This Row],[Business as usual]])<=Tabelle2[[#This Row],[p-Wert (Präferenz)]],ABS(Tabelle2[[#This Row],[Smart City]]-Tabelle2[[#This Row],[Business as usual]])>=Tabelle2[[#This Row],[q-Wert (Indifferenz)]]),((ABS(Tabelle2[[#This Row],[Smart City]]-Tabelle2[[#This Row],[Business as usual]])-Tabelle2[[#This Row],[q-Wert (Indifferenz)]])/(Tabelle2[[#This Row],[p-Wert (Präferenz)]]-Tabelle2[[#This Row],[q-Wert (Indifferenz)]]))))),IF(ABS(Tabelle2[[#This Row],[Smart City]]-Tabelle2[[#This Row],[Business as usual]])<Tabelle2[[#This Row],[q-Wert (Indifferenz)]], 0,IF(ABS(Tabelle2[[#This Row],[Smart City]]-Tabelle2[[#This Row],[Business as usual]])>Tabelle2[[#This Row],[p-Wert (Präferenz)]],1,IF(AND(ABS(Tabelle2[[#This Row],[Smart City]]-Tabelle2[[#This Row],[Business as usual]])<=Tabelle2[[#This Row],[p-Wert (Präferenz)]],ABS(Tabelle2[[#This Row],[Smart City]]-Tabelle2[[#This Row],[Business as usual]])>=Tabelle2[[#This Row],[q-Wert (Indifferenz)]]),((ABS(Tabelle2[[#This Row],[Smart City]]-Tabelle2[[#This Row],[Business as usual]])-Tabelle2[[#This Row],[q-Wert (Indifferenz)]])/(Tabelle2[[#This Row],[p-Wert (Präferenz)]]-Tabelle2[[#This Row],[q-Wert (Indifferenz)]])))))))","v":0.892030848329049},null,{"$f":"IF(Tabelle2[[#This Row],[min/max]]=\"min\",-1*IF(Tabelle2[[#This Row],[Healthy City]]-Tabelle2[[#This Row],[Smart City]]<0,-1*IF(ABS(Tabelle2[[#This Row],[Healthy City]]-Tabelle2[[#This Row],[Smart City]])<Tabelle2[[#This Row],[q-Wert (Indifferenz)]], 0,IF(ABS(Tabelle2[[#This Row],[Healthy City]]-Tabelle2[[#This Row],[Smart City]])>Tabelle2[[#This Row],[p-Wert (Präferenz)]],1,IF(AND(ABS(Tabelle2[[#This Row],[Healthy City]]-Tabelle2[[#This Row],[Smart City]])<=Tabelle2[[#This Row],[p-Wert (Präferenz)]],ABS(Tabelle2[[#This Row],[Healthy City]]-Tabelle2[[#This Row],[Smart City]])>=Tabelle2[[#This Row],[q-Wert (Indifferenz)]]),((ABS(Tabelle2[[#This Row],[Healthy City]]-Tabelle2[[#This Row],[Smart City]])-Tabelle2[[#This Row],[q-Wert (Indifferenz)]])/(Tabelle2[[#This Row],[p-Wert (Präferenz)]]-Tabelle2[[#This Row],[q-Wert (Indifferenz)]]))))),IF(ABS(Tabelle2[[#This Row],[Healthy City]]-Tabelle2[[#This Row],[Smart City]])<Tabelle2[[#This Row],[q-Wert (Indifferenz)]], 0,IF(ABS(Tabelle2[[#This Row],[Healthy City]]-Tabelle2[[#This Row],[Smart City]])>Tabelle2[[#This Row],[p-Wert (Präferenz)]],1,IF(AND(ABS(Tabelle2[[#This Row],[Healthy City]]-Tabelle2[[#This Row],[Smart City]])<=Tabelle2[[#This Row],[p-Wert (Präferenz)]],ABS(Tabelle2[[#This Row],[Healthy City]]-Tabelle2[[#This Row],[Smart City]])>=Tabelle2[[#This Row],[q-Wert (Indifferenz)]]),((ABS(Tabelle2[[#This Row],[Healthy City]]-Tabelle2[[#This Row],[Smart City]])-Tabelle2[[#This Row],[q-Wert (Indifferenz)]])/(Tabelle2[[#This Row],[p-Wert (Präferenz)]]-Tabelle2[[#This Row],[q-Wert (Indifferenz)]])))))),IF(Tabelle2[[#This Row],[Healthy City]]-Tabelle2[[#This Row],[Smart City]]<0,-1*IF(ABS(Tabelle2[[#This Row],[Healthy City]]-Tabelle2[[#This Row],[Smart City]])<Tabelle2[[#This Row],[q-Wert (Indifferenz)]], 0,IF(ABS(Tabelle2[[#This Row],[Healthy City]]-Tabelle2[[#This Row],[Smart City]])>Tabelle2[[#This Row],[p-Wert (Präferenz)]],1,IF(AND(ABS(Tabelle2[[#This Row],[Healthy City]]-Tabelle2[[#This Row],[Smart City]])<=Tabelle2[[#This Row],[p-Wert (Präferenz)]],ABS(Tabelle2[[#This Row],[Healthy City]]-Tabelle2[[#This Row],[Smart City]])>=Tabelle2[[#This Row],[q-Wert (Indifferenz)]]),((ABS(Tabelle2[[#This Row],[Healthy City]]-Tabelle2[[#This Row],[Smart City]])-Tabelle2[[#This Row],[q-Wert (Indifferenz)]])/(Tabelle2[[#This Row],[p-Wert (Präferenz)]]-Tabelle2[[#This Row],[q-Wert (Indifferenz)]]))))),IF(ABS(Tabelle2[[#This Row],[Healthy City]]-Tabelle2[[#This Row],[Smart City]])<Tabelle2[[#This Row],[q-Wert (Indifferenz)]], 0,IF(ABS(Tabelle2[[#This Row],[Healthy City]]-Tabelle2[[#This Row],[Smart City]])>Tabelle2[[#This Row],[p-Wert (Präferenz)]],1,IF(AND(ABS(Tabelle2[[#This Row],[Healthy City]]-Tabelle2[[#This Row],[Smart City]])<=Tabelle2[[#This Row],[p-Wert (Präferenz)]],ABS(Tabelle2[[#This Row],[Healthy City]]-Tabelle2[[#This Row],[Smart City]])>=Tabelle2[[#This Row],[q-Wert (Indifferenz)]]),((ABS(Tabelle2[[#This Row],[Healthy City]]-Tabelle2[[#This Row],[Smart City]])-Tabelle2[[#This Row],[q-Wert (Indifferenz)]])/(Tabelle2[[#This Row],[p-Wert (Präferenz)]]-Tabelle2[[#This Row],[q-Wert (Indifferenz)]])))))))","v":0},{"$f":"IF(Tabelle2[[#This Row],[min/max]]=\"min\",-1*IF(Tabelle2[[#This Row],[Healthy City]]-Tabelle2[[#This Row],[Urban Sprawl]]<0,-1*IF(ABS(Tabelle2[[#This Row],[Healthy City]]-Tabelle2[[#This Row],[Urban Sprawl]])<Tabelle2[[#This Row],[q-Wert (Indifferenz)]], 0,IF(ABS(Tabelle2[[#This Row],[Healthy City]]-Tabelle2[[#This Row],[Urban Sprawl]])>Tabelle2[[#This Row],[p-Wert (Präferenz)]],1,IF(AND(ABS(Tabelle2[[#This Row],[Healthy City]]-Tabelle2[[#This Row],[Urban Sprawl]])<=Tabelle2[[#This Row],[p-Wert (Präferenz)]],ABS(Tabelle2[[#This Row],[Healthy City]]-Tabelle2[[#This Row],[Urban Sprawl]])>=Tabelle2[[#This Row],[q-Wert (Indifferenz)]]),((ABS(Tabelle2[[#This Row],[Healthy City]]-Tabelle2[[#This Row],[Urban Sprawl]])-Tabelle2[[#This Row],[q-Wert (Indifferenz)]])/(Tabelle2[[#This Row],[p-Wert (Präferenz)]]-Tabelle2[[#This Row],[q-Wert (Indifferenz)]]))))),IF(ABS(Tabelle2[[#This Row],[Healthy City]]-Tabelle2[[#This Row],[Urban Sprawl]])<Tabelle2[[#This Row],[q-Wert (Indifferenz)]], 0,IF(ABS(Tabelle2[[#This Row],[Healthy City]]-Tabelle2[[#This Row],[Urban Sprawl]])>Tabelle2[[#This Row],[p-Wert (Präferenz)]],1,IF(AND(ABS(Tabelle2[[#This Row],[Healthy City]]-Tabelle2[[#This Row],[Urban Sprawl]])<=Tabelle2[[#This Row],[p-Wert (Präferenz)]],ABS(Tabelle2[[#This Row],[Healthy City]]-Tabelle2[[#This Row],[Urban Sprawl]])>=Tabelle2[[#This Row],[q-Wert (Indifferenz)]]),((ABS(Tabelle2[[#This Row],[Healthy City]]-Tabelle2[[#This Row],[Urban Sprawl]])-Tabelle2[[#This Row],[q-Wert (Indifferenz)]])/(Tabelle2[[#This Row],[p-Wert (Präferenz)]]-Tabelle2[[#This Row],[q-Wert (Indifferenz)]])))))),IF(Tabelle2[[#This Row],[Healthy City]]-Tabelle2[[#This Row],[Urban Sprawl]]<0,-1*IF(ABS(Tabelle2[[#This Row],[Healthy City]]-Tabelle2[[#This Row],[Urban Sprawl]])<Tabelle2[[#This Row],[q-Wert (Indifferenz)]], 0,IF(ABS(Tabelle2[[#This Row],[Healthy City]]-Tabelle2[[#This Row],[Urban Sprawl]])>Tabelle2[[#This Row],[p-Wert (Präferenz)]],1,IF(AND(ABS(Tabelle2[[#This Row],[Healthy City]]-Tabelle2[[#This Row],[Urban Sprawl]])<=Tabelle2[[#This Row],[p-Wert (Präferenz)]],ABS(Tabelle2[[#This Row],[Healthy City]]-Tabelle2[[#This Row],[Urban Sprawl]])>=Tabelle2[[#This Row],[q-Wert (Indifferenz)]]),((ABS(Tabelle2[[#This Row],[Healthy City]]-Tabelle2[[#This Row],[Urban Sprawl]])-Tabelle2[[#This Row],[q-Wert (Indifferenz)]])/(Tabelle2[[#This Row],[p-Wert (Präferenz)]]-Tabelle2[[#This Row],[q-Wert (Indifferenz)]]))))),IF(ABS(Tabelle2[[#This Row],[Healthy City]]-Tabelle2[[#This Row],[Urban Sprawl]])<Tabelle2[[#This Row],[q-Wert (Indifferenz)]], 0,IF(ABS(Tabelle2[[#This Row],[Healthy City]]-Tabelle2[[#This Row],[Urban Sprawl]])>Tabelle2[[#This Row],[p-Wert (Präferenz)]],1,IF(AND(ABS(Tabelle2[[#This Row],[Healthy City]]-Tabelle2[[#This Row],[Urban Sprawl]])<=Tabelle2[[#This Row],[p-Wert (Präferenz)]],ABS(Tabelle2[[#This Row],[Healthy City]]-Tabelle2[[#This Row],[Urban Sprawl]])>=Tabelle2[[#This Row],[q-Wert (Indifferenz)]]),((ABS(Tabelle2[[#This Row],[Healthy City]]-Tabelle2[[#This Row],[Urban Sprawl]])-Tabelle2[[#This Row],[q-Wert (Indifferenz)]])/(Tabelle2[[#This Row],[p-Wert (Präferenz)]]-Tabelle2[[#This Row],[q-Wert (Indifferenz)]])))))))","v":1},{"$f":"IF(Tabelle2[[#This Row],[min/max]]=\"min\",-1*IF(Tabelle2[[#This Row],[Healthy City]]-Tabelle2[[#This Row],[Business as usual]]<0,-1*IF(ABS(Tabelle2[[#This Row],[Healthy City]]-Tabelle2[[#This Row],[Business as usual]])<Tabelle2[[#This Row],[q-Wert (Indifferenz)]], 0,IF(ABS(Tabelle2[[#This Row],[Healthy City]]-Tabelle2[[#This Row],[Business as usual]])>Tabelle2[[#This Row],[p-Wert (Präferenz)]],1,IF(AND(ABS(Tabelle2[[#This Row],[Healthy City]]-Tabelle2[[#This Row],[Business as usual]])<=Tabelle2[[#This Row],[p-Wert (Präferenz)]],ABS(Tabelle2[[#This Row],[Healthy City]]-Tabelle2[[#This Row],[Business as usual]])>=Tabelle2[[#This Row],[q-Wert (Indifferenz)]]),((ABS(Tabelle2[[#This Row],[Healthy City]]-Tabelle2[[#This Row],[Business as usual]])-Tabelle2[[#This Row],[q-Wert (Indifferenz)]])/(Tabelle2[[#This Row],[p-Wert (Präferenz)]]-Tabelle2[[#This Row],[q-Wert (Indifferenz)]]))))),IF(ABS(Tabelle2[[#This Row],[Healthy City]]-Tabelle2[[#This Row],[Business as usual]])<Tabelle2[[#This Row],[q-Wert (Indifferenz)]], 0,IF(ABS(Tabelle2[[#This Row],[Healthy City]]-Tabelle2[[#This Row],[Business as usual]])>Tabelle2[[#This Row],[p-Wert (Präferenz)]],1,IF(AND(ABS(Tabelle2[[#This Row],[Healthy City]]-Tabelle2[[#This Row],[Business as usual]])<=Tabelle2[[#This Row],[p-Wert (Präferenz)]],ABS(Tabelle2[[#This Row],[Healthy City]]-Tabelle2[[#This Row],[Business as usual]])>=Tabelle2[[#This Row],[q-Wert (Indifferenz)]]),((ABS(Tabelle2[[#This Row],[Healthy City]]-Tabelle2[[#This Row],[Business as usual]])-Tabelle2[[#This Row],[q-Wert (Indifferenz)]])/(Tabelle2[[#This Row],[p-Wert (Präferenz)]]-Tabelle2[[#This Row],[q-Wert (Indifferenz)]])))))),IF(Tabelle2[[#This Row],[Healthy City]]-Tabelle2[[#This Row],[Business as usual]]<0,-1*IF(ABS(Tabelle2[[#This Row],[Healthy City]]-Tabelle2[[#This Row],[Business as usual]])<Tabelle2[[#This Row],[q-Wert (Indifferenz)]], 0,IF(ABS(Tabelle2[[#This Row],[Healthy City]]-Tabelle2[[#This Row],[Business as usual]])>Tabelle2[[#This Row],[p-Wert (Präferenz)]],1,IF(AND(ABS(Tabelle2[[#This Row],[Healthy City]]-Tabelle2[[#This Row],[Business as usual]])<=Tabelle2[[#This Row],[p-Wert (Präferenz)]],ABS(Tabelle2[[#This Row],[Healthy City]]-Tabelle2[[#This Row],[Business as usual]])>=Tabelle2[[#This Row],[q-Wert (Indifferenz)]]),((ABS(Tabelle2[[#This Row],[Healthy City]]-Tabelle2[[#This Row],[Business as usual]])-Tabelle2[[#This Row],[q-Wert (Indifferenz)]])/(Tabelle2[[#This Row],[p-Wert (Präferenz)]]-Tabelle2[[#This Row],[q-Wert (Indifferenz)]]))))),IF(ABS(Tabelle2[[#This Row],[Healthy City]]-Tabelle2[[#This Row],[Business as usual]])<Tabelle2[[#This Row],[q-Wert (Indifferenz)]], 0,IF(ABS(Tabelle2[[#This Row],[Healthy City]]-Tabelle2[[#This Row],[Business as usual]])>Tabelle2[[#This Row],[p-Wert (Präferenz)]],1,IF(AND(ABS(Tabelle2[[#This Row],[Healthy City]]-Tabelle2[[#This Row],[Business as usual]])<=Tabelle2[[#This Row],[p-Wert (Präferenz)]],ABS(Tabelle2[[#This Row],[Healthy City]]-Tabelle2[[#This Row],[Business as usual]])>=Tabelle2[[#This Row],[q-Wert (Indifferenz)]]),((ABS(Tabelle2[[#This Row],[Healthy City]]-Tabelle2[[#This Row],[Business as usual]])-Tabelle2[[#This Row],[q-Wert (Indifferenz)]])/(Tabelle2[[#This Row],[p-Wert (Präferenz)]]-Tabelle2[[#This Row],[q-Wert (Indifferenz)]])))))))","v":1},null,{"$f":"IF(Tabelle2[[#This Row],[min/max]]=\"min\",-1*IF(Tabelle2[[#This Row],[Urban Sprawl]]-Tabelle2[[#This Row],[Smart City]]<0,-1*IF(ABS(Tabelle2[[#This Row],[Urban Sprawl]]-Tabelle2[[#This Row],[Smart City]])<Tabelle2[[#This Row],[q-Wert (Indifferenz)]], 0,IF(ABS(Tabelle2[[#This Row],[Urban Sprawl]]-Tabelle2[[#This Row],[Smart City]])>Tabelle2[[#This Row],[p-Wert (Präferenz)]],1,IF(AND(ABS(Tabelle2[[#This Row],[Urban Sprawl]]-Tabelle2[[#This Row],[Smart City]])<=Tabelle2[[#This Row],[p-Wert (Präferenz)]],ABS(Tabelle2[[#This Row],[Urban Sprawl]]-Tabelle2[[#This Row],[Smart City]])>=Tabelle2[[#This Row],[q-Wert (Indifferenz)]]),((ABS(Tabelle2[[#This Row],[Urban Sprawl]]-Tabelle2[[#This Row],[Smart City]])-Tabelle2[[#This Row],[q-Wert (Indifferenz)]])/(Tabelle2[[#This Row],[p-Wert (Präferenz)]]-Tabelle2[[#This Row],[q-Wert (Indifferenz)]]))))),IF(ABS(Tabelle2[[#This Row],[Urban Sprawl]]-Tabelle2[[#This Row],[Smart City]])<Tabelle2[[#This Row],[q-Wert (Indifferenz)]], 0,IF(ABS(Tabelle2[[#This Row],[Urban Sprawl]]-Tabelle2[[#This Row],[Smart City]])>Tabelle2[[#This Row],[p-Wert (Präferenz)]],1,IF(AND(ABS(Tabelle2[[#This Row],[Urban Sprawl]]-Tabelle2[[#This Row],[Smart City]])<=Tabelle2[[#This Row],[p-Wert (Präferenz)]],ABS(Tabelle2[[#This Row],[Urban Sprawl]]-Tabelle2[[#This Row],[Smart City]])>=Tabelle2[[#This Row],[q-Wert (Indifferenz)]]),((ABS(Tabelle2[[#This Row],[Urban Sprawl]]-Tabelle2[[#This Row],[Smart City]])-Tabelle2[[#This Row],[q-Wert (Indifferenz)]])/(Tabelle2[[#This Row],[p-Wert (Präferenz)]]-Tabelle2[[#This Row],[q-Wert (Indifferenz)]])))))),IF(Tabelle2[[#This Row],[Urban Sprawl]]-Tabelle2[[#This Row],[Smart City]]<0,-1*IF(ABS(Tabelle2[[#This Row],[Urban Sprawl]]-Tabelle2[[#This Row],[Smart City]])<Tabelle2[[#This Row],[q-Wert (Indifferenz)]], 0,IF(ABS(Tabelle2[[#This Row],[Urban Sprawl]]-Tabelle2[[#This Row],[Smart City]])>Tabelle2[[#This Row],[p-Wert (Präferenz)]],1,IF(AND(ABS(Tabelle2[[#This Row],[Urban Sprawl]]-Tabelle2[[#This Row],[Smart City]])<=Tabelle2[[#This Row],[p-Wert (Präferenz)]],ABS(Tabelle2[[#This Row],[Urban Sprawl]]-Tabelle2[[#This Row],[Smart City]])>=Tabelle2[[#This Row],[q-Wert (Indifferenz)]]),((ABS(Tabelle2[[#This Row],[Urban Sprawl]]-Tabelle2[[#This Row],[Smart City]])-Tabelle2[[#This Row],[q-Wert (Indifferenz)]])/(Tabelle2[[#This Row],[p-Wert (Präferenz)]]-Tabelle2[[#This Row],[q-Wert (Indifferenz)]]))))),IF(ABS(Tabelle2[[#This Row],[Urban Sprawl]]-Tabelle2[[#This Row],[Smart City]])<Tabelle2[[#This Row],[q-Wert (Indifferenz)]], 0,IF(ABS(Tabelle2[[#This Row],[Urban Sprawl]]-Tabelle2[[#This Row],[Smart City]])>Tabelle2[[#This Row],[p-Wert (Präferenz)]],1,IF(AND(ABS(Tabelle2[[#This Row],[Urban Sprawl]]-Tabelle2[[#This Row],[Smart City]])<=Tabelle2[[#This Row],[p-Wert (Präferenz)]],ABS(Tabelle2[[#This Row],[Urban Sprawl]]-Tabelle2[[#This Row],[Smart City]])>=Tabelle2[[#This Row],[q-Wert (Indifferenz)]]),((ABS(Tabelle2[[#This Row],[Urban Sprawl]]-Tabelle2[[#This Row],[Smart City]])-Tabelle2[[#This Row],[q-Wert (Indifferenz)]])/(Tabelle2[[#This Row],[p-Wert (Präferenz)]]-Tabelle2[[#This Row],[q-Wert (Indifferenz)]])))))))","v":-0.6298200514138812},{"$f":"IF(Tabelle2[[#This Row],[min/max]]=\"min\",-1*IF(Tabelle2[[#This Row],[Urban Sprawl]]-Tabelle2[[#This Row],[Healthy City]]<0,-1*IF(ABS(Tabelle2[[#This Row],[Urban Sprawl]]-Tabelle2[[#This Row],[Healthy City]])<Tabelle2[[#This Row],[q-Wert (Indifferenz)]], 0,IF(ABS(Tabelle2[[#This Row],[Urban Sprawl]]-Tabelle2[[#This Row],[Healthy City]])>Tabelle2[[#This Row],[p-Wert (Präferenz)]],1,IF(AND(ABS(Tabelle2[[#This Row],[Urban Sprawl]]-Tabelle2[[#This Row],[Healthy City]])<=Tabelle2[[#This Row],[p-Wert (Präferenz)]],ABS(Tabelle2[[#This Row],[Urban Sprawl]]-Tabelle2[[#This Row],[Healthy City]])>=Tabelle2[[#This Row],[q-Wert (Indifferenz)]]),((ABS(Tabelle2[[#This Row],[Urban Sprawl]]-Tabelle2[[#This Row],[Healthy City]])-Tabelle2[[#This Row],[q-Wert (Indifferenz)]])/(Tabelle2[[#This Row],[p-Wert (Präferenz)]]-Tabelle2[[#This Row],[q-Wert (Indifferenz)]]))))),IF(ABS(Tabelle2[[#This Row],[Urban Sprawl]]-Tabelle2[[#This Row],[Healthy City]])<Tabelle2[[#This Row],[q-Wert (Indifferenz)]], 0,IF(ABS(Tabelle2[[#This Row],[Urban Sprawl]]-Tabelle2[[#This Row],[Healthy City]])>Tabelle2[[#This Row],[p-Wert (Präferenz)]],1,IF(AND(ABS(Tabelle2[[#This Row],[Urban Sprawl]]-Tabelle2[[#This Row],[Healthy City]])<=Tabelle2[[#This Row],[p-Wert (Präferenz)]],ABS(Tabelle2[[#This Row],[Urban Sprawl]]-Tabelle2[[#This Row],[Healthy City]])>=Tabelle2[[#This Row],[q-Wert (Indifferenz)]]),((ABS(Tabelle2[[#This Row],[Urban Sprawl]]-Tabelle2[[#This Row],[Healthy City]])-Tabelle2[[#This Row],[q-Wert (Indifferenz)]])/(Tabelle2[[#This Row],[p-Wert (Präferenz)]]-Tabelle2[[#This Row],[q-Wert (Indifferenz)]])))))),IF(Tabelle2[[#This Row],[Urban Sprawl]]-Tabelle2[[#This Row],[Healthy City]]<0,-1*IF(ABS(Tabelle2[[#This Row],[Urban Sprawl]]-Tabelle2[[#This Row],[Healthy City]])<Tabelle2[[#This Row],[q-Wert (Indifferenz)]], 0,IF(ABS(Tabelle2[[#This Row],[Urban Sprawl]]-Tabelle2[[#This Row],[Healthy City]])>Tabelle2[[#This Row],[p-Wert (Präferenz)]],1,IF(AND(ABS(Tabelle2[[#This Row],[Urban Sprawl]]-Tabelle2[[#This Row],[Healthy City]])<=Tabelle2[[#This Row],[p-Wert (Präferenz)]],ABS(Tabelle2[[#This Row],[Urban Sprawl]]-Tabelle2[[#This Row],[Healthy City]])>=Tabelle2[[#This Row],[q-Wert (Indifferenz)]]),((ABS(Tabelle2[[#This Row],[Urban Sprawl]]-Tabelle2[[#This Row],[Healthy City]])-Tabelle2[[#This Row],[q-Wert (Indifferenz)]])/(Tabelle2[[#This Row],[p-Wert (Präferenz)]]-Tabelle2[[#This Row],[q-Wert (Indifferenz)]]))))),IF(ABS(Tabelle2[[#This Row],[Urban Sprawl]]-Tabelle2[[#This Row],[Healthy City]])<Tabelle2[[#This Row],[q-Wert (Indifferenz)]], 0,IF(ABS(Tabelle2[[#This Row],[Urban Sprawl]]-Tabelle2[[#This Row],[Healthy City]])>Tabelle2[[#This Row],[p-Wert (Präferenz)]],1,IF(AND(ABS(Tabelle2[[#This Row],[Urban Sprawl]]-Tabelle2[[#This Row],[Healthy City]])<=Tabelle2[[#This Row],[p-Wert (Präferenz)]],ABS(Tabelle2[[#This Row],[Urban Sprawl]]-Tabelle2[[#This Row],[Healthy City]])>=Tabelle2[[#This Row],[q-Wert (Indifferenz)]]),((ABS(Tabelle2[[#This Row],[Urban Sprawl]]-Tabelle2[[#This Row],[Healthy City]])-Tabelle2[[#This Row],[q-Wert (Indifferenz)]])/(Tabelle2[[#This Row],[p-Wert (Präferenz)]]-Tabelle2[[#This Row],[q-Wert (Indifferenz)]])))))))","v":-1},{"$f":"IF(Tabelle2[[#This Row],[min/max]]=\"min\",-1*IF(Tabelle2[[#This Row],[Urban Sprawl]]-Tabelle2[[#This Row],[Business as usual]]<0,-1*IF(ABS(Tabelle2[[#This Row],[Urban Sprawl]]-Tabelle2[[#This Row],[Business as usual]])<Tabelle2[[#This Row],[q-Wert (Indifferenz)]], 0,IF(ABS(Tabelle2[[#This Row],[Urban Sprawl]]-Tabelle2[[#This Row],[Business as usual]])>Tabelle2[[#This Row],[p-Wert (Präferenz)]],1,IF(AND(ABS(Tabelle2[[#This Row],[Urban Sprawl]]-Tabelle2[[#This Row],[Business as usual]])<=Tabelle2[[#This Row],[p-Wert (Präferenz)]],ABS(Tabelle2[[#This Row],[Urban Sprawl]]-Tabelle2[[#This Row],[Business as usual]])>=Tabelle2[[#This Row],[q-Wert (Indifferenz)]]),((ABS(Tabelle2[[#This Row],[Urban Sprawl]]-Tabelle2[[#This Row],[Business as usual]])-Tabelle2[[#This Row],[q-Wert (Indifferenz)]])/(Tabelle2[[#This Row],[p-Wert (Präferenz)]]-Tabelle2[[#This Row],[q-Wert (Indifferenz)]]))))),IF(ABS(Tabelle2[[#This Row],[Urban Sprawl]]-Tabelle2[[#This Row],[Business as usual]])<Tabelle2[[#This Row],[q-Wert (Indifferenz)]], 0,IF(ABS(Tabelle2[[#This Row],[Urban Sprawl]]-Tabelle2[[#This Row],[Business as usual]])>Tabelle2[[#This Row],[p-Wert (Präferenz)]],1,IF(AND(ABS(Tabelle2[[#This Row],[Urban Sprawl]]-Tabelle2[[#This Row],[Business as usual]])<=Tabelle2[[#This Row],[p-Wert (Präferenz)]],ABS(Tabelle2[[#This Row],[Urban Sprawl]]-Tabelle2[[#This Row],[Business as usual]])>=Tabelle2[[#This Row],[q-Wert (Indifferenz)]]),((ABS(Tabelle2[[#This Row],[Urban Sprawl]]-Tabelle2[[#This Row],[Business as usual]])-Tabelle2[[#This Row],[q-Wert (Indifferenz)]])/(Tabelle2[[#This Row],[p-Wert (Präferenz)]]-Tabelle2[[#This Row],[q-Wert (Indifferenz)]])))))),IF(Tabelle2[[#This Row],[Urban Sprawl]]-Tabelle2[[#This Row],[Business as usual]]<0,-1*IF(ABS(Tabelle2[[#This Row],[Urban Sprawl]]-Tabelle2[[#This Row],[Business as usual]])<Tabelle2[[#This Row],[q-Wert (Indifferenz)]], 0,IF(ABS(Tabelle2[[#This Row],[Urban Sprawl]]-Tabelle2[[#This Row],[Business as usual]])>Tabelle2[[#This Row],[p-Wert (Präferenz)]],1,IF(AND(ABS(Tabelle2[[#This Row],[Urban Sprawl]]-Tabelle2[[#This Row],[Business as usual]])<=Tabelle2[[#This Row],[p-Wert (Präferenz)]],ABS(Tabelle2[[#This Row],[Urban Sprawl]]-Tabelle2[[#This Row],[Business as usual]])>=Tabelle2[[#This Row],[q-Wert (Indifferenz)]]),((ABS(Tabelle2[[#This Row],[Urban Sprawl]]-Tabelle2[[#This Row],[Business as usual]])-Tabelle2[[#This Row],[q-Wert (Indifferenz)]])/(Tabelle2[[#This Row],[p-Wert (Präferenz)]]-Tabelle2[[#This Row],[q-Wert (Indifferenz)]]))))),IF(ABS(Tabelle2[[#This Row],[Urban Sprawl]]-Tabelle2[[#This Row],[Business as usual]])<Tabelle2[[#This Row],[q-Wert (Indifferenz)]], 0,IF(ABS(Tabelle2[[#This Row],[Urban Sprawl]]-Tabelle2[[#This Row],[Business as usual]])>Tabelle2[[#This Row],[p-Wert (Präferenz)]],1,IF(AND(ABS(Tabelle2[[#This Row],[Urban Sprawl]]-Tabelle2[[#This Row],[Business as usual]])<=Tabelle2[[#This Row],[p-Wert (Präferenz)]],ABS(Tabelle2[[#This Row],[Urban Sprawl]]-Tabelle2[[#This Row],[Business as usual]])>=Tabelle2[[#This Row],[q-Wert (Indifferenz)]]),((ABS(Tabelle2[[#This Row],[Urban Sprawl]]-Tabelle2[[#This Row],[Business as usual]])-Tabelle2[[#This Row],[q-Wert (Indifferenz)]])/(Tabelle2[[#This Row],[p-Wert (Präferenz)]]-Tabelle2[[#This Row],[q-Wert (Indifferenz)]])))))))","v":0},null,{"$f":"IF(Tabelle2[[#This Row],[min/max]]=\"min\",-1*IF(Tabelle2[[#This Row],[Business as usual]]-Tabelle2[[#This Row],[Smart City]]<0,-1*IF(ABS(Tabelle2[[#This Row],[Business as usual]]-Tabelle2[[#This Row],[Smart City]])<Tabelle2[[#This Row],[q-Wert (Indifferenz)]], 0,IF(ABS(Tabelle2[[#This Row],[Business as usual]]-Tabelle2[[#This Row],[Smart City]])>Tabelle2[[#This Row],[p-Wert (Präferenz)]],1,IF(AND(ABS(Tabelle2[[#This Row],[Business as usual]]-Tabelle2[[#This Row],[Smart City]])<=Tabelle2[[#This Row],[p-Wert (Präferenz)]],ABS(Tabelle2[[#This Row],[Business as usual]]-Tabelle2[[#This Row],[Smart City]])>=Tabelle2[[#This Row],[q-Wert (Indifferenz)]]),((ABS(Tabelle2[[#This Row],[Business as usual]]-Tabelle2[[#This Row],[Smart City]])-Tabelle2[[#This Row],[q-Wert (Indifferenz)]])/(Tabelle2[[#This Row],[p-Wert (Präferenz)]]-Tabelle2[[#This Row],[q-Wert (Indifferenz)]]))))),IF(ABS(Tabelle2[[#This Row],[Business as usual]]-Tabelle2[[#This Row],[Smart City]])<Tabelle2[[#This Row],[q-Wert (Indifferenz)]], 0,IF(ABS(Tabelle2[[#This Row],[Business as usual]]-Tabelle2[[#This Row],[Smart City]])>Tabelle2[[#This Row],[p-Wert (Präferenz)]],1,IF(AND(ABS(Tabelle2[[#This Row],[Business as usual]]-Tabelle2[[#This Row],[Smart City]])<=Tabelle2[[#This Row],[p-Wert (Präferenz)]],ABS(Tabelle2[[#This Row],[Business as usual]]-Tabelle2[[#This Row],[Smart City]])>=Tabelle2[[#This Row],[q-Wert (Indifferenz)]]),((ABS(Tabelle2[[#This Row],[Business as usual]]-Tabelle2[[#This Row],[Smart City]])-Tabelle2[[#This Row],[q-Wert (Indifferenz)]])/(Tabelle2[[#This Row],[p-Wert (Präferenz)]]-Tabelle2[[#This Row],[q-Wert (Indifferenz)]])))))),IF(Tabelle2[[#This Row],[Business as usual]]-Tabelle2[[#This Row],[Smart City]]<0,-1*IF(ABS(Tabelle2[[#This Row],[Business as usual]]-Tabelle2[[#This Row],[Smart City]])<Tabelle2[[#This Row],[q-Wert (Indifferenz)]], 0,IF(ABS(Tabelle2[[#This Row],[Business as usual]]-Tabelle2[[#This Row],[Smart City]])>Tabelle2[[#This Row],[p-Wert (Präferenz)]],1,IF(AND(ABS(Tabelle2[[#This Row],[Business as usual]]-Tabelle2[[#This Row],[Smart City]])<=Tabelle2[[#This Row],[p-Wert (Präferenz)]],ABS(Tabelle2[[#This Row],[Business as usual]]-Tabelle2[[#This Row],[Smart City]])>=Tabelle2[[#This Row],[q-Wert (Indifferenz)]]),((ABS(Tabelle2[[#This Row],[Business as usual]]-Tabelle2[[#This Row],[Smart City]])-Tabelle2[[#This Row],[q-Wert (Indifferenz)]])/(Tabelle2[[#This Row],[p-Wert (Präferenz)]]-Tabelle2[[#This Row],[q-Wert (Indifferenz)]]))))),IF(ABS(Tabelle2[[#This Row],[Business as usual]]-Tabelle2[[#This Row],[Smart City]])<Tabelle2[[#This Row],[q-Wert (Indifferenz)]], 0,IF(ABS(Tabelle2[[#This Row],[Business as usual]]-Tabelle2[[#This Row],[Smart City]])>Tabelle2[[#This Row],[p-Wert (Präferenz)]],1,IF(AND(ABS(Tabelle2[[#This Row],[Business as usual]]-Tabelle2[[#This Row],[Smart City]])<=Tabelle2[[#This Row],[p-Wert (Präferenz)]],ABS(Tabelle2[[#This Row],[Business as usual]]-Tabelle2[[#This Row],[Smart City]])>=Tabelle2[[#This Row],[q-Wert (Indifferenz)]]),((ABS(Tabelle2[[#This Row],[Business as usual]]-Tabelle2[[#This Row],[Smart City]])-Tabelle2[[#This Row],[q-Wert (Indifferenz)]])/(Tabelle2[[#This Row],[p-Wert (Präferenz)]]-Tabelle2[[#This Row],[q-Wert (Indifferenz)]])))))))","v":-0.892030848329049},{"$f":"IF(Tabelle2[[#This Row],[min/max]]=\"min\",-1*IF(Tabelle2[[#This Row],[Business as usual]]-Tabelle2[[#This Row],[Healthy City]]<0,-1*IF(ABS(Tabelle2[[#This Row],[Business as usual]]-Tabelle2[[#This Row],[Healthy City]])<Tabelle2[[#This Row],[q-Wert (Indifferenz)]], 0,IF(ABS(Tabelle2[[#This Row],[Business as usual]]-Tabelle2[[#This Row],[Healthy City]])>Tabelle2[[#This Row],[p-Wert (Präferenz)]],1,IF(AND(ABS(Tabelle2[[#This Row],[Business as usual]]-Tabelle2[[#This Row],[Healthy City]])<=Tabelle2[[#This Row],[p-Wert (Präferenz)]],ABS(Tabelle2[[#This Row],[Business as usual]]-Tabelle2[[#This Row],[Healthy City]])>=Tabelle2[[#This Row],[q-Wert (Indifferenz)]]),((ABS(Tabelle2[[#This Row],[Business as usual]]-Tabelle2[[#This Row],[Healthy City]])-Tabelle2[[#This Row],[q-Wert (Indifferenz)]])/(Tabelle2[[#This Row],[p-Wert (Präferenz)]]-Tabelle2[[#This Row],[q-Wert (Indifferenz)]]))))),IF(ABS(Tabelle2[[#This Row],[Business as usual]]-Tabelle2[[#This Row],[Healthy City]])<Tabelle2[[#This Row],[q-Wert (Indifferenz)]], 0,IF(ABS(Tabelle2[[#This Row],[Business as usual]]-Tabelle2[[#This Row],[Healthy City]])>Tabelle2[[#This Row],[p-Wert (Präferenz)]],1,IF(AND(ABS(Tabelle2[[#This Row],[Business as usual]]-Tabelle2[[#This Row],[Healthy City]])<=Tabelle2[[#This Row],[p-Wert (Präferenz)]],ABS(Tabelle2[[#This Row],[Business as usual]]-Tabelle2[[#This Row],[Healthy City]])>=Tabelle2[[#This Row],[q-Wert (Indifferenz)]]),((ABS(Tabelle2[[#This Row],[Business as usual]]-Tabelle2[[#This Row],[Healthy City]])-Tabelle2[[#This Row],[q-Wert (Indifferenz)]])/(Tabelle2[[#This Row],[p-Wert (Präferenz)]]-Tabelle2[[#This Row],[q-Wert (Indifferenz)]])))))),IF(Tabelle2[[#This Row],[Business as usual]]-Tabelle2[[#This Row],[Healthy City]]<0,-1*IF(ABS(Tabelle2[[#This Row],[Business as usual]]-Tabelle2[[#This Row],[Healthy City]])<Tabelle2[[#This Row],[q-Wert (Indifferenz)]], 0,IF(ABS(Tabelle2[[#This Row],[Business as usual]]-Tabelle2[[#This Row],[Healthy City]])>Tabelle2[[#This Row],[p-Wert (Präferenz)]],1,IF(AND(ABS(Tabelle2[[#This Row],[Business as usual]]-Tabelle2[[#This Row],[Healthy City]])<=Tabelle2[[#This Row],[p-Wert (Präferenz)]],ABS(Tabelle2[[#This Row],[Business as usual]]-Tabelle2[[#This Row],[Healthy City]])>=Tabelle2[[#This Row],[q-Wert (Indifferenz)]]),((ABS(Tabelle2[[#This Row],[Business as usual]]-Tabelle2[[#This Row],[Healthy City]])-Tabelle2[[#This Row],[q-Wert (Indifferenz)]])/(Tabelle2[[#This Row],[p-Wert (Präferenz)]]-Tabelle2[[#This Row],[q-Wert (Indifferenz)]]))))),IF(ABS(Tabelle2[[#This Row],[Business as usual]]-Tabelle2[[#This Row],[Healthy City]])<Tabelle2[[#This Row],[q-Wert (Indifferenz)]], 0,IF(ABS(Tabelle2[[#This Row],[Business as usual]]-Tabelle2[[#This Row],[Healthy City]])>Tabelle2[[#This Row],[p-Wert (Präferenz)]],1,IF(AND(ABS(Tabelle2[[#This Row],[Business as usual]]-Tabelle2[[#This Row],[Healthy City]])<=Tabelle2[[#This Row],[p-Wert (Präferenz)]],ABS(Tabelle2[[#This Row],[Business as usual]]-Tabelle2[[#This Row],[Healthy City]])>=Tabelle2[[#This Row],[q-Wert (Indifferenz)]]),((ABS(Tabelle2[[#This Row],[Business as usual]]-Tabelle2[[#This Row],[Healthy City]])-Tabelle2[[#This Row],[q-Wert (Indifferenz)]])/(Tabelle2[[#This Row],[p-Wert (Präferenz)]]-Tabelle2[[#This Row],[q-Wert (Indifferenz)]])))))))","v":-1},{"$f":"IF(Tabelle2[[#This Row],[min/max]]=\"min\",-1*IF(Tabelle2[[#This Row],[Business as usual]]-Tabelle2[[#This Row],[Urban Sprawl]]<0,-1*IF(ABS(Tabelle2[[#This Row],[Business as usual]]-Tabelle2[[#This Row],[Urban Sprawl]])<Tabelle2[[#This Row],[q-Wert (Indifferenz)]], 0,IF(ABS(Tabelle2[[#This Row],[Business as usual]]-Tabelle2[[#This Row],[Urban Sprawl]])>Tabelle2[[#This Row],[p-Wert (Präferenz)]],1,IF(AND(ABS(Tabelle2[[#This Row],[Business as usual]]-Tabelle2[[#This Row],[Urban Sprawl]])<=Tabelle2[[#This Row],[p-Wert (Präferenz)]],ABS(Tabelle2[[#This Row],[Business as usual]]-Tabelle2[[#This Row],[Urban Sprawl]])>=Tabelle2[[#This Row],[q-Wert (Indifferenz)]]),((ABS(Tabelle2[[#This Row],[Business as usual]]-Tabelle2[[#This Row],[Urban Sprawl]])-Tabelle2[[#This Row],[q-Wert (Indifferenz)]])/(Tabelle2[[#This Row],[p-Wert (Präferenz)]]-Tabelle2[[#This Row],[q-Wert (Indifferenz)]]))))),IF(ABS(Tabelle2[[#This Row],[Business as usual]]-Tabelle2[[#This Row],[Urban Sprawl]])<Tabelle2[[#This Row],[q-Wert (Indifferenz)]], 0,IF(ABS(Tabelle2[[#This Row],[Business as usual]]-Tabelle2[[#This Row],[Urban Sprawl]])>Tabelle2[[#This Row],[p-Wert (Präferenz)]],1,IF(AND(ABS(Tabelle2[[#This Row],[Business as usual]]-Tabelle2[[#This Row],[Urban Sprawl]])<=Tabelle2[[#This Row],[p-Wert (Präferenz)]],ABS(Tabelle2[[#This Row],[Business as usual]]-Tabelle2[[#This Row],[Urban Sprawl]])>=Tabelle2[[#This Row],[q-Wert (Indifferenz)]]),((ABS(Tabelle2[[#This Row],[Business as usual]]-Tabelle2[[#This Row],[Urban Sprawl]])-Tabelle2[[#This Row],[q-Wert (Indifferenz)]])/(Tabelle2[[#This Row],[p-Wert (Präferenz)]]-Tabelle2[[#This Row],[q-Wert (Indifferenz)]])))))),IF(Tabelle2[[#This Row],[Business as usual]]-Tabelle2[[#This Row],[Urban Sprawl]]<0,-1*IF(ABS(Tabelle2[[#This Row],[Business as usual]]-Tabelle2[[#This Row],[Urban Sprawl]])<Tabelle2[[#This Row],[q-Wert (Indifferenz)]], 0,IF(ABS(Tabelle2[[#This Row],[Business as usual]]-Tabelle2[[#This Row],[Urban Sprawl]])>Tabelle2[[#This Row],[p-Wert (Präferenz)]],1,IF(AND(ABS(Tabelle2[[#This Row],[Business as usual]]-Tabelle2[[#This Row],[Urban Sprawl]])<=Tabelle2[[#This Row],[p-Wert (Präferenz)]],ABS(Tabelle2[[#This Row],[Business as usual]]-Tabelle2[[#This Row],[Urban Sprawl]])>=Tabelle2[[#This Row],[q-Wert (Indifferenz)]]),((ABS(Tabelle2[[#This Row],[Business as usual]]-Tabelle2[[#This Row],[Urban Sprawl]])-Tabelle2[[#This Row],[q-Wert (Indifferenz)]])/(Tabelle2[[#This Row],[p-Wert (Präferenz)]]-Tabelle2[[#This Row],[q-Wert (Indifferenz)]]))))),IF(ABS(Tabelle2[[#This Row],[Business as usual]]-Tabelle2[[#This Row],[Urban Sprawl]])<Tabelle2[[#This Row],[q-Wert (Indifferenz)]], 0,IF(ABS(Tabelle2[[#This Row],[Business as usual]]-Tabelle2[[#This Row],[Urban Sprawl]])>Tabelle2[[#This Row],[p-Wert (Präferenz)]],1,IF(AND(ABS(Tabelle2[[#This Row],[Business as usual]]-Tabelle2[[#This Row],[Urban Sprawl]])<=Tabelle2[[#This Row],[p-Wert (Präferenz)]],ABS(Tabelle2[[#This Row],[Business as usual]]-Tabelle2[[#This Row],[Urban Sprawl]])>=Tabelle2[[#This Row],[q-Wert (Indifferenz)]]),((ABS(Tabelle2[[#This Row],[Business as usual]]-Tabelle2[[#This Row],[Urban Sprawl]])-Tabelle2[[#This Row],[q-Wert (Indifferenz)]])/(Tabelle2[[#This Row],[p-Wert (Präferenz)]]-Tabelle2[[#This Row],[q-Wert (Indifferenz)]])))))))","v":0}]
[null,null,null,"Wohnflächen",{"$f":"('\"Walking Weights\"'!D16)/100","v":5.5555555555555552E-2},"max","Hektar",119428,120748,120859,120000,"Typ 5",598,1552,{"$f":"IF(Tabelle2[[#This Row],[min/max]]=\"min\",-1*IF(Tabelle2[[#This Row],[Smart City]]-Tabelle2[[#This Row],[Healthy City]]<0,-1*IF(ABS(Tabelle2[[#This Row],[Smart City]]-Tabelle2[[#This Row],[Healthy City]])<Tabelle2[[#This Row],[q-Wert (Indifferenz)]], 0,IF(ABS(Tabelle2[[#This Row],[Smart City]]-Tabelle2[[#This Row],[Healthy City]])>Tabelle2[[#This Row],[p-Wert (Präferenz)]],1,IF(AND(ABS(Tabelle2[[#This Row],[Smart City]]-Tabelle2[[#This Row],[Healthy City]])<=Tabelle2[[#This Row],[p-Wert (Präferenz)]],ABS(Tabelle2[[#This Row],[Smart City]]-Tabelle2[[#This Row],[Healthy City]])>=Tabelle2[[#This Row],[q-Wert (Indifferenz)]]),((ABS(Tabelle2[[#This Row],[Smart City]]-Tabelle2[[#This Row],[Healthy City]])-Tabelle2[[#This Row],[q-Wert (Indifferenz)]])/(Tabelle2[[#This Row],[p-Wert (Präferenz)]]-Tabelle2[[#This Row],[q-Wert (Indifferenz)]]))))),IF(ABS(Tabelle2[[#This Row],[Smart City]]-Tabelle2[[#This Row],[Healthy City]])<Tabelle2[[#This Row],[q-Wert (Indifferenz)]], 0,IF(ABS(Tabelle2[[#This Row],[Smart City]]-Tabelle2[[#This Row],[Healthy City]])>Tabelle2[[#This Row],[p-Wert (Präferenz)]],1,IF(AND(ABS(Tabelle2[[#This Row],[Smart City]]-Tabelle2[[#This Row],[Healthy City]])<=Tabelle2[[#This Row],[p-Wert (Präferenz)]],ABS(Tabelle2[[#This Row],[Smart City]]-Tabelle2[[#This Row],[Healthy City]])>=Tabelle2[[#This Row],[q-Wert (Indifferenz)]]),((ABS(Tabelle2[[#This Row],[Smart City]]-Tabelle2[[#This Row],[Healthy City]])-Tabelle2[[#This Row],[q-Wert (Indifferenz)]])/(Tabelle2[[#This Row],[p-Wert (Präferenz)]]-Tabelle2[[#This Row],[q-Wert (Indifferenz)]])))))),IF(Tabelle2[[#This Row],[Smart City]]-Tabelle2[[#This Row],[Healthy City]]<0,-1*IF(ABS(Tabelle2[[#This Row],[Smart City]]-Tabelle2[[#This Row],[Healthy City]])<Tabelle2[[#This Row],[q-Wert (Indifferenz)]], 0,IF(ABS(Tabelle2[[#This Row],[Smart City]]-Tabelle2[[#This Row],[Healthy City]])>Tabelle2[[#This Row],[p-Wert (Präferenz)]],1,IF(AND(ABS(Tabelle2[[#This Row],[Smart City]]-Tabelle2[[#This Row],[Healthy City]])<=Tabelle2[[#This Row],[p-Wert (Präferenz)]],ABS(Tabelle2[[#This Row],[Smart City]]-Tabelle2[[#This Row],[Healthy City]])>=Tabelle2[[#This Row],[q-Wert (Indifferenz)]]),((ABS(Tabelle2[[#This Row],[Smart City]]-Tabelle2[[#This Row],[Healthy City]])-Tabelle2[[#This Row],[q-Wert (Indifferenz)]])/(Tabelle2[[#This Row],[p-Wert (Präferenz)]]-Tabelle2[[#This Row],[q-Wert (Indifferenz)]]))))),IF(ABS(Tabelle2[[#This Row],[Smart City]]-Tabelle2[[#This Row],[Healthy City]])<Tabelle2[[#This Row],[q-Wert (Indifferenz)]], 0,IF(ABS(Tabelle2[[#This Row],[Smart City]]-Tabelle2[[#This Row],[Healthy City]])>Tabelle2[[#This Row],[p-Wert (Präferenz)]],1,IF(AND(ABS(Tabelle2[[#This Row],[Smart City]]-Tabelle2[[#This Row],[Healthy City]])<=Tabelle2[[#This Row],[p-Wert (Präferenz)]],ABS(Tabelle2[[#This Row],[Smart City]]-Tabelle2[[#This Row],[Healthy City]])>=Tabelle2[[#This Row],[q-Wert (Indifferenz)]]),((ABS(Tabelle2[[#This Row],[Smart City]]-Tabelle2[[#This Row],[Healthy City]])-Tabelle2[[#This Row],[q-Wert (Indifferenz)]])/(Tabelle2[[#This Row],[p-Wert (Präferenz)]]-Tabelle2[[#This Row],[q-Wert (Indifferenz)]])))))))","v":-0.75681341719077566},{"$f":"IF(Tabelle2[[#This Row],[min/max]]=\"min\",-1*IF(Tabelle2[[#This Row],[Smart City]]-Tabelle2[[#This Row],[Urban Sprawl]]<0,-1*IF(ABS(Tabelle2[[#This Row],[Smart City]]-Tabelle2[[#This Row],[Urban Sprawl]])<Tabelle2[[#This Row],[q-Wert (Indifferenz)]], 0,IF(ABS(Tabelle2[[#This Row],[Smart City]]-Tabelle2[[#This Row],[Urban Sprawl]])>Tabelle2[[#This Row],[p-Wert (Präferenz)]],1,IF(AND(ABS(Tabelle2[[#This Row],[Smart City]]-Tabelle2[[#This Row],[Urban Sprawl]])<=Tabelle2[[#This Row],[p-Wert (Präferenz)]],ABS(Tabelle2[[#This Row],[Smart City]]-Tabelle2[[#This Row],[Urban Sprawl]])>=Tabelle2[[#This Row],[q-Wert (Indifferenz)]]),((ABS(Tabelle2[[#This Row],[Smart City]]-Tabelle2[[#This Row],[Urban Sprawl]])-Tabelle2[[#This Row],[q-Wert (Indifferenz)]])/(Tabelle2[[#This Row],[p-Wert (Präferenz)]]-Tabelle2[[#This Row],[q-Wert (Indifferenz)]]))))),IF(ABS(Tabelle2[[#This Row],[Smart City]]-Tabelle2[[#This Row],[Urban Sprawl]])<Tabelle2[[#This Row],[q-Wert (Indifferenz)]], 0,IF(ABS(Tabelle2[[#This Row],[Smart City]]-Tabelle2[[#This Row],[Urban Sprawl]])>Tabelle2[[#This Row],[p-Wert (Präferenz)]],1,IF(AND(ABS(Tabelle2[[#This Row],[Smart City]]-Tabelle2[[#This Row],[Urban Sprawl]])<=Tabelle2[[#This Row],[p-Wert (Präferenz)]],ABS(Tabelle2[[#This Row],[Smart City]]-Tabelle2[[#This Row],[Urban Sprawl]])>=Tabelle2[[#This Row],[q-Wert (Indifferenz)]]),((ABS(Tabelle2[[#This Row],[Smart City]]-Tabelle2[[#This Row],[Urban Sprawl]])-Tabelle2[[#This Row],[q-Wert (Indifferenz)]])/(Tabelle2[[#This Row],[p-Wert (Präferenz)]]-Tabelle2[[#This Row],[q-Wert (Indifferenz)]])))))),IF(Tabelle2[[#This Row],[Smart City]]-Tabelle2[[#This Row],[Urban Sprawl]]<0,-1*IF(ABS(Tabelle2[[#This Row],[Smart City]]-Tabelle2[[#This Row],[Urban Sprawl]])<Tabelle2[[#This Row],[q-Wert (Indifferenz)]], 0,IF(ABS(Tabelle2[[#This Row],[Smart City]]-Tabelle2[[#This Row],[Urban Sprawl]])>Tabelle2[[#This Row],[p-Wert (Präferenz)]],1,IF(AND(ABS(Tabelle2[[#This Row],[Smart City]]-Tabelle2[[#This Row],[Urban Sprawl]])<=Tabelle2[[#This Row],[p-Wert (Präferenz)]],ABS(Tabelle2[[#This Row],[Smart City]]-Tabelle2[[#This Row],[Urban Sprawl]])>=Tabelle2[[#This Row],[q-Wert (Indifferenz)]]),((ABS(Tabelle2[[#This Row],[Smart City]]-Tabelle2[[#This Row],[Urban Sprawl]])-Tabelle2[[#This Row],[q-Wert (Indifferenz)]])/(Tabelle2[[#This Row],[p-Wert (Präferenz)]]-Tabelle2[[#This Row],[q-Wert (Indifferenz)]]))))),IF(ABS(Tabelle2[[#This Row],[Smart City]]-Tabelle2[[#This Row],[Urban Sprawl]])<Tabelle2[[#This Row],[q-Wert (Indifferenz)]], 0,IF(ABS(Tabelle2[[#This Row],[Smart City]]-Tabelle2[[#This Row],[Urban Sprawl]])>Tabelle2[[#This Row],[p-Wert (Präferenz)]],1,IF(AND(ABS(Tabelle2[[#This Row],[Smart City]]-Tabelle2[[#This Row],[Urban Sprawl]])<=Tabelle2[[#This Row],[p-Wert (Präferenz)]],ABS(Tabelle2[[#This Row],[Smart City]]-Tabelle2[[#This Row],[Urban Sprawl]])>=Tabelle2[[#This Row],[q-Wert (Indifferenz)]]),((ABS(Tabelle2[[#This Row],[Smart City]]-Tabelle2[[#This Row],[Urban Sprawl]])-Tabelle2[[#This Row],[q-Wert (Indifferenz)]])/(Tabelle2[[#This Row],[p-Wert (Präferenz)]]-Tabelle2[[#This Row],[q-Wert (Indifferenz)]])))))))","v":-0.87316561844863727},{"$f":"IF(Tabelle2[[#This Row],[min/max]]=\"min\",-1*IF(Tabelle2[[#This Row],[Smart City]]-Tabelle2[[#This Row],[Business as usual]]<0,-1*IF(ABS(Tabelle2[[#This Row],[Smart City]]-Tabelle2[[#This Row],[Business as usual]])<Tabelle2[[#This Row],[q-Wert (Indifferenz)]], 0,IF(ABS(Tabelle2[[#This Row],[Smart City]]-Tabelle2[[#This Row],[Business as usual]])>Tabelle2[[#This Row],[p-Wert (Präferenz)]],1,IF(AND(ABS(Tabelle2[[#This Row],[Smart City]]-Tabelle2[[#This Row],[Business as usual]])<=Tabelle2[[#This Row],[p-Wert (Präferenz)]],ABS(Tabelle2[[#This Row],[Smart City]]-Tabelle2[[#This Row],[Business as usual]])>=Tabelle2[[#This Row],[q-Wert (Indifferenz)]]),((ABS(Tabelle2[[#This Row],[Smart City]]-Tabelle2[[#This Row],[Business as usual]])-Tabelle2[[#This Row],[q-Wert (Indifferenz)]])/(Tabelle2[[#This Row],[p-Wert (Präferenz)]]-Tabelle2[[#This Row],[q-Wert (Indifferenz)]]))))),IF(ABS(Tabelle2[[#This Row],[Smart City]]-Tabelle2[[#This Row],[Business as usual]])<Tabelle2[[#This Row],[q-Wert (Indifferenz)]], 0,IF(ABS(Tabelle2[[#This Row],[Smart City]]-Tabelle2[[#This Row],[Business as usual]])>Tabelle2[[#This Row],[p-Wert (Präferenz)]],1,IF(AND(ABS(Tabelle2[[#This Row],[Smart City]]-Tabelle2[[#This Row],[Business as usual]])<=Tabelle2[[#This Row],[p-Wert (Präferenz)]],ABS(Tabelle2[[#This Row],[Smart City]]-Tabelle2[[#This Row],[Business as usual]])>=Tabelle2[[#This Row],[q-Wert (Indifferenz)]]),((ABS(Tabelle2[[#This Row],[Smart City]]-Tabelle2[[#This Row],[Business as usual]])-Tabelle2[[#This Row],[q-Wert (Indifferenz)]])/(Tabelle2[[#This Row],[p-Wert (Präferenz)]]-Tabelle2[[#This Row],[q-Wert (Indifferenz)]])))))),IF(Tabelle2[[#This Row],[Smart City]]-Tabelle2[[#This Row],[Business as usual]]<0,-1*IF(ABS(Tabelle2[[#This Row],[Smart City]]-Tabelle2[[#This Row],[Business as usual]])<Tabelle2[[#This Row],[q-Wert (Indifferenz)]], 0,IF(ABS(Tabelle2[[#This Row],[Smart City]]-Tabelle2[[#This Row],[Business as usual]])>Tabelle2[[#This Row],[p-Wert (Präferenz)]],1,IF(AND(ABS(Tabelle2[[#This Row],[Smart City]]-Tabelle2[[#This Row],[Business as usual]])<=Tabelle2[[#This Row],[p-Wert (Präferenz)]],ABS(Tabelle2[[#This Row],[Smart City]]-Tabelle2[[#This Row],[Business as usual]])>=Tabelle2[[#This Row],[q-Wert (Indifferenz)]]),((ABS(Tabelle2[[#This Row],[Smart City]]-Tabelle2[[#This Row],[Business as usual]])-Tabelle2[[#This Row],[q-Wert (Indifferenz)]])/(Tabelle2[[#This Row],[p-Wert (Präferenz)]]-Tabelle2[[#This Row],[q-Wert (Indifferenz)]]))))),IF(ABS(Tabelle2[[#This Row],[Smart City]]-Tabelle2[[#This Row],[Business as usual]])<Tabelle2[[#This Row],[q-Wert (Indifferenz)]], 0,IF(ABS(Tabelle2[[#This Row],[Smart City]]-Tabelle2[[#This Row],[Business as usual]])>Tabelle2[[#This Row],[p-Wert (Präferenz)]],1,IF(AND(ABS(Tabelle2[[#This Row],[Smart City]]-Tabelle2[[#This Row],[Business as usual]])<=Tabelle2[[#This Row],[p-Wert (Präferenz)]],ABS(Tabelle2[[#This Row],[Smart City]]-Tabelle2[[#This Row],[Business as usual]])>=Tabelle2[[#This Row],[q-Wert (Indifferenz)]]),((ABS(Tabelle2[[#This Row],[Smart City]]-Tabelle2[[#This Row],[Business as usual]])-Tabelle2[[#This Row],[q-Wert (Indifferenz)]])/(Tabelle2[[#This Row],[p-Wert (Präferenz)]]-Tabelle2[[#This Row],[q-Wert (Indifferenz)]])))))))","v":0},null,{"$f":"IF(Tabelle2[[#This Row],[min/max]]=\"min\",-1*IF(Tabelle2[[#This Row],[Healthy City]]-Tabelle2[[#This Row],[Smart City]]<0,-1*IF(ABS(Tabelle2[[#This Row],[Healthy City]]-Tabelle2[[#This Row],[Smart City]])<Tabelle2[[#This Row],[q-Wert (Indifferenz)]], 0,IF(ABS(Tabelle2[[#This Row],[Healthy City]]-Tabelle2[[#This Row],[Smart City]])>Tabelle2[[#This Row],[p-Wert (Präferenz)]],1,IF(AND(ABS(Tabelle2[[#This Row],[Healthy City]]-Tabelle2[[#This Row],[Smart City]])<=Tabelle2[[#This Row],[p-Wert (Präferenz)]],ABS(Tabelle2[[#This Row],[Healthy City]]-Tabelle2[[#This Row],[Smart City]])>=Tabelle2[[#This Row],[q-Wert (Indifferenz)]]),((ABS(Tabelle2[[#This Row],[Healthy City]]-Tabelle2[[#This Row],[Smart City]])-Tabelle2[[#This Row],[q-Wert (Indifferenz)]])/(Tabelle2[[#This Row],[p-Wert (Präferenz)]]-Tabelle2[[#This Row],[q-Wert (Indifferenz)]]))))),IF(ABS(Tabelle2[[#This Row],[Healthy City]]-Tabelle2[[#This Row],[Smart City]])<Tabelle2[[#This Row],[q-Wert (Indifferenz)]], 0,IF(ABS(Tabelle2[[#This Row],[Healthy City]]-Tabelle2[[#This Row],[Smart City]])>Tabelle2[[#This Row],[p-Wert (Präferenz)]],1,IF(AND(ABS(Tabelle2[[#This Row],[Healthy City]]-Tabelle2[[#This Row],[Smart City]])<=Tabelle2[[#This Row],[p-Wert (Präferenz)]],ABS(Tabelle2[[#This Row],[Healthy City]]-Tabelle2[[#This Row],[Smart City]])>=Tabelle2[[#This Row],[q-Wert (Indifferenz)]]),((ABS(Tabelle2[[#This Row],[Healthy City]]-Tabelle2[[#This Row],[Smart City]])-Tabelle2[[#This Row],[q-Wert (Indifferenz)]])/(Tabelle2[[#This Row],[p-Wert (Präferenz)]]-Tabelle2[[#This Row],[q-Wert (Indifferenz)]])))))),IF(Tabelle2[[#This Row],[Healthy City]]-Tabelle2[[#This Row],[Smart City]]<0,-1*IF(ABS(Tabelle2[[#This Row],[Healthy City]]-Tabelle2[[#This Row],[Smart City]])<Tabelle2[[#This Row],[q-Wert (Indifferenz)]], 0,IF(ABS(Tabelle2[[#This Row],[Healthy City]]-Tabelle2[[#This Row],[Smart City]])>Tabelle2[[#This Row],[p-Wert (Präferenz)]],1,IF(AND(ABS(Tabelle2[[#This Row],[Healthy City]]-Tabelle2[[#This Row],[Smart City]])<=Tabelle2[[#This Row],[p-Wert (Präferenz)]],ABS(Tabelle2[[#This Row],[Healthy City]]-Tabelle2[[#This Row],[Smart City]])>=Tabelle2[[#This Row],[q-Wert (Indifferenz)]]),((ABS(Tabelle2[[#This Row],[Healthy City]]-Tabelle2[[#This Row],[Smart City]])-Tabelle2[[#This Row],[q-Wert (Indifferenz)]])/(Tabelle2[[#This Row],[p-Wert (Präferenz)]]-Tabelle2[[#This Row],[q-Wert (Indifferenz)]]))))),IF(ABS(Tabelle2[[#This Row],[Healthy City]]-Tabelle2[[#This Row],[Smart City]])<Tabelle2[[#This Row],[q-Wert (Indifferenz)]], 0,IF(ABS(Tabelle2[[#This Row],[Healthy City]]-Tabelle2[[#This Row],[Smart City]])>Tabelle2[[#This Row],[p-Wert (Präferenz)]],1,IF(AND(ABS(Tabelle2[[#This Row],[Healthy City]]-Tabelle2[[#This Row],[Smart City]])<=Tabelle2[[#This Row],[p-Wert (Präferenz)]],ABS(Tabelle2[[#This Row],[Healthy City]]-Tabelle2[[#This Row],[Smart City]])>=Tabelle2[[#This Row],[q-Wert (Indifferenz)]]),((ABS(Tabelle2[[#This Row],[Healthy City]]-Tabelle2[[#This Row],[Smart City]])-Tabelle2[[#This Row],[q-Wert (Indifferenz)]])/(Tabelle2[[#This Row],[p-Wert (Präferenz)]]-Tabelle2[[#This Row],[q-Wert (Indifferenz)]])))))))","v":0.75681341719077566},{"$f":"IF(Tabelle2[[#This Row],[min/max]]=\"min\",-1*IF(Tabelle2[[#This Row],[Healthy City]]-Tabelle2[[#This Row],[Urban Sprawl]]<0,-1*IF(ABS(Tabelle2[[#This Row],[Healthy City]]-Tabelle2[[#This Row],[Urban Sprawl]])<Tabelle2[[#This Row],[q-Wert (Indifferenz)]], 0,IF(ABS(Tabelle2[[#This Row],[Healthy City]]-Tabelle2[[#This Row],[Urban Sprawl]])>Tabelle2[[#This Row],[p-Wert (Präferenz)]],1,IF(AND(ABS(Tabelle2[[#This Row],[Healthy City]]-Tabelle2[[#This Row],[Urban Sprawl]])<=Tabelle2[[#This Row],[p-Wert (Präferenz)]],ABS(Tabelle2[[#This Row],[Healthy City]]-Tabelle2[[#This Row],[Urban Sprawl]])>=Tabelle2[[#This Row],[q-Wert (Indifferenz)]]),((ABS(Tabelle2[[#This Row],[Healthy City]]-Tabelle2[[#This Row],[Urban Sprawl]])-Tabelle2[[#This Row],[q-Wert (Indifferenz)]])/(Tabelle2[[#This Row],[p-Wert (Präferenz)]]-Tabelle2[[#This Row],[q-Wert (Indifferenz)]]))))),IF(ABS(Tabelle2[[#This Row],[Healthy City]]-Tabelle2[[#This Row],[Urban Sprawl]])<Tabelle2[[#This Row],[q-Wert (Indifferenz)]], 0,IF(ABS(Tabelle2[[#This Row],[Healthy City]]-Tabelle2[[#This Row],[Urban Sprawl]])>Tabelle2[[#This Row],[p-Wert (Präferenz)]],1,IF(AND(ABS(Tabelle2[[#This Row],[Healthy City]]-Tabelle2[[#This Row],[Urban Sprawl]])<=Tabelle2[[#This Row],[p-Wert (Präferenz)]],ABS(Tabelle2[[#This Row],[Healthy City]]-Tabelle2[[#This Row],[Urban Sprawl]])>=Tabelle2[[#This Row],[q-Wert (Indifferenz)]]),((ABS(Tabelle2[[#This Row],[Healthy City]]-Tabelle2[[#This Row],[Urban Sprawl]])-Tabelle2[[#This Row],[q-Wert (Indifferenz)]])/(Tabelle2[[#This Row],[p-Wert (Präferenz)]]-Tabelle2[[#This Row],[q-Wert (Indifferenz)]])))))),IF(Tabelle2[[#This Row],[Healthy City]]-Tabelle2[[#This Row],[Urban Sprawl]]<0,-1*IF(ABS(Tabelle2[[#This Row],[Healthy City]]-Tabelle2[[#This Row],[Urban Sprawl]])<Tabelle2[[#This Row],[q-Wert (Indifferenz)]], 0,IF(ABS(Tabelle2[[#This Row],[Healthy City]]-Tabelle2[[#This Row],[Urban Sprawl]])>Tabelle2[[#This Row],[p-Wert (Präferenz)]],1,IF(AND(ABS(Tabelle2[[#This Row],[Healthy City]]-Tabelle2[[#This Row],[Urban Sprawl]])<=Tabelle2[[#This Row],[p-Wert (Präferenz)]],ABS(Tabelle2[[#This Row],[Healthy City]]-Tabelle2[[#This Row],[Urban Sprawl]])>=Tabelle2[[#This Row],[q-Wert (Indifferenz)]]),((ABS(Tabelle2[[#This Row],[Healthy City]]-Tabelle2[[#This Row],[Urban Sprawl]])-Tabelle2[[#This Row],[q-Wert (Indifferenz)]])/(Tabelle2[[#This Row],[p-Wert (Präferenz)]]-Tabelle2[[#This Row],[q-Wert (Indifferenz)]]))))),IF(ABS(Tabelle2[[#This Row],[Healthy City]]-Tabelle2[[#This Row],[Urban Sprawl]])<Tabelle2[[#This Row],[q-Wert (Indifferenz)]], 0,IF(ABS(Tabelle2[[#This Row],[Healthy City]]-Tabelle2[[#This Row],[Urban Sprawl]])>Tabelle2[[#This Row],[p-Wert (Präferenz)]],1,IF(AND(ABS(Tabelle2[[#This Row],[Healthy City]]-Tabelle2[[#This Row],[Urban Sprawl]])<=Tabelle2[[#This Row],[p-Wert (Präferenz)]],ABS(Tabelle2[[#This Row],[Healthy City]]-Tabelle2[[#This Row],[Urban Sprawl]])>=Tabelle2[[#This Row],[q-Wert (Indifferenz)]]),((ABS(Tabelle2[[#This Row],[Healthy City]]-Tabelle2[[#This Row],[Urban Sprawl]])-Tabelle2[[#This Row],[q-Wert (Indifferenz)]])/(Tabelle2[[#This Row],[p-Wert (Präferenz)]]-Tabelle2[[#This Row],[q-Wert (Indifferenz)]])))))))","v":0},{"$f":"IF(Tabelle2[[#This Row],[min/max]]=\"min\",-1*IF(Tabelle2[[#This Row],[Healthy City]]-Tabelle2[[#This Row],[Business as usual]]<0,-1*IF(ABS(Tabelle2[[#This Row],[Healthy City]]-Tabelle2[[#This Row],[Business as usual]])<Tabelle2[[#This Row],[q-Wert (Indifferenz)]], 0,IF(ABS(Tabelle2[[#This Row],[Healthy City]]-Tabelle2[[#This Row],[Business as usual]])>Tabelle2[[#This Row],[p-Wert (Präferenz)]],1,IF(AND(ABS(Tabelle2[[#This Row],[Healthy City]]-Tabelle2[[#This Row],[Business as usual]])<=Tabelle2[[#This Row],[p-Wert (Präferenz)]],ABS(Tabelle2[[#This Row],[Healthy City]]-Tabelle2[[#This Row],[Business as usual]])>=Tabelle2[[#This Row],[q-Wert (Indifferenz)]]),((ABS(Tabelle2[[#This Row],[Healthy City]]-Tabelle2[[#This Row],[Business as usual]])-Tabelle2[[#This Row],[q-Wert (Indifferenz)]])/(Tabelle2[[#This Row],[p-Wert (Präferenz)]]-Tabelle2[[#This Row],[q-Wert (Indifferenz)]]))))),IF(ABS(Tabelle2[[#This Row],[Healthy City]]-Tabelle2[[#This Row],[Business as usual]])<Tabelle2[[#This Row],[q-Wert (Indifferenz)]], 0,IF(ABS(Tabelle2[[#This Row],[Healthy City]]-Tabelle2[[#This Row],[Business as usual]])>Tabelle2[[#This Row],[p-Wert (Präferenz)]],1,IF(AND(ABS(Tabelle2[[#This Row],[Healthy City]]-Tabelle2[[#This Row],[Business as usual]])<=Tabelle2[[#This Row],[p-Wert (Präferenz)]],ABS(Tabelle2[[#This Row],[Healthy City]]-Tabelle2[[#This Row],[Business as usual]])>=Tabelle2[[#This Row],[q-Wert (Indifferenz)]]),((ABS(Tabelle2[[#This Row],[Healthy City]]-Tabelle2[[#This Row],[Business as usual]])-Tabelle2[[#This Row],[q-Wert (Indifferenz)]])/(Tabelle2[[#This Row],[p-Wert (Präferenz)]]-Tabelle2[[#This Row],[q-Wert (Indifferenz)]])))))),IF(Tabelle2[[#This Row],[Healthy City]]-Tabelle2[[#This Row],[Business as usual]]<0,-1*IF(ABS(Tabelle2[[#This Row],[Healthy City]]-Tabelle2[[#This Row],[Business as usual]])<Tabelle2[[#This Row],[q-Wert (Indifferenz)]], 0,IF(ABS(Tabelle2[[#This Row],[Healthy City]]-Tabelle2[[#This Row],[Business as usual]])>Tabelle2[[#This Row],[p-Wert (Präferenz)]],1,IF(AND(ABS(Tabelle2[[#This Row],[Healthy City]]-Tabelle2[[#This Row],[Business as usual]])<=Tabelle2[[#This Row],[p-Wert (Präferenz)]],ABS(Tabelle2[[#This Row],[Healthy City]]-Tabelle2[[#This Row],[Business as usual]])>=Tabelle2[[#This Row],[q-Wert (Indifferenz)]]),((ABS(Tabelle2[[#This Row],[Healthy City]]-Tabelle2[[#This Row],[Business as usual]])-Tabelle2[[#This Row],[q-Wert (Indifferenz)]])/(Tabelle2[[#This Row],[p-Wert (Präferenz)]]-Tabelle2[[#This Row],[q-Wert (Indifferenz)]]))))),IF(ABS(Tabelle2[[#This Row],[Healthy City]]-Tabelle2[[#This Row],[Business as usual]])<Tabelle2[[#This Row],[q-Wert (Indifferenz)]], 0,IF(ABS(Tabelle2[[#This Row],[Healthy City]]-Tabelle2[[#This Row],[Business as usual]])>Tabelle2[[#This Row],[p-Wert (Präferenz)]],1,IF(AND(ABS(Tabelle2[[#This Row],[Healthy City]]-Tabelle2[[#This Row],[Business as usual]])<=Tabelle2[[#This Row],[p-Wert (Präferenz)]],ABS(Tabelle2[[#This Row],[Healthy City]]-Tabelle2[[#This Row],[Business as usual]])>=Tabelle2[[#This Row],[q-Wert (Indifferenz)]]),((ABS(Tabelle2[[#This Row],[Healthy City]]-Tabelle2[[#This Row],[Business as usual]])-Tabelle2[[#This Row],[q-Wert (Indifferenz)]])/(Tabelle2[[#This Row],[p-Wert (Präferenz)]]-Tabelle2[[#This Row],[q-Wert (Indifferenz)]])))))))","v":0.15723270440251572},null,{"$f":"IF(Tabelle2[[#This Row],[min/max]]=\"min\",-1*IF(Tabelle2[[#This Row],[Urban Sprawl]]-Tabelle2[[#This Row],[Smart City]]<0,-1*IF(ABS(Tabelle2[[#This Row],[Urban Sprawl]]-Tabelle2[[#This Row],[Smart City]])<Tabelle2[[#This Row],[q-Wert (Indifferenz)]], 0,IF(ABS(Tabelle2[[#This Row],[Urban Sprawl]]-Tabelle2[[#This Row],[Smart City]])>Tabelle2[[#This Row],[p-Wert (Präferenz)]],1,IF(AND(ABS(Tabelle2[[#This Row],[Urban Sprawl]]-Tabelle2[[#This Row],[Smart City]])<=Tabelle2[[#This Row],[p-Wert (Präferenz)]],ABS(Tabelle2[[#This Row],[Urban Sprawl]]-Tabelle2[[#This Row],[Smart City]])>=Tabelle2[[#This Row],[q-Wert (Indifferenz)]]),((ABS(Tabelle2[[#This Row],[Urban Sprawl]]-Tabelle2[[#This Row],[Smart City]])-Tabelle2[[#This Row],[q-Wert (Indifferenz)]])/(Tabelle2[[#This Row],[p-Wert (Präferenz)]]-Tabelle2[[#This Row],[q-Wert (Indifferenz)]]))))),IF(ABS(Tabelle2[[#This Row],[Urban Sprawl]]-Tabelle2[[#This Row],[Smart City]])<Tabelle2[[#This Row],[q-Wert (Indifferenz)]], 0,IF(ABS(Tabelle2[[#This Row],[Urban Sprawl]]-Tabelle2[[#This Row],[Smart City]])>Tabelle2[[#This Row],[p-Wert (Präferenz)]],1,IF(AND(ABS(Tabelle2[[#This Row],[Urban Sprawl]]-Tabelle2[[#This Row],[Smart City]])<=Tabelle2[[#This Row],[p-Wert (Präferenz)]],ABS(Tabelle2[[#This Row],[Urban Sprawl]]-Tabelle2[[#This Row],[Smart City]])>=Tabelle2[[#This Row],[q-Wert (Indifferenz)]]),((ABS(Tabelle2[[#This Row],[Urban Sprawl]]-Tabelle2[[#This Row],[Smart City]])-Tabelle2[[#This Row],[q-Wert (Indifferenz)]])/(Tabelle2[[#This Row],[p-Wert (Präferenz)]]-Tabelle2[[#This Row],[q-Wert (Indifferenz)]])))))),IF(Tabelle2[[#This Row],[Urban Sprawl]]-Tabelle2[[#This Row],[Smart City]]<0,-1*IF(ABS(Tabelle2[[#This Row],[Urban Sprawl]]-Tabelle2[[#This Row],[Smart City]])<Tabelle2[[#This Row],[q-Wert (Indifferenz)]], 0,IF(ABS(Tabelle2[[#This Row],[Urban Sprawl]]-Tabelle2[[#This Row],[Smart City]])>Tabelle2[[#This Row],[p-Wert (Präferenz)]],1,IF(AND(ABS(Tabelle2[[#This Row],[Urban Sprawl]]-Tabelle2[[#This Row],[Smart City]])<=Tabelle2[[#This Row],[p-Wert (Präferenz)]],ABS(Tabelle2[[#This Row],[Urban Sprawl]]-Tabelle2[[#This Row],[Smart City]])>=Tabelle2[[#This Row],[q-Wert (Indifferenz)]]),((ABS(Tabelle2[[#This Row],[Urban Sprawl]]-Tabelle2[[#This Row],[Smart City]])-Tabelle2[[#This Row],[q-Wert (Indifferenz)]])/(Tabelle2[[#This Row],[p-Wert (Präferenz)]]-Tabelle2[[#This Row],[q-Wert (Indifferenz)]]))))),IF(ABS(Tabelle2[[#This Row],[Urban Sprawl]]-Tabelle2[[#This Row],[Smart City]])<Tabelle2[[#This Row],[q-Wert (Indifferenz)]], 0,IF(ABS(Tabelle2[[#This Row],[Urban Sprawl]]-Tabelle2[[#This Row],[Smart City]])>Tabelle2[[#This Row],[p-Wert (Präferenz)]],1,IF(AND(ABS(Tabelle2[[#This Row],[Urban Sprawl]]-Tabelle2[[#This Row],[Smart City]])<=Tabelle2[[#This Row],[p-Wert (Präferenz)]],ABS(Tabelle2[[#This Row],[Urban Sprawl]]-Tabelle2[[#This Row],[Smart City]])>=Tabelle2[[#This Row],[q-Wert (Indifferenz)]]),((ABS(Tabelle2[[#This Row],[Urban Sprawl]]-Tabelle2[[#This Row],[Smart City]])-Tabelle2[[#This Row],[q-Wert (Indifferenz)]])/(Tabelle2[[#This Row],[p-Wert (Präferenz)]]-Tabelle2[[#This Row],[q-Wert (Indifferenz)]])))))))","v":0.87316561844863727},{"$f":"IF(Tabelle2[[#This Row],[min/max]]=\"min\",-1*IF(Tabelle2[[#This Row],[Urban Sprawl]]-Tabelle2[[#This Row],[Healthy City]]<0,-1*IF(ABS(Tabelle2[[#This Row],[Urban Sprawl]]-Tabelle2[[#This Row],[Healthy City]])<Tabelle2[[#This Row],[q-Wert (Indifferenz)]], 0,IF(ABS(Tabelle2[[#This Row],[Urban Sprawl]]-Tabelle2[[#This Row],[Healthy City]])>Tabelle2[[#This Row],[p-Wert (Präferenz)]],1,IF(AND(ABS(Tabelle2[[#This Row],[Urban Sprawl]]-Tabelle2[[#This Row],[Healthy City]])<=Tabelle2[[#This Row],[p-Wert (Präferenz)]],ABS(Tabelle2[[#This Row],[Urban Sprawl]]-Tabelle2[[#This Row],[Healthy City]])>=Tabelle2[[#This Row],[q-Wert (Indifferenz)]]),((ABS(Tabelle2[[#This Row],[Urban Sprawl]]-Tabelle2[[#This Row],[Healthy City]])-Tabelle2[[#This Row],[q-Wert (Indifferenz)]])/(Tabelle2[[#This Row],[p-Wert (Präferenz)]]-Tabelle2[[#This Row],[q-Wert (Indifferenz)]]))))),IF(ABS(Tabelle2[[#This Row],[Urban Sprawl]]-Tabelle2[[#This Row],[Healthy City]])<Tabelle2[[#This Row],[q-Wert (Indifferenz)]], 0,IF(ABS(Tabelle2[[#This Row],[Urban Sprawl]]-Tabelle2[[#This Row],[Healthy City]])>Tabelle2[[#This Row],[p-Wert (Präferenz)]],1,IF(AND(ABS(Tabelle2[[#This Row],[Urban Sprawl]]-Tabelle2[[#This Row],[Healthy City]])<=Tabelle2[[#This Row],[p-Wert (Präferenz)]],ABS(Tabelle2[[#This Row],[Urban Sprawl]]-Tabelle2[[#This Row],[Healthy City]])>=Tabelle2[[#This Row],[q-Wert (Indifferenz)]]),((ABS(Tabelle2[[#This Row],[Urban Sprawl]]-Tabelle2[[#This Row],[Healthy City]])-Tabelle2[[#This Row],[q-Wert (Indifferenz)]])/(Tabelle2[[#This Row],[p-Wert (Präferenz)]]-Tabelle2[[#This Row],[q-Wert (Indifferenz)]])))))),IF(Tabelle2[[#This Row],[Urban Sprawl]]-Tabelle2[[#This Row],[Healthy City]]<0,-1*IF(ABS(Tabelle2[[#This Row],[Urban Sprawl]]-Tabelle2[[#This Row],[Healthy City]])<Tabelle2[[#This Row],[q-Wert (Indifferenz)]], 0,IF(ABS(Tabelle2[[#This Row],[Urban Sprawl]]-Tabelle2[[#This Row],[Healthy City]])>Tabelle2[[#This Row],[p-Wert (Präferenz)]],1,IF(AND(ABS(Tabelle2[[#This Row],[Urban Sprawl]]-Tabelle2[[#This Row],[Healthy City]])<=Tabelle2[[#This Row],[p-Wert (Präferenz)]],ABS(Tabelle2[[#This Row],[Urban Sprawl]]-Tabelle2[[#This Row],[Healthy City]])>=Tabelle2[[#This Row],[q-Wert (Indifferenz)]]),((ABS(Tabelle2[[#This Row],[Urban Sprawl]]-Tabelle2[[#This Row],[Healthy City]])-Tabelle2[[#This Row],[q-Wert (Indifferenz)]])/(Tabelle2[[#This Row],[p-Wert (Präferenz)]]-Tabelle2[[#This Row],[q-Wert (Indifferenz)]]))))),IF(ABS(Tabelle2[[#This Row],[Urban Sprawl]]-Tabelle2[[#This Row],[Healthy City]])<Tabelle2[[#This Row],[q-Wert (Indifferenz)]], 0,IF(ABS(Tabelle2[[#This Row],[Urban Sprawl]]-Tabelle2[[#This Row],[Healthy City]])>Tabelle2[[#This Row],[p-Wert (Präferenz)]],1,IF(AND(ABS(Tabelle2[[#This Row],[Urban Sprawl]]-Tabelle2[[#This Row],[Healthy City]])<=Tabelle2[[#This Row],[p-Wert (Präferenz)]],ABS(Tabelle2[[#This Row],[Urban Sprawl]]-Tabelle2[[#This Row],[Healthy City]])>=Tabelle2[[#This Row],[q-Wert (Indifferenz)]]),((ABS(Tabelle2[[#This Row],[Urban Sprawl]]-Tabelle2[[#This Row],[Healthy City]])-Tabelle2[[#This Row],[q-Wert (Indifferenz)]])/(Tabelle2[[#This Row],[p-Wert (Präferenz)]]-Tabelle2[[#This Row],[q-Wert (Indifferenz)]])))))))","v":0},{"$f":"IF(Tabelle2[[#This Row],[min/max]]=\"min\",-1*IF(Tabelle2[[#This Row],[Urban Sprawl]]-Tabelle2[[#This Row],[Business as usual]]<0,-1*IF(ABS(Tabelle2[[#This Row],[Urban Sprawl]]-Tabelle2[[#This Row],[Business as usual]])<Tabelle2[[#This Row],[q-Wert (Indifferenz)]], 0,IF(ABS(Tabelle2[[#This Row],[Urban Sprawl]]-Tabelle2[[#This Row],[Business as usual]])>Tabelle2[[#This Row],[p-Wert (Präferenz)]],1,IF(AND(ABS(Tabelle2[[#This Row],[Urban Sprawl]]-Tabelle2[[#This Row],[Business as usual]])<=Tabelle2[[#This Row],[p-Wert (Präferenz)]],ABS(Tabelle2[[#This Row],[Urban Sprawl]]-Tabelle2[[#This Row],[Business as usual]])>=Tabelle2[[#This Row],[q-Wert (Indifferenz)]]),((ABS(Tabelle2[[#This Row],[Urban Sprawl]]-Tabelle2[[#This Row],[Business as usual]])-Tabelle2[[#This Row],[q-Wert (Indifferenz)]])/(Tabelle2[[#This Row],[p-Wert (Präferenz)]]-Tabelle2[[#This Row],[q-Wert (Indifferenz)]]))))),IF(ABS(Tabelle2[[#This Row],[Urban Sprawl]]-Tabelle2[[#This Row],[Business as usual]])<Tabelle2[[#This Row],[q-Wert (Indifferenz)]], 0,IF(ABS(Tabelle2[[#This Row],[Urban Sprawl]]-Tabelle2[[#This Row],[Business as usual]])>Tabelle2[[#This Row],[p-Wert (Präferenz)]],1,IF(AND(ABS(Tabelle2[[#This Row],[Urban Sprawl]]-Tabelle2[[#This Row],[Business as usual]])<=Tabelle2[[#This Row],[p-Wert (Präferenz)]],ABS(Tabelle2[[#This Row],[Urban Sprawl]]-Tabelle2[[#This Row],[Business as usual]])>=Tabelle2[[#This Row],[q-Wert (Indifferenz)]]),((ABS(Tabelle2[[#This Row],[Urban Sprawl]]-Tabelle2[[#This Row],[Business as usual]])-Tabelle2[[#This Row],[q-Wert (Indifferenz)]])/(Tabelle2[[#This Row],[p-Wert (Präferenz)]]-Tabelle2[[#This Row],[q-Wert (Indifferenz)]])))))),IF(Tabelle2[[#This Row],[Urban Sprawl]]-Tabelle2[[#This Row],[Business as usual]]<0,-1*IF(ABS(Tabelle2[[#This Row],[Urban Sprawl]]-Tabelle2[[#This Row],[Business as usual]])<Tabelle2[[#This Row],[q-Wert (Indifferenz)]], 0,IF(ABS(Tabelle2[[#This Row],[Urban Sprawl]]-Tabelle2[[#This Row],[Business as usual]])>Tabelle2[[#This Row],[p-Wert (Präferenz)]],1,IF(AND(ABS(Tabelle2[[#This Row],[Urban Sprawl]]-Tabelle2[[#This Row],[Business as usual]])<=Tabelle2[[#This Row],[p-Wert (Präferenz)]],ABS(Tabelle2[[#This Row],[Urban Sprawl]]-Tabelle2[[#This Row],[Business as usual]])>=Tabelle2[[#This Row],[q-Wert (Indifferenz)]]),((ABS(Tabelle2[[#This Row],[Urban Sprawl]]-Tabelle2[[#This Row],[Business as usual]])-Tabelle2[[#This Row],[q-Wert (Indifferenz)]])/(Tabelle2[[#This Row],[p-Wert (Präferenz)]]-Tabelle2[[#This Row],[q-Wert (Indifferenz)]]))))),IF(ABS(Tabelle2[[#This Row],[Urban Sprawl]]-Tabelle2[[#This Row],[Business as usual]])<Tabelle2[[#This Row],[q-Wert (Indifferenz)]], 0,IF(ABS(Tabelle2[[#This Row],[Urban Sprawl]]-Tabelle2[[#This Row],[Business as usual]])>Tabelle2[[#This Row],[p-Wert (Präferenz)]],1,IF(AND(ABS(Tabelle2[[#This Row],[Urban Sprawl]]-Tabelle2[[#This Row],[Business as usual]])<=Tabelle2[[#This Row],[p-Wert (Präferenz)]],ABS(Tabelle2[[#This Row],[Urban Sprawl]]-Tabelle2[[#This Row],[Business as usual]])>=Tabelle2[[#This Row],[q-Wert (Indifferenz)]]),((ABS(Tabelle2[[#This Row],[Urban Sprawl]]-Tabelle2[[#This Row],[Business as usual]])-Tabelle2[[#This Row],[q-Wert (Indifferenz)]])/(Tabelle2[[#This Row],[p-Wert (Präferenz)]]-Tabelle2[[#This Row],[q-Wert (Indifferenz)]])))))))","v":0.27358490566037735},null,{"$f":"IF(Tabelle2[[#This Row],[min/max]]=\"min\",-1*IF(Tabelle2[[#This Row],[Business as usual]]-Tabelle2[[#This Row],[Smart City]]<0,-1*IF(ABS(Tabelle2[[#This Row],[Business as usual]]-Tabelle2[[#This Row],[Smart City]])<Tabelle2[[#This Row],[q-Wert (Indifferenz)]], 0,IF(ABS(Tabelle2[[#This Row],[Business as usual]]-Tabelle2[[#This Row],[Smart City]])>Tabelle2[[#This Row],[p-Wert (Präferenz)]],1,IF(AND(ABS(Tabelle2[[#This Row],[Business as usual]]-Tabelle2[[#This Row],[Smart City]])<=Tabelle2[[#This Row],[p-Wert (Präferenz)]],ABS(Tabelle2[[#This Row],[Business as usual]]-Tabelle2[[#This Row],[Smart City]])>=Tabelle2[[#This Row],[q-Wert (Indifferenz)]]),((ABS(Tabelle2[[#This Row],[Business as usual]]-Tabelle2[[#This Row],[Smart City]])-Tabelle2[[#This Row],[q-Wert (Indifferenz)]])/(Tabelle2[[#This Row],[p-Wert (Präferenz)]]-Tabelle2[[#This Row],[q-Wert (Indifferenz)]]))))),IF(ABS(Tabelle2[[#This Row],[Business as usual]]-Tabelle2[[#This Row],[Smart City]])<Tabelle2[[#This Row],[q-Wert (Indifferenz)]], 0,IF(ABS(Tabelle2[[#This Row],[Business as usual]]-Tabelle2[[#This Row],[Smart City]])>Tabelle2[[#This Row],[p-Wert (Präferenz)]],1,IF(AND(ABS(Tabelle2[[#This Row],[Business as usual]]-Tabelle2[[#This Row],[Smart City]])<=Tabelle2[[#This Row],[p-Wert (Präferenz)]],ABS(Tabelle2[[#This Row],[Business as usual]]-Tabelle2[[#This Row],[Smart City]])>=Tabelle2[[#This Row],[q-Wert (Indifferenz)]]),((ABS(Tabelle2[[#This Row],[Business as usual]]-Tabelle2[[#This Row],[Smart City]])-Tabelle2[[#This Row],[q-Wert (Indifferenz)]])/(Tabelle2[[#This Row],[p-Wert (Präferenz)]]-Tabelle2[[#This Row],[q-Wert (Indifferenz)]])))))),IF(Tabelle2[[#This Row],[Business as usual]]-Tabelle2[[#This Row],[Smart City]]<0,-1*IF(ABS(Tabelle2[[#This Row],[Business as usual]]-Tabelle2[[#This Row],[Smart City]])<Tabelle2[[#This Row],[q-Wert (Indifferenz)]], 0,IF(ABS(Tabelle2[[#This Row],[Business as usual]]-Tabelle2[[#This Row],[Smart City]])>Tabelle2[[#This Row],[p-Wert (Präferenz)]],1,IF(AND(ABS(Tabelle2[[#This Row],[Business as usual]]-Tabelle2[[#This Row],[Smart City]])<=Tabelle2[[#This Row],[p-Wert (Präferenz)]],ABS(Tabelle2[[#This Row],[Business as usual]]-Tabelle2[[#This Row],[Smart City]])>=Tabelle2[[#This Row],[q-Wert (Indifferenz)]]),((ABS(Tabelle2[[#This Row],[Business as usual]]-Tabelle2[[#This Row],[Smart City]])-Tabelle2[[#This Row],[q-Wert (Indifferenz)]])/(Tabelle2[[#This Row],[p-Wert (Präferenz)]]-Tabelle2[[#This Row],[q-Wert (Indifferenz)]]))))),IF(ABS(Tabelle2[[#This Row],[Business as usual]]-Tabelle2[[#This Row],[Smart City]])<Tabelle2[[#This Row],[q-Wert (Indifferenz)]], 0,IF(ABS(Tabelle2[[#This Row],[Business as usual]]-Tabelle2[[#This Row],[Smart City]])>Tabelle2[[#This Row],[p-Wert (Präferenz)]],1,IF(AND(ABS(Tabelle2[[#This Row],[Business as usual]]-Tabelle2[[#This Row],[Smart City]])<=Tabelle2[[#This Row],[p-Wert (Präferenz)]],ABS(Tabelle2[[#This Row],[Business as usual]]-Tabelle2[[#This Row],[Smart City]])>=Tabelle2[[#This Row],[q-Wert (Indifferenz)]]),((ABS(Tabelle2[[#This Row],[Business as usual]]-Tabelle2[[#This Row],[Smart City]])-Tabelle2[[#This Row],[q-Wert (Indifferenz)]])/(Tabelle2[[#This Row],[p-Wert (Präferenz)]]-Tabelle2[[#This Row],[q-Wert (Indifferenz)]])))))))","v":0},{"$f":"IF(Tabelle2[[#This Row],[min/max]]=\"min\",-1*IF(Tabelle2[[#This Row],[Business as usual]]-Tabelle2[[#This Row],[Healthy City]]<0,-1*IF(ABS(Tabelle2[[#This Row],[Business as usual]]-Tabelle2[[#This Row],[Healthy City]])<Tabelle2[[#This Row],[q-Wert (Indifferenz)]], 0,IF(ABS(Tabelle2[[#This Row],[Business as usual]]-Tabelle2[[#This Row],[Healthy City]])>Tabelle2[[#This Row],[p-Wert (Präferenz)]],1,IF(AND(ABS(Tabelle2[[#This Row],[Business as usual]]-Tabelle2[[#This Row],[Healthy City]])<=Tabelle2[[#This Row],[p-Wert (Präferenz)]],ABS(Tabelle2[[#This Row],[Business as usual]]-Tabelle2[[#This Row],[Healthy City]])>=Tabelle2[[#This Row],[q-Wert (Indifferenz)]]),((ABS(Tabelle2[[#This Row],[Business as usual]]-Tabelle2[[#This Row],[Healthy City]])-Tabelle2[[#This Row],[q-Wert (Indifferenz)]])/(Tabelle2[[#This Row],[p-Wert (Präferenz)]]-Tabelle2[[#This Row],[q-Wert (Indifferenz)]]))))),IF(ABS(Tabelle2[[#This Row],[Business as usual]]-Tabelle2[[#This Row],[Healthy City]])<Tabelle2[[#This Row],[q-Wert (Indifferenz)]], 0,IF(ABS(Tabelle2[[#This Row],[Business as usual]]-Tabelle2[[#This Row],[Healthy City]])>Tabelle2[[#This Row],[p-Wert (Präferenz)]],1,IF(AND(ABS(Tabelle2[[#This Row],[Business as usual]]-Tabelle2[[#This Row],[Healthy City]])<=Tabelle2[[#This Row],[p-Wert (Präferenz)]],ABS(Tabelle2[[#This Row],[Business as usual]]-Tabelle2[[#This Row],[Healthy City]])>=Tabelle2[[#This Row],[q-Wert (Indifferenz)]]),((ABS(Tabelle2[[#This Row],[Business as usual]]-Tabelle2[[#This Row],[Healthy City]])-Tabelle2[[#This Row],[q-Wert (Indifferenz)]])/(Tabelle2[[#This Row],[p-Wert (Präferenz)]]-Tabelle2[[#This Row],[q-Wert (Indifferenz)]])))))),IF(Tabelle2[[#This Row],[Business as usual]]-Tabelle2[[#This Row],[Healthy City]]<0,-1*IF(ABS(Tabelle2[[#This Row],[Business as usual]]-Tabelle2[[#This Row],[Healthy City]])<Tabelle2[[#This Row],[q-Wert (Indifferenz)]], 0,IF(ABS(Tabelle2[[#This Row],[Business as usual]]-Tabelle2[[#This Row],[Healthy City]])>Tabelle2[[#This Row],[p-Wert (Präferenz)]],1,IF(AND(ABS(Tabelle2[[#This Row],[Business as usual]]-Tabelle2[[#This Row],[Healthy City]])<=Tabelle2[[#This Row],[p-Wert (Präferenz)]],ABS(Tabelle2[[#This Row],[Business as usual]]-Tabelle2[[#This Row],[Healthy City]])>=Tabelle2[[#This Row],[q-Wert (Indifferenz)]]),((ABS(Tabelle2[[#This Row],[Business as usual]]-Tabelle2[[#This Row],[Healthy City]])-Tabelle2[[#This Row],[q-Wert (Indifferenz)]])/(Tabelle2[[#This Row],[p-Wert (Präferenz)]]-Tabelle2[[#This Row],[q-Wert (Indifferenz)]]))))),IF(ABS(Tabelle2[[#This Row],[Business as usual]]-Tabelle2[[#This Row],[Healthy City]])<Tabelle2[[#This Row],[q-Wert (Indifferenz)]], 0,IF(ABS(Tabelle2[[#This Row],[Business as usual]]-Tabelle2[[#This Row],[Healthy City]])>Tabelle2[[#This Row],[p-Wert (Präferenz)]],1,IF(AND(ABS(Tabelle2[[#This Row],[Business as usual]]-Tabelle2[[#This Row],[Healthy City]])<=Tabelle2[[#This Row],[p-Wert (Präferenz)]],ABS(Tabelle2[[#This Row],[Business as usual]]-Tabelle2[[#This Row],[Healthy City]])>=Tabelle2[[#This Row],[q-Wert (Indifferenz)]]),((ABS(Tabelle2[[#This Row],[Business as usual]]-Tabelle2[[#This Row],[Healthy City]])-Tabelle2[[#This Row],[q-Wert (Indifferenz)]])/(Tabelle2[[#This Row],[p-Wert (Präferenz)]]-Tabelle2[[#This Row],[q-Wert (Indifferenz)]])))))))","v":-0.15723270440251572},{"$f":"IF(Tabelle2[[#This Row],[min/max]]=\"min\",-1*IF(Tabelle2[[#This Row],[Business as usual]]-Tabelle2[[#This Row],[Urban Sprawl]]<0,-1*IF(ABS(Tabelle2[[#This Row],[Business as usual]]-Tabelle2[[#This Row],[Urban Sprawl]])<Tabelle2[[#This Row],[q-Wert (Indifferenz)]], 0,IF(ABS(Tabelle2[[#This Row],[Business as usual]]-Tabelle2[[#This Row],[Urban Sprawl]])>Tabelle2[[#This Row],[p-Wert (Präferenz)]],1,IF(AND(ABS(Tabelle2[[#This Row],[Business as usual]]-Tabelle2[[#This Row],[Urban Sprawl]])<=Tabelle2[[#This Row],[p-Wert (Präferenz)]],ABS(Tabelle2[[#This Row],[Business as usual]]-Tabelle2[[#This Row],[Urban Sprawl]])>=Tabelle2[[#This Row],[q-Wert (Indifferenz)]]),((ABS(Tabelle2[[#This Row],[Business as usual]]-Tabelle2[[#This Row],[Urban Sprawl]])-Tabelle2[[#This Row],[q-Wert (Indifferenz)]])/(Tabelle2[[#This Row],[p-Wert (Präferenz)]]-Tabelle2[[#This Row],[q-Wert (Indifferenz)]]))))),IF(ABS(Tabelle2[[#This Row],[Business as usual]]-Tabelle2[[#This Row],[Urban Sprawl]])<Tabelle2[[#This Row],[q-Wert (Indifferenz)]], 0,IF(ABS(Tabelle2[[#This Row],[Business as usual]]-Tabelle2[[#This Row],[Urban Sprawl]])>Tabelle2[[#This Row],[p-Wert (Präferenz)]],1,IF(AND(ABS(Tabelle2[[#This Row],[Business as usual]]-Tabelle2[[#This Row],[Urban Sprawl]])<=Tabelle2[[#This Row],[p-Wert (Präferenz)]],ABS(Tabelle2[[#This Row],[Business as usual]]-Tabelle2[[#This Row],[Urban Sprawl]])>=Tabelle2[[#This Row],[q-Wert (Indifferenz)]]),((ABS(Tabelle2[[#This Row],[Business as usual]]-Tabelle2[[#This Row],[Urban Sprawl]])-Tabelle2[[#This Row],[q-Wert (Indifferenz)]])/(Tabelle2[[#This Row],[p-Wert (Präferenz)]]-Tabelle2[[#This Row],[q-Wert (Indifferenz)]])))))),IF(Tabelle2[[#This Row],[Business as usual]]-Tabelle2[[#This Row],[Urban Sprawl]]<0,-1*IF(ABS(Tabelle2[[#This Row],[Business as usual]]-Tabelle2[[#This Row],[Urban Sprawl]])<Tabelle2[[#This Row],[q-Wert (Indifferenz)]], 0,IF(ABS(Tabelle2[[#This Row],[Business as usual]]-Tabelle2[[#This Row],[Urban Sprawl]])>Tabelle2[[#This Row],[p-Wert (Präferenz)]],1,IF(AND(ABS(Tabelle2[[#This Row],[Business as usual]]-Tabelle2[[#This Row],[Urban Sprawl]])<=Tabelle2[[#This Row],[p-Wert (Präferenz)]],ABS(Tabelle2[[#This Row],[Business as usual]]-Tabelle2[[#This Row],[Urban Sprawl]])>=Tabelle2[[#This Row],[q-Wert (Indifferenz)]]),((ABS(Tabelle2[[#This Row],[Business as usual]]-Tabelle2[[#This Row],[Urban Sprawl]])-Tabelle2[[#This Row],[q-Wert (Indifferenz)]])/(Tabelle2[[#This Row],[p-Wert (Präferenz)]]-Tabelle2[[#This Row],[q-Wert (Indifferenz)]]))))),IF(ABS(Tabelle2[[#This Row],[Business as usual]]-Tabelle2[[#This Row],[Urban Sprawl]])<Tabelle2[[#This Row],[q-Wert (Indifferenz)]], 0,IF(ABS(Tabelle2[[#This Row],[Business as usual]]-Tabelle2[[#This Row],[Urban Sprawl]])>Tabelle2[[#This Row],[p-Wert (Präferenz)]],1,IF(AND(ABS(Tabelle2[[#This Row],[Business as usual]]-Tabelle2[[#This Row],[Urban Sprawl]])<=Tabelle2[[#This Row],[p-Wert (Präferenz)]],ABS(Tabelle2[[#This Row],[Business as usual]]-Tabelle2[[#This Row],[Urban Sprawl]])>=Tabelle2[[#This Row],[q-Wert (Indifferenz)]]),((ABS(Tabelle2[[#This Row],[Business as usual]]-Tabelle2[[#This Row],[Urban Sprawl]])-Tabelle2[[#This Row],[q-Wert (Indifferenz)]])/(Tabelle2[[#This Row],[p-Wert (Präferenz)]]-Tabelle2[[#This Row],[q-Wert (Indifferenz)]])))))))","v":-0.27358490566037735}]
[null,null,null,"Industrie-/Gewerbeflächen",{"$f":"('\"Walking Weights\"'!D17)/100","v":5.5555555555555552E-2},"max","Hektar",58740,59210,61137,57000,"Typ 5",820,2418,{"$f":"IF(Tabelle2[[#This Row],[min/max]]=\"min\",-1*IF(Tabelle2[[#This Row],[Smart City]]-Tabelle2[[#This Row],[Healthy City]]<0,-1*IF(ABS(Tabelle2[[#This Row],[Smart City]]-Tabelle2[[#This Row],[Healthy City]])<Tabelle2[[#This Row],[q-Wert (Indifferenz)]], 0,IF(ABS(Tabelle2[[#This Row],[Smart City]]-Tabelle2[[#This Row],[Healthy City]])>Tabelle2[[#This Row],[p-Wert (Präferenz)]],1,IF(AND(ABS(Tabelle2[[#This Row],[Smart City]]-Tabelle2[[#This Row],[Healthy City]])<=Tabelle2[[#This Row],[p-Wert (Präferenz)]],ABS(Tabelle2[[#This Row],[Smart City]]-Tabelle2[[#This Row],[Healthy City]])>=Tabelle2[[#This Row],[q-Wert (Indifferenz)]]),((ABS(Tabelle2[[#This Row],[Smart City]]-Tabelle2[[#This Row],[Healthy City]])-Tabelle2[[#This Row],[q-Wert (Indifferenz)]])/(Tabelle2[[#This Row],[p-Wert (Präferenz)]]-Tabelle2[[#This Row],[q-Wert (Indifferenz)]]))))),IF(ABS(Tabelle2[[#This Row],[Smart City]]-Tabelle2[[#This Row],[Healthy City]])<Tabelle2[[#This Row],[q-Wert (Indifferenz)]], 0,IF(ABS(Tabelle2[[#This Row],[Smart City]]-Tabelle2[[#This Row],[Healthy City]])>Tabelle2[[#This Row],[p-Wert (Präferenz)]],1,IF(AND(ABS(Tabelle2[[#This Row],[Smart City]]-Tabelle2[[#This Row],[Healthy City]])<=Tabelle2[[#This Row],[p-Wert (Präferenz)]],ABS(Tabelle2[[#This Row],[Smart City]]-Tabelle2[[#This Row],[Healthy City]])>=Tabelle2[[#This Row],[q-Wert (Indifferenz)]]),((ABS(Tabelle2[[#This Row],[Smart City]]-Tabelle2[[#This Row],[Healthy City]])-Tabelle2[[#This Row],[q-Wert (Indifferenz)]])/(Tabelle2[[#This Row],[p-Wert (Präferenz)]]-Tabelle2[[#This Row],[q-Wert (Indifferenz)]])))))),IF(Tabelle2[[#This Row],[Smart City]]-Tabelle2[[#This Row],[Healthy City]]<0,-1*IF(ABS(Tabelle2[[#This Row],[Smart City]]-Tabelle2[[#This Row],[Healthy City]])<Tabelle2[[#This Row],[q-Wert (Indifferenz)]], 0,IF(ABS(Tabelle2[[#This Row],[Smart City]]-Tabelle2[[#This Row],[Healthy City]])>Tabelle2[[#This Row],[p-Wert (Präferenz)]],1,IF(AND(ABS(Tabelle2[[#This Row],[Smart City]]-Tabelle2[[#This Row],[Healthy City]])<=Tabelle2[[#This Row],[p-Wert (Präferenz)]],ABS(Tabelle2[[#This Row],[Smart City]]-Tabelle2[[#This Row],[Healthy City]])>=Tabelle2[[#This Row],[q-Wert (Indifferenz)]]),((ABS(Tabelle2[[#This Row],[Smart City]]-Tabelle2[[#This Row],[Healthy City]])-Tabelle2[[#This Row],[q-Wert (Indifferenz)]])/(Tabelle2[[#This Row],[p-Wert (Präferenz)]]-Tabelle2[[#This Row],[q-Wert (Indifferenz)]]))))),IF(ABS(Tabelle2[[#This Row],[Smart City]]-Tabelle2[[#This Row],[Healthy City]])<Tabelle2[[#This Row],[q-Wert (Indifferenz)]], 0,IF(ABS(Tabelle2[[#This Row],[Smart City]]-Tabelle2[[#This Row],[Healthy City]])>Tabelle2[[#This Row],[p-Wert (Präferenz)]],1,IF(AND(ABS(Tabelle2[[#This Row],[Smart City]]-Tabelle2[[#This Row],[Healthy City]])<=Tabelle2[[#This Row],[p-Wert (Präferenz)]],ABS(Tabelle2[[#This Row],[Smart City]]-Tabelle2[[#This Row],[Healthy City]])>=Tabelle2[[#This Row],[q-Wert (Indifferenz)]]),((ABS(Tabelle2[[#This Row],[Smart City]]-Tabelle2[[#This Row],[Healthy City]])-Tabelle2[[#This Row],[q-Wert (Indifferenz)]])/(Tabelle2[[#This Row],[p-Wert (Präferenz)]]-Tabelle2[[#This Row],[q-Wert (Indifferenz)]])))))))","v":0},{"$f":"IF(Tabelle2[[#This Row],[min/max]]=\"min\",-1*IF(Tabelle2[[#This Row],[Smart City]]-Tabelle2[[#This Row],[Urban Sprawl]]<0,-1*IF(ABS(Tabelle2[[#This Row],[Smart City]]-Tabelle2[[#This Row],[Urban Sprawl]])<Tabelle2[[#This Row],[q-Wert (Indifferenz)]], 0,IF(ABS(Tabelle2[[#This Row],[Smart City]]-Tabelle2[[#This Row],[Urban Sprawl]])>Tabelle2[[#This Row],[p-Wert (Präferenz)]],1,IF(AND(ABS(Tabelle2[[#This Row],[Smart City]]-Tabelle2[[#This Row],[Urban Sprawl]])<=Tabelle2[[#This Row],[p-Wert (Präferenz)]],ABS(Tabelle2[[#This Row],[Smart City]]-Tabelle2[[#This Row],[Urban Sprawl]])>=Tabelle2[[#This Row],[q-Wert (Indifferenz)]]),((ABS(Tabelle2[[#This Row],[Smart City]]-Tabelle2[[#This Row],[Urban Sprawl]])-Tabelle2[[#This Row],[q-Wert (Indifferenz)]])/(Tabelle2[[#This Row],[p-Wert (Präferenz)]]-Tabelle2[[#This Row],[q-Wert (Indifferenz)]]))))),IF(ABS(Tabelle2[[#This Row],[Smart City]]-Tabelle2[[#This Row],[Urban Sprawl]])<Tabelle2[[#This Row],[q-Wert (Indifferenz)]], 0,IF(ABS(Tabelle2[[#This Row],[Smart City]]-Tabelle2[[#This Row],[Urban Sprawl]])>Tabelle2[[#This Row],[p-Wert (Präferenz)]],1,IF(AND(ABS(Tabelle2[[#This Row],[Smart City]]-Tabelle2[[#This Row],[Urban Sprawl]])<=Tabelle2[[#This Row],[p-Wert (Präferenz)]],ABS(Tabelle2[[#This Row],[Smart City]]-Tabelle2[[#This Row],[Urban Sprawl]])>=Tabelle2[[#This Row],[q-Wert (Indifferenz)]]),((ABS(Tabelle2[[#This Row],[Smart City]]-Tabelle2[[#This Row],[Urban Sprawl]])-Tabelle2[[#This Row],[q-Wert (Indifferenz)]])/(Tabelle2[[#This Row],[p-Wert (Präferenz)]]-Tabelle2[[#This Row],[q-Wert (Indifferenz)]])))))),IF(Tabelle2[[#This Row],[Smart City]]-Tabelle2[[#This Row],[Urban Sprawl]]<0,-1*IF(ABS(Tabelle2[[#This Row],[Smart City]]-Tabelle2[[#This Row],[Urban Sprawl]])<Tabelle2[[#This Row],[q-Wert (Indifferenz)]], 0,IF(ABS(Tabelle2[[#This Row],[Smart City]]-Tabelle2[[#This Row],[Urban Sprawl]])>Tabelle2[[#This Row],[p-Wert (Präferenz)]],1,IF(AND(ABS(Tabelle2[[#This Row],[Smart City]]-Tabelle2[[#This Row],[Urban Sprawl]])<=Tabelle2[[#This Row],[p-Wert (Präferenz)]],ABS(Tabelle2[[#This Row],[Smart City]]-Tabelle2[[#This Row],[Urban Sprawl]])>=Tabelle2[[#This Row],[q-Wert (Indifferenz)]]),((ABS(Tabelle2[[#This Row],[Smart City]]-Tabelle2[[#This Row],[Urban Sprawl]])-Tabelle2[[#This Row],[q-Wert (Indifferenz)]])/(Tabelle2[[#This Row],[p-Wert (Präferenz)]]-Tabelle2[[#This Row],[q-Wert (Indifferenz)]]))))),IF(ABS(Tabelle2[[#This Row],[Smart City]]-Tabelle2[[#This Row],[Urban Sprawl]])<Tabelle2[[#This Row],[q-Wert (Indifferenz)]], 0,IF(ABS(Tabelle2[[#This Row],[Smart City]]-Tabelle2[[#This Row],[Urban Sprawl]])>Tabelle2[[#This Row],[p-Wert (Präferenz)]],1,IF(AND(ABS(Tabelle2[[#This Row],[Smart City]]-Tabelle2[[#This Row],[Urban Sprawl]])<=Tabelle2[[#This Row],[p-Wert (Präferenz)]],ABS(Tabelle2[[#This Row],[Smart City]]-Tabelle2[[#This Row],[Urban Sprawl]])>=Tabelle2[[#This Row],[q-Wert (Indifferenz)]]),((ABS(Tabelle2[[#This Row],[Smart City]]-Tabelle2[[#This Row],[Urban Sprawl]])-Tabelle2[[#This Row],[q-Wert (Indifferenz)]])/(Tabelle2[[#This Row],[p-Wert (Präferenz)]]-Tabelle2[[#This Row],[q-Wert (Indifferenz)]])))))))","v":-0.9868585732165206},{"$f":"IF(Tabelle2[[#This Row],[min/max]]=\"min\",-1*IF(Tabelle2[[#This Row],[Smart City]]-Tabelle2[[#This Row],[Business as usual]]<0,-1*IF(ABS(Tabelle2[[#This Row],[Smart City]]-Tabelle2[[#This Row],[Business as usual]])<Tabelle2[[#This Row],[q-Wert (Indifferenz)]], 0,IF(ABS(Tabelle2[[#This Row],[Smart City]]-Tabelle2[[#This Row],[Business as usual]])>Tabelle2[[#This Row],[p-Wert (Präferenz)]],1,IF(AND(ABS(Tabelle2[[#This Row],[Smart City]]-Tabelle2[[#This Row],[Business as usual]])<=Tabelle2[[#This Row],[p-Wert (Präferenz)]],ABS(Tabelle2[[#This Row],[Smart City]]-Tabelle2[[#This Row],[Business as usual]])>=Tabelle2[[#This Row],[q-Wert (Indifferenz)]]),((ABS(Tabelle2[[#This Row],[Smart City]]-Tabelle2[[#This Row],[Business as usual]])-Tabelle2[[#This Row],[q-Wert (Indifferenz)]])/(Tabelle2[[#This Row],[p-Wert (Präferenz)]]-Tabelle2[[#This Row],[q-Wert (Indifferenz)]]))))),IF(ABS(Tabelle2[[#This Row],[Smart City]]-Tabelle2[[#This Row],[Business as usual]])<Tabelle2[[#This Row],[q-Wert (Indifferenz)]], 0,IF(ABS(Tabelle2[[#This Row],[Smart City]]-Tabelle2[[#This Row],[Business as usual]])>Tabelle2[[#This Row],[p-Wert (Präferenz)]],1,IF(AND(ABS(Tabelle2[[#This Row],[Smart City]]-Tabelle2[[#This Row],[Business as usual]])<=Tabelle2[[#This Row],[p-Wert (Präferenz)]],ABS(Tabelle2[[#This Row],[Smart City]]-Tabelle2[[#This Row],[Business as usual]])>=Tabelle2[[#This Row],[q-Wert (Indifferenz)]]),((ABS(Tabelle2[[#This Row],[Smart City]]-Tabelle2[[#This Row],[Business as usual]])-Tabelle2[[#This Row],[q-Wert (Indifferenz)]])/(Tabelle2[[#This Row],[p-Wert (Präferenz)]]-Tabelle2[[#This Row],[q-Wert (Indifferenz)]])))))),IF(Tabelle2[[#This Row],[Smart City]]-Tabelle2[[#This Row],[Business as usual]]<0,-1*IF(ABS(Tabelle2[[#This Row],[Smart City]]-Tabelle2[[#This Row],[Business as usual]])<Tabelle2[[#This Row],[q-Wert (Indifferenz)]], 0,IF(ABS(Tabelle2[[#This Row],[Smart City]]-Tabelle2[[#This Row],[Business as usual]])>Tabelle2[[#This Row],[p-Wert (Präferenz)]],1,IF(AND(ABS(Tabelle2[[#This Row],[Smart City]]-Tabelle2[[#This Row],[Business as usual]])<=Tabelle2[[#This Row],[p-Wert (Präferenz)]],ABS(Tabelle2[[#This Row],[Smart City]]-Tabelle2[[#This Row],[Business as usual]])>=Tabelle2[[#This Row],[q-Wert (Indifferenz)]]),((ABS(Tabelle2[[#This Row],[Smart City]]-Tabelle2[[#This Row],[Business as usual]])-Tabelle2[[#This Row],[q-Wert (Indifferenz)]])/(Tabelle2[[#This Row],[p-Wert (Präferenz)]]-Tabelle2[[#This Row],[q-Wert (Indifferenz)]]))))),IF(ABS(Tabelle2[[#This Row],[Smart City]]-Tabelle2[[#This Row],[Business as usual]])<Tabelle2[[#This Row],[q-Wert (Indifferenz)]], 0,IF(ABS(Tabelle2[[#This Row],[Smart City]]-Tabelle2[[#This Row],[Business as usual]])>Tabelle2[[#This Row],[p-Wert (Präferenz)]],1,IF(AND(ABS(Tabelle2[[#This Row],[Smart City]]-Tabelle2[[#This Row],[Business as usual]])<=Tabelle2[[#This Row],[p-Wert (Präferenz)]],ABS(Tabelle2[[#This Row],[Smart City]]-Tabelle2[[#This Row],[Business as usual]])>=Tabelle2[[#This Row],[q-Wert (Indifferenz)]]),((ABS(Tabelle2[[#This Row],[Smart City]]-Tabelle2[[#This Row],[Business as usual]])-Tabelle2[[#This Row],[q-Wert (Indifferenz)]])/(Tabelle2[[#This Row],[p-Wert (Präferenz)]]-Tabelle2[[#This Row],[q-Wert (Indifferenz)]])))))))","v":0.57571964956195243},null,{"$f":"IF(Tabelle2[[#This Row],[min/max]]=\"min\",-1*IF(Tabelle2[[#This Row],[Healthy City]]-Tabelle2[[#This Row],[Smart City]]<0,-1*IF(ABS(Tabelle2[[#This Row],[Healthy City]]-Tabelle2[[#This Row],[Smart City]])<Tabelle2[[#This Row],[q-Wert (Indifferenz)]], 0,IF(ABS(Tabelle2[[#This Row],[Healthy City]]-Tabelle2[[#This Row],[Smart City]])>Tabelle2[[#This Row],[p-Wert (Präferenz)]],1,IF(AND(ABS(Tabelle2[[#This Row],[Healthy City]]-Tabelle2[[#This Row],[Smart City]])<=Tabelle2[[#This Row],[p-Wert (Präferenz)]],ABS(Tabelle2[[#This Row],[Healthy City]]-Tabelle2[[#This Row],[Smart City]])>=Tabelle2[[#This Row],[q-Wert (Indifferenz)]]),((ABS(Tabelle2[[#This Row],[Healthy City]]-Tabelle2[[#This Row],[Smart City]])-Tabelle2[[#This Row],[q-Wert (Indifferenz)]])/(Tabelle2[[#This Row],[p-Wert (Präferenz)]]-Tabelle2[[#This Row],[q-Wert (Indifferenz)]]))))),IF(ABS(Tabelle2[[#This Row],[Healthy City]]-Tabelle2[[#This Row],[Smart City]])<Tabelle2[[#This Row],[q-Wert (Indifferenz)]], 0,IF(ABS(Tabelle2[[#This Row],[Healthy City]]-Tabelle2[[#This Row],[Smart City]])>Tabelle2[[#This Row],[p-Wert (Präferenz)]],1,IF(AND(ABS(Tabelle2[[#This Row],[Healthy City]]-Tabelle2[[#This Row],[Smart City]])<=Tabelle2[[#This Row],[p-Wert (Präferenz)]],ABS(Tabelle2[[#This Row],[Healthy City]]-Tabelle2[[#This Row],[Smart City]])>=Tabelle2[[#This Row],[q-Wert (Indifferenz)]]),((ABS(Tabelle2[[#This Row],[Healthy City]]-Tabelle2[[#This Row],[Smart City]])-Tabelle2[[#This Row],[q-Wert (Indifferenz)]])/(Tabelle2[[#This Row],[p-Wert (Präferenz)]]-Tabelle2[[#This Row],[q-Wert (Indifferenz)]])))))),IF(Tabelle2[[#This Row],[Healthy City]]-Tabelle2[[#This Row],[Smart City]]<0,-1*IF(ABS(Tabelle2[[#This Row],[Healthy City]]-Tabelle2[[#This Row],[Smart City]])<Tabelle2[[#This Row],[q-Wert (Indifferenz)]], 0,IF(ABS(Tabelle2[[#This Row],[Healthy City]]-Tabelle2[[#This Row],[Smart City]])>Tabelle2[[#This Row],[p-Wert (Präferenz)]],1,IF(AND(ABS(Tabelle2[[#This Row],[Healthy City]]-Tabelle2[[#This Row],[Smart City]])<=Tabelle2[[#This Row],[p-Wert (Präferenz)]],ABS(Tabelle2[[#This Row],[Healthy City]]-Tabelle2[[#This Row],[Smart City]])>=Tabelle2[[#This Row],[q-Wert (Indifferenz)]]),((ABS(Tabelle2[[#This Row],[Healthy City]]-Tabelle2[[#This Row],[Smart City]])-Tabelle2[[#This Row],[q-Wert (Indifferenz)]])/(Tabelle2[[#This Row],[p-Wert (Präferenz)]]-Tabelle2[[#This Row],[q-Wert (Indifferenz)]]))))),IF(ABS(Tabelle2[[#This Row],[Healthy City]]-Tabelle2[[#This Row],[Smart City]])<Tabelle2[[#This Row],[q-Wert (Indifferenz)]], 0,IF(ABS(Tabelle2[[#This Row],[Healthy City]]-Tabelle2[[#This Row],[Smart City]])>Tabelle2[[#This Row],[p-Wert (Präferenz)]],1,IF(AND(ABS(Tabelle2[[#This Row],[Healthy City]]-Tabelle2[[#This Row],[Smart City]])<=Tabelle2[[#This Row],[p-Wert (Präferenz)]],ABS(Tabelle2[[#This Row],[Healthy City]]-Tabelle2[[#This Row],[Smart City]])>=Tabelle2[[#This Row],[q-Wert (Indifferenz)]]),((ABS(Tabelle2[[#This Row],[Healthy City]]-Tabelle2[[#This Row],[Smart City]])-Tabelle2[[#This Row],[q-Wert (Indifferenz)]])/(Tabelle2[[#This Row],[p-Wert (Präferenz)]]-Tabelle2[[#This Row],[q-Wert (Indifferenz)]])))))))","v":0},{"$f":"IF(Tabelle2[[#This Row],[min/max]]=\"min\",-1*IF(Tabelle2[[#This Row],[Healthy City]]-Tabelle2[[#This Row],[Urban Sprawl]]<0,-1*IF(ABS(Tabelle2[[#This Row],[Healthy City]]-Tabelle2[[#This Row],[Urban Sprawl]])<Tabelle2[[#This Row],[q-Wert (Indifferenz)]], 0,IF(ABS(Tabelle2[[#This Row],[Healthy City]]-Tabelle2[[#This Row],[Urban Sprawl]])>Tabelle2[[#This Row],[p-Wert (Präferenz)]],1,IF(AND(ABS(Tabelle2[[#This Row],[Healthy City]]-Tabelle2[[#This Row],[Urban Sprawl]])<=Tabelle2[[#This Row],[p-Wert (Präferenz)]],ABS(Tabelle2[[#This Row],[Healthy City]]-Tabelle2[[#This Row],[Urban Sprawl]])>=Tabelle2[[#This Row],[q-Wert (Indifferenz)]]),((ABS(Tabelle2[[#This Row],[Healthy City]]-Tabelle2[[#This Row],[Urban Sprawl]])-Tabelle2[[#This Row],[q-Wert (Indifferenz)]])/(Tabelle2[[#This Row],[p-Wert (Präferenz)]]-Tabelle2[[#This Row],[q-Wert (Indifferenz)]]))))),IF(ABS(Tabelle2[[#This Row],[Healthy City]]-Tabelle2[[#This Row],[Urban Sprawl]])<Tabelle2[[#This Row],[q-Wert (Indifferenz)]], 0,IF(ABS(Tabelle2[[#This Row],[Healthy City]]-Tabelle2[[#This Row],[Urban Sprawl]])>Tabelle2[[#This Row],[p-Wert (Präferenz)]],1,IF(AND(ABS(Tabelle2[[#This Row],[Healthy City]]-Tabelle2[[#This Row],[Urban Sprawl]])<=Tabelle2[[#This Row],[p-Wert (Präferenz)]],ABS(Tabelle2[[#This Row],[Healthy City]]-Tabelle2[[#This Row],[Urban Sprawl]])>=Tabelle2[[#This Row],[q-Wert (Indifferenz)]]),((ABS(Tabelle2[[#This Row],[Healthy City]]-Tabelle2[[#This Row],[Urban Sprawl]])-Tabelle2[[#This Row],[q-Wert (Indifferenz)]])/(Tabelle2[[#This Row],[p-Wert (Präferenz)]]-Tabelle2[[#This Row],[q-Wert (Indifferenz)]])))))),IF(Tabelle2[[#This Row],[Healthy City]]-Tabelle2[[#This Row],[Urban Sprawl]]<0,-1*IF(ABS(Tabelle2[[#This Row],[Healthy City]]-Tabelle2[[#This Row],[Urban Sprawl]])<Tabelle2[[#This Row],[q-Wert (Indifferenz)]], 0,IF(ABS(Tabelle2[[#This Row],[Healthy City]]-Tabelle2[[#This Row],[Urban Sprawl]])>Tabelle2[[#This Row],[p-Wert (Präferenz)]],1,IF(AND(ABS(Tabelle2[[#This Row],[Healthy City]]-Tabelle2[[#This Row],[Urban Sprawl]])<=Tabelle2[[#This Row],[p-Wert (Präferenz)]],ABS(Tabelle2[[#This Row],[Healthy City]]-Tabelle2[[#This Row],[Urban Sprawl]])>=Tabelle2[[#This Row],[q-Wert (Indifferenz)]]),((ABS(Tabelle2[[#This Row],[Healthy City]]-Tabelle2[[#This Row],[Urban Sprawl]])-Tabelle2[[#This Row],[q-Wert (Indifferenz)]])/(Tabelle2[[#This Row],[p-Wert (Präferenz)]]-Tabelle2[[#This Row],[q-Wert (Indifferenz)]]))))),IF(ABS(Tabelle2[[#This Row],[Healthy City]]-Tabelle2[[#This Row],[Urban Sprawl]])<Tabelle2[[#This Row],[q-Wert (Indifferenz)]], 0,IF(ABS(Tabelle2[[#This Row],[Healthy City]]-Tabelle2[[#This Row],[Urban Sprawl]])>Tabelle2[[#This Row],[p-Wert (Präferenz)]],1,IF(AND(ABS(Tabelle2[[#This Row],[Healthy City]]-Tabelle2[[#This Row],[Urban Sprawl]])<=Tabelle2[[#This Row],[p-Wert (Präferenz)]],ABS(Tabelle2[[#This Row],[Healthy City]]-Tabelle2[[#This Row],[Urban Sprawl]])>=Tabelle2[[#This Row],[q-Wert (Indifferenz)]]),((ABS(Tabelle2[[#This Row],[Healthy City]]-Tabelle2[[#This Row],[Urban Sprawl]])-Tabelle2[[#This Row],[q-Wert (Indifferenz)]])/(Tabelle2[[#This Row],[p-Wert (Präferenz)]]-Tabelle2[[#This Row],[q-Wert (Indifferenz)]])))))))","v":-0.69274092615769711},{"$f":"IF(Tabelle2[[#This Row],[min/max]]=\"min\",-1*IF(Tabelle2[[#This Row],[Healthy City]]-Tabelle2[[#This Row],[Business as usual]]<0,-1*IF(ABS(Tabelle2[[#This Row],[Healthy City]]-Tabelle2[[#This Row],[Business as usual]])<Tabelle2[[#This Row],[q-Wert (Indifferenz)]], 0,IF(ABS(Tabelle2[[#This Row],[Healthy City]]-Tabelle2[[#This Row],[Business as usual]])>Tabelle2[[#This Row],[p-Wert (Präferenz)]],1,IF(AND(ABS(Tabelle2[[#This Row],[Healthy City]]-Tabelle2[[#This Row],[Business as usual]])<=Tabelle2[[#This Row],[p-Wert (Präferenz)]],ABS(Tabelle2[[#This Row],[Healthy City]]-Tabelle2[[#This Row],[Business as usual]])>=Tabelle2[[#This Row],[q-Wert (Indifferenz)]]),((ABS(Tabelle2[[#This Row],[Healthy City]]-Tabelle2[[#This Row],[Business as usual]])-Tabelle2[[#This Row],[q-Wert (Indifferenz)]])/(Tabelle2[[#This Row],[p-Wert (Präferenz)]]-Tabelle2[[#This Row],[q-Wert (Indifferenz)]]))))),IF(ABS(Tabelle2[[#This Row],[Healthy City]]-Tabelle2[[#This Row],[Business as usual]])<Tabelle2[[#This Row],[q-Wert (Indifferenz)]], 0,IF(ABS(Tabelle2[[#This Row],[Healthy City]]-Tabelle2[[#This Row],[Business as usual]])>Tabelle2[[#This Row],[p-Wert (Präferenz)]],1,IF(AND(ABS(Tabelle2[[#This Row],[Healthy City]]-Tabelle2[[#This Row],[Business as usual]])<=Tabelle2[[#This Row],[p-Wert (Präferenz)]],ABS(Tabelle2[[#This Row],[Healthy City]]-Tabelle2[[#This Row],[Business as usual]])>=Tabelle2[[#This Row],[q-Wert (Indifferenz)]]),((ABS(Tabelle2[[#This Row],[Healthy City]]-Tabelle2[[#This Row],[Business as usual]])-Tabelle2[[#This Row],[q-Wert (Indifferenz)]])/(Tabelle2[[#This Row],[p-Wert (Präferenz)]]-Tabelle2[[#This Row],[q-Wert (Indifferenz)]])))))),IF(Tabelle2[[#This Row],[Healthy City]]-Tabelle2[[#This Row],[Business as usual]]<0,-1*IF(ABS(Tabelle2[[#This Row],[Healthy City]]-Tabelle2[[#This Row],[Business as usual]])<Tabelle2[[#This Row],[q-Wert (Indifferenz)]], 0,IF(ABS(Tabelle2[[#This Row],[Healthy City]]-Tabelle2[[#This Row],[Business as usual]])>Tabelle2[[#This Row],[p-Wert (Präferenz)]],1,IF(AND(ABS(Tabelle2[[#This Row],[Healthy City]]-Tabelle2[[#This Row],[Business as usual]])<=Tabelle2[[#This Row],[p-Wert (Präferenz)]],ABS(Tabelle2[[#This Row],[Healthy City]]-Tabelle2[[#This Row],[Business as usual]])>=Tabelle2[[#This Row],[q-Wert (Indifferenz)]]),((ABS(Tabelle2[[#This Row],[Healthy City]]-Tabelle2[[#This Row],[Business as usual]])-Tabelle2[[#This Row],[q-Wert (Indifferenz)]])/(Tabelle2[[#This Row],[p-Wert (Präferenz)]]-Tabelle2[[#This Row],[q-Wert (Indifferenz)]]))))),IF(ABS(Tabelle2[[#This Row],[Healthy City]]-Tabelle2[[#This Row],[Business as usual]])<Tabelle2[[#This Row],[q-Wert (Indifferenz)]], 0,IF(ABS(Tabelle2[[#This Row],[Healthy City]]-Tabelle2[[#This Row],[Business as usual]])>Tabelle2[[#This Row],[p-Wert (Präferenz)]],1,IF(AND(ABS(Tabelle2[[#This Row],[Healthy City]]-Tabelle2[[#This Row],[Business as usual]])<=Tabelle2[[#This Row],[p-Wert (Präferenz)]],ABS(Tabelle2[[#This Row],[Healthy City]]-Tabelle2[[#This Row],[Business as usual]])>=Tabelle2[[#This Row],[q-Wert (Indifferenz)]]),((ABS(Tabelle2[[#This Row],[Healthy City]]-Tabelle2[[#This Row],[Business as usual]])-Tabelle2[[#This Row],[q-Wert (Indifferenz)]])/(Tabelle2[[#This Row],[p-Wert (Präferenz)]]-Tabelle2[[#This Row],[q-Wert (Indifferenz)]])))))))","v":0.86983729662077602},null,{"$f":"IF(Tabelle2[[#This Row],[min/max]]=\"min\",-1*IF(Tabelle2[[#This Row],[Urban Sprawl]]-Tabelle2[[#This Row],[Smart City]]<0,-1*IF(ABS(Tabelle2[[#This Row],[Urban Sprawl]]-Tabelle2[[#This Row],[Smart City]])<Tabelle2[[#This Row],[q-Wert (Indifferenz)]], 0,IF(ABS(Tabelle2[[#This Row],[Urban Sprawl]]-Tabelle2[[#This Row],[Smart City]])>Tabelle2[[#This Row],[p-Wert (Präferenz)]],1,IF(AND(ABS(Tabelle2[[#This Row],[Urban Sprawl]]-Tabelle2[[#This Row],[Smart City]])<=Tabelle2[[#This Row],[p-Wert (Präferenz)]],ABS(Tabelle2[[#This Row],[Urban Sprawl]]-Tabelle2[[#This Row],[Smart City]])>=Tabelle2[[#This Row],[q-Wert (Indifferenz)]]),((ABS(Tabelle2[[#This Row],[Urban Sprawl]]-Tabelle2[[#This Row],[Smart City]])-Tabelle2[[#This Row],[q-Wert (Indifferenz)]])/(Tabelle2[[#This Row],[p-Wert (Präferenz)]]-Tabelle2[[#This Row],[q-Wert (Indifferenz)]]))))),IF(ABS(Tabelle2[[#This Row],[Urban Sprawl]]-Tabelle2[[#This Row],[Smart City]])<Tabelle2[[#This Row],[q-Wert (Indifferenz)]], 0,IF(ABS(Tabelle2[[#This Row],[Urban Sprawl]]-Tabelle2[[#This Row],[Smart City]])>Tabelle2[[#This Row],[p-Wert (Präferenz)]],1,IF(AND(ABS(Tabelle2[[#This Row],[Urban Sprawl]]-Tabelle2[[#This Row],[Smart City]])<=Tabelle2[[#This Row],[p-Wert (Präferenz)]],ABS(Tabelle2[[#This Row],[Urban Sprawl]]-Tabelle2[[#This Row],[Smart City]])>=Tabelle2[[#This Row],[q-Wert (Indifferenz)]]),((ABS(Tabelle2[[#This Row],[Urban Sprawl]]-Tabelle2[[#This Row],[Smart City]])-Tabelle2[[#This Row],[q-Wert (Indifferenz)]])/(Tabelle2[[#This Row],[p-Wert (Präferenz)]]-Tabelle2[[#This Row],[q-Wert (Indifferenz)]])))))),IF(Tabelle2[[#This Row],[Urban Sprawl]]-Tabelle2[[#This Row],[Smart City]]<0,-1*IF(ABS(Tabelle2[[#This Row],[Urban Sprawl]]-Tabelle2[[#This Row],[Smart City]])<Tabelle2[[#This Row],[q-Wert (Indifferenz)]], 0,IF(ABS(Tabelle2[[#This Row],[Urban Sprawl]]-Tabelle2[[#This Row],[Smart City]])>Tabelle2[[#This Row],[p-Wert (Präferenz)]],1,IF(AND(ABS(Tabelle2[[#This Row],[Urban Sprawl]]-Tabelle2[[#This Row],[Smart City]])<=Tabelle2[[#This Row],[p-Wert (Präferenz)]],ABS(Tabelle2[[#This Row],[Urban Sprawl]]-Tabelle2[[#This Row],[Smart City]])>=Tabelle2[[#This Row],[q-Wert (Indifferenz)]]),((ABS(Tabelle2[[#This Row],[Urban Sprawl]]-Tabelle2[[#This Row],[Smart City]])-Tabelle2[[#This Row],[q-Wert (Indifferenz)]])/(Tabelle2[[#This Row],[p-Wert (Präferenz)]]-Tabelle2[[#This Row],[q-Wert (Indifferenz)]]))))),IF(ABS(Tabelle2[[#This Row],[Urban Sprawl]]-Tabelle2[[#This Row],[Smart City]])<Tabelle2[[#This Row],[q-Wert (Indifferenz)]], 0,IF(ABS(Tabelle2[[#This Row],[Urban Sprawl]]-Tabelle2[[#This Row],[Smart City]])>Tabelle2[[#This Row],[p-Wert (Präferenz)]],1,IF(AND(ABS(Tabelle2[[#This Row],[Urban Sprawl]]-Tabelle2[[#This Row],[Smart City]])<=Tabelle2[[#This Row],[p-Wert (Präferenz)]],ABS(Tabelle2[[#This Row],[Urban Sprawl]]-Tabelle2[[#This Row],[Smart City]])>=Tabelle2[[#This Row],[q-Wert (Indifferenz)]]),((ABS(Tabelle2[[#This Row],[Urban Sprawl]]-Tabelle2[[#This Row],[Smart City]])-Tabelle2[[#This Row],[q-Wert (Indifferenz)]])/(Tabelle2[[#This Row],[p-Wert (Präferenz)]]-Tabelle2[[#This Row],[q-Wert (Indifferenz)]])))))))","v":0.9868585732165206},{"$f":"IF(Tabelle2[[#This Row],[min/max]]=\"min\",-1*IF(Tabelle2[[#This Row],[Urban Sprawl]]-Tabelle2[[#This Row],[Healthy City]]<0,-1*IF(ABS(Tabelle2[[#This Row],[Urban Sprawl]]-Tabelle2[[#This Row],[Healthy City]])<Tabelle2[[#This Row],[q-Wert (Indifferenz)]], 0,IF(ABS(Tabelle2[[#This Row],[Urban Sprawl]]-Tabelle2[[#This Row],[Healthy City]])>Tabelle2[[#This Row],[p-Wert (Präferenz)]],1,IF(AND(ABS(Tabelle2[[#This Row],[Urban Sprawl]]-Tabelle2[[#This Row],[Healthy City]])<=Tabelle2[[#This Row],[p-Wert (Präferenz)]],ABS(Tabelle2[[#This Row],[Urban Sprawl]]-Tabelle2[[#This Row],[Healthy City]])>=Tabelle2[[#This Row],[q-Wert (Indifferenz)]]),((ABS(Tabelle2[[#This Row],[Urban Sprawl]]-Tabelle2[[#This Row],[Healthy City]])-Tabelle2[[#This Row],[q-Wert (Indifferenz)]])/(Tabelle2[[#This Row],[p-Wert (Präferenz)]]-Tabelle2[[#This Row],[q-Wert (Indifferenz)]]))))),IF(ABS(Tabelle2[[#This Row],[Urban Sprawl]]-Tabelle2[[#This Row],[Healthy City]])<Tabelle2[[#This Row],[q-Wert (Indifferenz)]], 0,IF(ABS(Tabelle2[[#This Row],[Urban Sprawl]]-Tabelle2[[#This Row],[Healthy City]])>Tabelle2[[#This Row],[p-Wert (Präferenz)]],1,IF(AND(ABS(Tabelle2[[#This Row],[Urban Sprawl]]-Tabelle2[[#This Row],[Healthy City]])<=Tabelle2[[#This Row],[p-Wert (Präferenz)]],ABS(Tabelle2[[#This Row],[Urban Sprawl]]-Tabelle2[[#This Row],[Healthy City]])>=Tabelle2[[#This Row],[q-Wert (Indifferenz)]]),((ABS(Tabelle2[[#This Row],[Urban Sprawl]]-Tabelle2[[#This Row],[Healthy City]])-Tabelle2[[#This Row],[q-Wert (Indifferenz)]])/(Tabelle2[[#This Row],[p-Wert (Präferenz)]]-Tabelle2[[#This Row],[q-Wert (Indifferenz)]])))))),IF(Tabelle2[[#This Row],[Urban Sprawl]]-Tabelle2[[#This Row],[Healthy City]]<0,-1*IF(ABS(Tabelle2[[#This Row],[Urban Sprawl]]-Tabelle2[[#This Row],[Healthy City]])<Tabelle2[[#This Row],[q-Wert (Indifferenz)]], 0,IF(ABS(Tabelle2[[#This Row],[Urban Sprawl]]-Tabelle2[[#This Row],[Healthy City]])>Tabelle2[[#This Row],[p-Wert (Präferenz)]],1,IF(AND(ABS(Tabelle2[[#This Row],[Urban Sprawl]]-Tabelle2[[#This Row],[Healthy City]])<=Tabelle2[[#This Row],[p-Wert (Präferenz)]],ABS(Tabelle2[[#This Row],[Urban Sprawl]]-Tabelle2[[#This Row],[Healthy City]])>=Tabelle2[[#This Row],[q-Wert (Indifferenz)]]),((ABS(Tabelle2[[#This Row],[Urban Sprawl]]-Tabelle2[[#This Row],[Healthy City]])-Tabelle2[[#This Row],[q-Wert (Indifferenz)]])/(Tabelle2[[#This Row],[p-Wert (Präferenz)]]-Tabelle2[[#This Row],[q-Wert (Indifferenz)]]))))),IF(ABS(Tabelle2[[#This Row],[Urban Sprawl]]-Tabelle2[[#This Row],[Healthy City]])<Tabelle2[[#This Row],[q-Wert (Indifferenz)]], 0,IF(ABS(Tabelle2[[#This Row],[Urban Sprawl]]-Tabelle2[[#This Row],[Healthy City]])>Tabelle2[[#This Row],[p-Wert (Präferenz)]],1,IF(AND(ABS(Tabelle2[[#This Row],[Urban Sprawl]]-Tabelle2[[#This Row],[Healthy City]])<=Tabelle2[[#This Row],[p-Wert (Präferenz)]],ABS(Tabelle2[[#This Row],[Urban Sprawl]]-Tabelle2[[#This Row],[Healthy City]])>=Tabelle2[[#This Row],[q-Wert (Indifferenz)]]),((ABS(Tabelle2[[#This Row],[Urban Sprawl]]-Tabelle2[[#This Row],[Healthy City]])-Tabelle2[[#This Row],[q-Wert (Indifferenz)]])/(Tabelle2[[#This Row],[p-Wert (Präferenz)]]-Tabelle2[[#This Row],[q-Wert (Indifferenz)]])))))))","v":0.69274092615769711},{"$f":"IF(Tabelle2[[#This Row],[min/max]]=\"min\",-1*IF(Tabelle2[[#This Row],[Urban Sprawl]]-Tabelle2[[#This Row],[Business as usual]]<0,-1*IF(ABS(Tabelle2[[#This Row],[Urban Sprawl]]-Tabelle2[[#This Row],[Business as usual]])<Tabelle2[[#This Row],[q-Wert (Indifferenz)]], 0,IF(ABS(Tabelle2[[#This Row],[Urban Sprawl]]-Tabelle2[[#This Row],[Business as usual]])>Tabelle2[[#This Row],[p-Wert (Präferenz)]],1,IF(AND(ABS(Tabelle2[[#This Row],[Urban Sprawl]]-Tabelle2[[#This Row],[Business as usual]])<=Tabelle2[[#This Row],[p-Wert (Präferenz)]],ABS(Tabelle2[[#This Row],[Urban Sprawl]]-Tabelle2[[#This Row],[Business as usual]])>=Tabelle2[[#This Row],[q-Wert (Indifferenz)]]),((ABS(Tabelle2[[#This Row],[Urban Sprawl]]-Tabelle2[[#This Row],[Business as usual]])-Tabelle2[[#This Row],[q-Wert (Indifferenz)]])/(Tabelle2[[#This Row],[p-Wert (Präferenz)]]-Tabelle2[[#This Row],[q-Wert (Indifferenz)]]))))),IF(ABS(Tabelle2[[#This Row],[Urban Sprawl]]-Tabelle2[[#This Row],[Business as usual]])<Tabelle2[[#This Row],[q-Wert (Indifferenz)]], 0,IF(ABS(Tabelle2[[#This Row],[Urban Sprawl]]-Tabelle2[[#This Row],[Business as usual]])>Tabelle2[[#This Row],[p-Wert (Präferenz)]],1,IF(AND(ABS(Tabelle2[[#This Row],[Urban Sprawl]]-Tabelle2[[#This Row],[Business as usual]])<=Tabelle2[[#This Row],[p-Wert (Präferenz)]],ABS(Tabelle2[[#This Row],[Urban Sprawl]]-Tabelle2[[#This Row],[Business as usual]])>=Tabelle2[[#This Row],[q-Wert (Indifferenz)]]),((ABS(Tabelle2[[#This Row],[Urban Sprawl]]-Tabelle2[[#This Row],[Business as usual]])-Tabelle2[[#This Row],[q-Wert (Indifferenz)]])/(Tabelle2[[#This Row],[p-Wert (Präferenz)]]-Tabelle2[[#This Row],[q-Wert (Indifferenz)]])))))),IF(Tabelle2[[#This Row],[Urban Sprawl]]-Tabelle2[[#This Row],[Business as usual]]<0,-1*IF(ABS(Tabelle2[[#This Row],[Urban Sprawl]]-Tabelle2[[#This Row],[Business as usual]])<Tabelle2[[#This Row],[q-Wert (Indifferenz)]], 0,IF(ABS(Tabelle2[[#This Row],[Urban Sprawl]]-Tabelle2[[#This Row],[Business as usual]])>Tabelle2[[#This Row],[p-Wert (Präferenz)]],1,IF(AND(ABS(Tabelle2[[#This Row],[Urban Sprawl]]-Tabelle2[[#This Row],[Business as usual]])<=Tabelle2[[#This Row],[p-Wert (Präferenz)]],ABS(Tabelle2[[#This Row],[Urban Sprawl]]-Tabelle2[[#This Row],[Business as usual]])>=Tabelle2[[#This Row],[q-Wert (Indifferenz)]]),((ABS(Tabelle2[[#This Row],[Urban Sprawl]]-Tabelle2[[#This Row],[Business as usual]])-Tabelle2[[#This Row],[q-Wert (Indifferenz)]])/(Tabelle2[[#This Row],[p-Wert (Präferenz)]]-Tabelle2[[#This Row],[q-Wert (Indifferenz)]]))))),IF(ABS(Tabelle2[[#This Row],[Urban Sprawl]]-Tabelle2[[#This Row],[Business as usual]])<Tabelle2[[#This Row],[q-Wert (Indifferenz)]], 0,IF(ABS(Tabelle2[[#This Row],[Urban Sprawl]]-Tabelle2[[#This Row],[Business as usual]])>Tabelle2[[#This Row],[p-Wert (Präferenz)]],1,IF(AND(ABS(Tabelle2[[#This Row],[Urban Sprawl]]-Tabelle2[[#This Row],[Business as usual]])<=Tabelle2[[#This Row],[p-Wert (Präferenz)]],ABS(Tabelle2[[#This Row],[Urban Sprawl]]-Tabelle2[[#This Row],[Business as usual]])>=Tabelle2[[#This Row],[q-Wert (Indifferenz)]]),((ABS(Tabelle2[[#This Row],[Urban Sprawl]]-Tabelle2[[#This Row],[Business as usual]])-Tabelle2[[#This Row],[q-Wert (Indifferenz)]])/(Tabelle2[[#This Row],[p-Wert (Präferenz)]]-Tabelle2[[#This Row],[q-Wert (Indifferenz)]])))))))","v":1},null,{"$f":"IF(Tabelle2[[#This Row],[min/max]]=\"min\",-1*IF(Tabelle2[[#This Row],[Business as usual]]-Tabelle2[[#This Row],[Smart City]]<0,-1*IF(ABS(Tabelle2[[#This Row],[Business as usual]]-Tabelle2[[#This Row],[Smart City]])<Tabelle2[[#This Row],[q-Wert (Indifferenz)]], 0,IF(ABS(Tabelle2[[#This Row],[Business as usual]]-Tabelle2[[#This Row],[Smart City]])>Tabelle2[[#This Row],[p-Wert (Präferenz)]],1,IF(AND(ABS(Tabelle2[[#This Row],[Business as usual]]-Tabelle2[[#This Row],[Smart City]])<=Tabelle2[[#This Row],[p-Wert (Präferenz)]],ABS(Tabelle2[[#This Row],[Business as usual]]-Tabelle2[[#This Row],[Smart City]])>=Tabelle2[[#This Row],[q-Wert (Indifferenz)]]),((ABS(Tabelle2[[#This Row],[Business as usual]]-Tabelle2[[#This Row],[Smart City]])-Tabelle2[[#This Row],[q-Wert (Indifferenz)]])/(Tabelle2[[#This Row],[p-Wert (Präferenz)]]-Tabelle2[[#This Row],[q-Wert (Indifferenz)]]))))),IF(ABS(Tabelle2[[#This Row],[Business as usual]]-Tabelle2[[#This Row],[Smart City]])<Tabelle2[[#This Row],[q-Wert (Indifferenz)]], 0,IF(ABS(Tabelle2[[#This Row],[Business as usual]]-Tabelle2[[#This Row],[Smart City]])>Tabelle2[[#This Row],[p-Wert (Präferenz)]],1,IF(AND(ABS(Tabelle2[[#This Row],[Business as usual]]-Tabelle2[[#This Row],[Smart City]])<=Tabelle2[[#This Row],[p-Wert (Präferenz)]],ABS(Tabelle2[[#This Row],[Business as usual]]-Tabelle2[[#This Row],[Smart City]])>=Tabelle2[[#This Row],[q-Wert (Indifferenz)]]),((ABS(Tabelle2[[#This Row],[Business as usual]]-Tabelle2[[#This Row],[Smart City]])-Tabelle2[[#This Row],[q-Wert (Indifferenz)]])/(Tabelle2[[#This Row],[p-Wert (Präferenz)]]-Tabelle2[[#This Row],[q-Wert (Indifferenz)]])))))),IF(Tabelle2[[#This Row],[Business as usual]]-Tabelle2[[#This Row],[Smart City]]<0,-1*IF(ABS(Tabelle2[[#This Row],[Business as usual]]-Tabelle2[[#This Row],[Smart City]])<Tabelle2[[#This Row],[q-Wert (Indifferenz)]], 0,IF(ABS(Tabelle2[[#This Row],[Business as usual]]-Tabelle2[[#This Row],[Smart City]])>Tabelle2[[#This Row],[p-Wert (Präferenz)]],1,IF(AND(ABS(Tabelle2[[#This Row],[Business as usual]]-Tabelle2[[#This Row],[Smart City]])<=Tabelle2[[#This Row],[p-Wert (Präferenz)]],ABS(Tabelle2[[#This Row],[Business as usual]]-Tabelle2[[#This Row],[Smart City]])>=Tabelle2[[#This Row],[q-Wert (Indifferenz)]]),((ABS(Tabelle2[[#This Row],[Business as usual]]-Tabelle2[[#This Row],[Smart City]])-Tabelle2[[#This Row],[q-Wert (Indifferenz)]])/(Tabelle2[[#This Row],[p-Wert (Präferenz)]]-Tabelle2[[#This Row],[q-Wert (Indifferenz)]]))))),IF(ABS(Tabelle2[[#This Row],[Business as usual]]-Tabelle2[[#This Row],[Smart City]])<Tabelle2[[#This Row],[q-Wert (Indifferenz)]], 0,IF(ABS(Tabelle2[[#This Row],[Business as usual]]-Tabelle2[[#This Row],[Smart City]])>Tabelle2[[#This Row],[p-Wert (Präferenz)]],1,IF(AND(ABS(Tabelle2[[#This Row],[Business as usual]]-Tabelle2[[#This Row],[Smart City]])<=Tabelle2[[#This Row],[p-Wert (Präferenz)]],ABS(Tabelle2[[#This Row],[Business as usual]]-Tabelle2[[#This Row],[Smart City]])>=Tabelle2[[#This Row],[q-Wert (Indifferenz)]]),((ABS(Tabelle2[[#This Row],[Business as usual]]-Tabelle2[[#This Row],[Smart City]])-Tabelle2[[#This Row],[q-Wert (Indifferenz)]])/(Tabelle2[[#This Row],[p-Wert (Präferenz)]]-Tabelle2[[#This Row],[q-Wert (Indifferenz)]])))))))","v":-0.57571964956195243},{"$f":"IF(Tabelle2[[#This Row],[min/max]]=\"min\",-1*IF(Tabelle2[[#This Row],[Business as usual]]-Tabelle2[[#This Row],[Healthy City]]<0,-1*IF(ABS(Tabelle2[[#This Row],[Business as usual]]-Tabelle2[[#This Row],[Healthy City]])<Tabelle2[[#This Row],[q-Wert (Indifferenz)]], 0,IF(ABS(Tabelle2[[#This Row],[Business as usual]]-Tabelle2[[#This Row],[Healthy City]])>Tabelle2[[#This Row],[p-Wert (Präferenz)]],1,IF(AND(ABS(Tabelle2[[#This Row],[Business as usual]]-Tabelle2[[#This Row],[Healthy City]])<=Tabelle2[[#This Row],[p-Wert (Präferenz)]],ABS(Tabelle2[[#This Row],[Business as usual]]-Tabelle2[[#This Row],[Healthy City]])>=Tabelle2[[#This Row],[q-Wert (Indifferenz)]]),((ABS(Tabelle2[[#This Row],[Business as usual]]-Tabelle2[[#This Row],[Healthy City]])-Tabelle2[[#This Row],[q-Wert (Indifferenz)]])/(Tabelle2[[#This Row],[p-Wert (Präferenz)]]-Tabelle2[[#This Row],[q-Wert (Indifferenz)]]))))),IF(ABS(Tabelle2[[#This Row],[Business as usual]]-Tabelle2[[#This Row],[Healthy City]])<Tabelle2[[#This Row],[q-Wert (Indifferenz)]], 0,IF(ABS(Tabelle2[[#This Row],[Business as usual]]-Tabelle2[[#This Row],[Healthy City]])>Tabelle2[[#This Row],[p-Wert (Präferenz)]],1,IF(AND(ABS(Tabelle2[[#This Row],[Business as usual]]-Tabelle2[[#This Row],[Healthy City]])<=Tabelle2[[#This Row],[p-Wert (Präferenz)]],ABS(Tabelle2[[#This Row],[Business as usual]]-Tabelle2[[#This Row],[Healthy City]])>=Tabelle2[[#This Row],[q-Wert (Indifferenz)]]),((ABS(Tabelle2[[#This Row],[Business as usual]]-Tabelle2[[#This Row],[Healthy City]])-Tabelle2[[#This Row],[q-Wert (Indifferenz)]])/(Tabelle2[[#This Row],[p-Wert (Präferenz)]]-Tabelle2[[#This Row],[q-Wert (Indifferenz)]])))))),IF(Tabelle2[[#This Row],[Business as usual]]-Tabelle2[[#This Row],[Healthy City]]<0,-1*IF(ABS(Tabelle2[[#This Row],[Business as usual]]-Tabelle2[[#This Row],[Healthy City]])<Tabelle2[[#This Row],[q-Wert (Indifferenz)]], 0,IF(ABS(Tabelle2[[#This Row],[Business as usual]]-Tabelle2[[#This Row],[Healthy City]])>Tabelle2[[#This Row],[p-Wert (Präferenz)]],1,IF(AND(ABS(Tabelle2[[#This Row],[Business as usual]]-Tabelle2[[#This Row],[Healthy City]])<=Tabelle2[[#This Row],[p-Wert (Präferenz)]],ABS(Tabelle2[[#This Row],[Business as usual]]-Tabelle2[[#This Row],[Healthy City]])>=Tabelle2[[#This Row],[q-Wert (Indifferenz)]]),((ABS(Tabelle2[[#This Row],[Business as usual]]-Tabelle2[[#This Row],[Healthy City]])-Tabelle2[[#This Row],[q-Wert (Indifferenz)]])/(Tabelle2[[#This Row],[p-Wert (Präferenz)]]-Tabelle2[[#This Row],[q-Wert (Indifferenz)]]))))),IF(ABS(Tabelle2[[#This Row],[Business as usual]]-Tabelle2[[#This Row],[Healthy City]])<Tabelle2[[#This Row],[q-Wert (Indifferenz)]], 0,IF(ABS(Tabelle2[[#This Row],[Business as usual]]-Tabelle2[[#This Row],[Healthy City]])>Tabelle2[[#This Row],[p-Wert (Präferenz)]],1,IF(AND(ABS(Tabelle2[[#This Row],[Business as usual]]-Tabelle2[[#This Row],[Healthy City]])<=Tabelle2[[#This Row],[p-Wert (Präferenz)]],ABS(Tabelle2[[#This Row],[Business as usual]]-Tabelle2[[#This Row],[Healthy City]])>=Tabelle2[[#This Row],[q-Wert (Indifferenz)]]),((ABS(Tabelle2[[#This Row],[Business as usual]]-Tabelle2[[#This Row],[Healthy City]])-Tabelle2[[#This Row],[q-Wert (Indifferenz)]])/(Tabelle2[[#This Row],[p-Wert (Präferenz)]]-Tabelle2[[#This Row],[q-Wert (Indifferenz)]])))))))","v":-0.86983729662077602},{"$f":"IF(Tabelle2[[#This Row],[min/max]]=\"min\",-1*IF(Tabelle2[[#This Row],[Business as usual]]-Tabelle2[[#This Row],[Urban Sprawl]]<0,-1*IF(ABS(Tabelle2[[#This Row],[Business as usual]]-Tabelle2[[#This Row],[Urban Sprawl]])<Tabelle2[[#This Row],[q-Wert (Indifferenz)]], 0,IF(ABS(Tabelle2[[#This Row],[Business as usual]]-Tabelle2[[#This Row],[Urban Sprawl]])>Tabelle2[[#This Row],[p-Wert (Präferenz)]],1,IF(AND(ABS(Tabelle2[[#This Row],[Business as usual]]-Tabelle2[[#This Row],[Urban Sprawl]])<=Tabelle2[[#This Row],[p-Wert (Präferenz)]],ABS(Tabelle2[[#This Row],[Business as usual]]-Tabelle2[[#This Row],[Urban Sprawl]])>=Tabelle2[[#This Row],[q-Wert (Indifferenz)]]),((ABS(Tabelle2[[#This Row],[Business as usual]]-Tabelle2[[#This Row],[Urban Sprawl]])-Tabelle2[[#This Row],[q-Wert (Indifferenz)]])/(Tabelle2[[#This Row],[p-Wert (Präferenz)]]-Tabelle2[[#This Row],[q-Wert (Indifferenz)]]))))),IF(ABS(Tabelle2[[#This Row],[Business as usual]]-Tabelle2[[#This Row],[Urban Sprawl]])<Tabelle2[[#This Row],[q-Wert (Indifferenz)]], 0,IF(ABS(Tabelle2[[#This Row],[Business as usual]]-Tabelle2[[#This Row],[Urban Sprawl]])>Tabelle2[[#This Row],[p-Wert (Präferenz)]],1,IF(AND(ABS(Tabelle2[[#This Row],[Business as usual]]-Tabelle2[[#This Row],[Urban Sprawl]])<=Tabelle2[[#This Row],[p-Wert (Präferenz)]],ABS(Tabelle2[[#This Row],[Business as usual]]-Tabelle2[[#This Row],[Urban Sprawl]])>=Tabelle2[[#This Row],[q-Wert (Indifferenz)]]),((ABS(Tabelle2[[#This Row],[Business as usual]]-Tabelle2[[#This Row],[Urban Sprawl]])-Tabelle2[[#This Row],[q-Wert (Indifferenz)]])/(Tabelle2[[#This Row],[p-Wert (Präferenz)]]-Tabelle2[[#This Row],[q-Wert (Indifferenz)]])))))),IF(Tabelle2[[#This Row],[Business as usual]]-Tabelle2[[#This Row],[Urban Sprawl]]<0,-1*IF(ABS(Tabelle2[[#This Row],[Business as usual]]-Tabelle2[[#This Row],[Urban Sprawl]])<Tabelle2[[#This Row],[q-Wert (Indifferenz)]], 0,IF(ABS(Tabelle2[[#This Row],[Business as usual]]-Tabelle2[[#This Row],[Urban Sprawl]])>Tabelle2[[#This Row],[p-Wert (Präferenz)]],1,IF(AND(ABS(Tabelle2[[#This Row],[Business as usual]]-Tabelle2[[#This Row],[Urban Sprawl]])<=Tabelle2[[#This Row],[p-Wert (Präferenz)]],ABS(Tabelle2[[#This Row],[Business as usual]]-Tabelle2[[#This Row],[Urban Sprawl]])>=Tabelle2[[#This Row],[q-Wert (Indifferenz)]]),((ABS(Tabelle2[[#This Row],[Business as usual]]-Tabelle2[[#This Row],[Urban Sprawl]])-Tabelle2[[#This Row],[q-Wert (Indifferenz)]])/(Tabelle2[[#This Row],[p-Wert (Präferenz)]]-Tabelle2[[#This Row],[q-Wert (Indifferenz)]]))))),IF(ABS(Tabelle2[[#This Row],[Business as usual]]-Tabelle2[[#This Row],[Urban Sprawl]])<Tabelle2[[#This Row],[q-Wert (Indifferenz)]], 0,IF(ABS(Tabelle2[[#This Row],[Business as usual]]-Tabelle2[[#This Row],[Urban Sprawl]])>Tabelle2[[#This Row],[p-Wert (Präferenz)]],1,IF(AND(ABS(Tabelle2[[#This Row],[Business as usual]]-Tabelle2[[#This Row],[Urban Sprawl]])<=Tabelle2[[#This Row],[p-Wert (Präferenz)]],ABS(Tabelle2[[#This Row],[Business as usual]]-Tabelle2[[#This Row],[Urban Sprawl]])>=Tabelle2[[#This Row],[q-Wert (Indifferenz)]]),((ABS(Tabelle2[[#This Row],[Business as usual]]-Tabelle2[[#This Row],[Urban Sprawl]])-Tabelle2[[#This Row],[q-Wert (Indifferenz)]])/(Tabelle2[[#This Row],[p-Wert (Präferenz)]]-Tabelle2[[#This Row],[q-Wert (Indifferenz)]])))))))","v":-1}]
[null,null,null,"Beschäftigte",{"$f":"('\"Walking Weights\"'!D18)/100","v":5.5555555555555552E-2},"max","Anzahl",1469018,1434798,1466302,140000,"Typ 5",14254,37067,{"$f":"IF(Tabelle2[[#This Row],[min/max]]=\"min\",-1*IF(Tabelle2[[#This Row],[Smart City]]-Tabelle2[[#This Row],[Healthy City]]<0,-1*IF(ABS(Tabelle2[[#This Row],[Smart City]]-Tabelle2[[#This Row],[Healthy City]])<Tabelle2[[#This Row],[q-Wert (Indifferenz)]], 0,IF(ABS(Tabelle2[[#This Row],[Smart City]]-Tabelle2[[#This Row],[Healthy City]])>Tabelle2[[#This Row],[p-Wert (Präferenz)]],1,IF(AND(ABS(Tabelle2[[#This Row],[Smart City]]-Tabelle2[[#This Row],[Healthy City]])<=Tabelle2[[#This Row],[p-Wert (Präferenz)]],ABS(Tabelle2[[#This Row],[Smart City]]-Tabelle2[[#This Row],[Healthy City]])>=Tabelle2[[#This Row],[q-Wert (Indifferenz)]]),((ABS(Tabelle2[[#This Row],[Smart City]]-Tabelle2[[#This Row],[Healthy City]])-Tabelle2[[#This Row],[q-Wert (Indifferenz)]])/(Tabelle2[[#This Row],[p-Wert (Präferenz)]]-Tabelle2[[#This Row],[q-Wert (Indifferenz)]]))))),IF(ABS(Tabelle2[[#This Row],[Smart City]]-Tabelle2[[#This Row],[Healthy City]])<Tabelle2[[#This Row],[q-Wert (Indifferenz)]], 0,IF(ABS(Tabelle2[[#This Row],[Smart City]]-Tabelle2[[#This Row],[Healthy City]])>Tabelle2[[#This Row],[p-Wert (Präferenz)]],1,IF(AND(ABS(Tabelle2[[#This Row],[Smart City]]-Tabelle2[[#This Row],[Healthy City]])<=Tabelle2[[#This Row],[p-Wert (Präferenz)]],ABS(Tabelle2[[#This Row],[Smart City]]-Tabelle2[[#This Row],[Healthy City]])>=Tabelle2[[#This Row],[q-Wert (Indifferenz)]]),((ABS(Tabelle2[[#This Row],[Smart City]]-Tabelle2[[#This Row],[Healthy City]])-Tabelle2[[#This Row],[q-Wert (Indifferenz)]])/(Tabelle2[[#This Row],[p-Wert (Präferenz)]]-Tabelle2[[#This Row],[q-Wert (Indifferenz)]])))))),IF(Tabelle2[[#This Row],[Smart City]]-Tabelle2[[#This Row],[Healthy City]]<0,-1*IF(ABS(Tabelle2[[#This Row],[Smart City]]-Tabelle2[[#This Row],[Healthy City]])<Tabelle2[[#This Row],[q-Wert (Indifferenz)]], 0,IF(ABS(Tabelle2[[#This Row],[Smart City]]-Tabelle2[[#This Row],[Healthy City]])>Tabelle2[[#This Row],[p-Wert (Präferenz)]],1,IF(AND(ABS(Tabelle2[[#This Row],[Smart City]]-Tabelle2[[#This Row],[Healthy City]])<=Tabelle2[[#This Row],[p-Wert (Präferenz)]],ABS(Tabelle2[[#This Row],[Smart City]]-Tabelle2[[#This Row],[Healthy City]])>=Tabelle2[[#This Row],[q-Wert (Indifferenz)]]),((ABS(Tabelle2[[#This Row],[Smart City]]-Tabelle2[[#This Row],[Healthy City]])-Tabelle2[[#This Row],[q-Wert (Indifferenz)]])/(Tabelle2[[#This Row],[p-Wert (Präferenz)]]-Tabelle2[[#This Row],[q-Wert (Indifferenz)]]))))),IF(ABS(Tabelle2[[#This Row],[Smart City]]-Tabelle2[[#This Row],[Healthy City]])<Tabelle2[[#This Row],[q-Wert (Indifferenz)]], 0,IF(ABS(Tabelle2[[#This Row],[Smart City]]-Tabelle2[[#This Row],[Healthy City]])>Tabelle2[[#This Row],[p-Wert (Präferenz)]],1,IF(AND(ABS(Tabelle2[[#This Row],[Smart City]]-Tabelle2[[#This Row],[Healthy City]])<=Tabelle2[[#This Row],[p-Wert (Präferenz)]],ABS(Tabelle2[[#This Row],[Smart City]]-Tabelle2[[#This Row],[Healthy City]])>=Tabelle2[[#This Row],[q-Wert (Indifferenz)]]),((ABS(Tabelle2[[#This Row],[Smart City]]-Tabelle2[[#This Row],[Healthy City]])-Tabelle2[[#This Row],[q-Wert (Indifferenz)]])/(Tabelle2[[#This Row],[p-Wert (Präferenz)]]-Tabelle2[[#This Row],[q-Wert (Indifferenz)]])))))))","v":0.87520273528251435},{"$f":"IF(Tabelle2[[#This Row],[min/max]]=\"min\",-1*IF(Tabelle2[[#This Row],[Smart City]]-Tabelle2[[#This Row],[Urban Sprawl]]<0,-1*IF(ABS(Tabelle2[[#This Row],[Smart City]]-Tabelle2[[#This Row],[Urban Sprawl]])<Tabelle2[[#This Row],[q-Wert (Indifferenz)]], 0,IF(ABS(Tabelle2[[#This Row],[Smart City]]-Tabelle2[[#This Row],[Urban Sprawl]])>Tabelle2[[#This Row],[p-Wert (Präferenz)]],1,IF(AND(ABS(Tabelle2[[#This Row],[Smart City]]-Tabelle2[[#This Row],[Urban Sprawl]])<=Tabelle2[[#This Row],[p-Wert (Präferenz)]],ABS(Tabelle2[[#This Row],[Smart City]]-Tabelle2[[#This Row],[Urban Sprawl]])>=Tabelle2[[#This Row],[q-Wert (Indifferenz)]]),((ABS(Tabelle2[[#This Row],[Smart City]]-Tabelle2[[#This Row],[Urban Sprawl]])-Tabelle2[[#This Row],[q-Wert (Indifferenz)]])/(Tabelle2[[#This Row],[p-Wert (Präferenz)]]-Tabelle2[[#This Row],[q-Wert (Indifferenz)]]))))),IF(ABS(Tabelle2[[#This Row],[Smart City]]-Tabelle2[[#This Row],[Urban Sprawl]])<Tabelle2[[#This Row],[q-Wert (Indifferenz)]], 0,IF(ABS(Tabelle2[[#This Row],[Smart City]]-Tabelle2[[#This Row],[Urban Sprawl]])>Tabelle2[[#This Row],[p-Wert (Präferenz)]],1,IF(AND(ABS(Tabelle2[[#This Row],[Smart City]]-Tabelle2[[#This Row],[Urban Sprawl]])<=Tabelle2[[#This Row],[p-Wert (Präferenz)]],ABS(Tabelle2[[#This Row],[Smart City]]-Tabelle2[[#This Row],[Urban Sprawl]])>=Tabelle2[[#This Row],[q-Wert (Indifferenz)]]),((ABS(Tabelle2[[#This Row],[Smart City]]-Tabelle2[[#This Row],[Urban Sprawl]])-Tabelle2[[#This Row],[q-Wert (Indifferenz)]])/(Tabelle2[[#This Row],[p-Wert (Präferenz)]]-Tabelle2[[#This Row],[q-Wert (Indifferenz)]])))))),IF(Tabelle2[[#This Row],[Smart City]]-Tabelle2[[#This Row],[Urban Sprawl]]<0,-1*IF(ABS(Tabelle2[[#This Row],[Smart City]]-Tabelle2[[#This Row],[Urban Sprawl]])<Tabelle2[[#This Row],[q-Wert (Indifferenz)]], 0,IF(ABS(Tabelle2[[#This Row],[Smart City]]-Tabelle2[[#This Row],[Urban Sprawl]])>Tabelle2[[#This Row],[p-Wert (Präferenz)]],1,IF(AND(ABS(Tabelle2[[#This Row],[Smart City]]-Tabelle2[[#This Row],[Urban Sprawl]])<=Tabelle2[[#This Row],[p-Wert (Präferenz)]],ABS(Tabelle2[[#This Row],[Smart City]]-Tabelle2[[#This Row],[Urban Sprawl]])>=Tabelle2[[#This Row],[q-Wert (Indifferenz)]]),((ABS(Tabelle2[[#This Row],[Smart City]]-Tabelle2[[#This Row],[Urban Sprawl]])-Tabelle2[[#This Row],[q-Wert (Indifferenz)]])/(Tabelle2[[#This Row],[p-Wert (Präferenz)]]-Tabelle2[[#This Row],[q-Wert (Indifferenz)]]))))),IF(ABS(Tabelle2[[#This Row],[Smart City]]-Tabelle2[[#This Row],[Urban Sprawl]])<Tabelle2[[#This Row],[q-Wert (Indifferenz)]], 0,IF(ABS(Tabelle2[[#This Row],[Smart City]]-Tabelle2[[#This Row],[Urban Sprawl]])>Tabelle2[[#This Row],[p-Wert (Präferenz)]],1,IF(AND(ABS(Tabelle2[[#This Row],[Smart City]]-Tabelle2[[#This Row],[Urban Sprawl]])<=Tabelle2[[#This Row],[p-Wert (Präferenz)]],ABS(Tabelle2[[#This Row],[Smart City]]-Tabelle2[[#This Row],[Urban Sprawl]])>=Tabelle2[[#This Row],[q-Wert (Indifferenz)]]),((ABS(Tabelle2[[#This Row],[Smart City]]-Tabelle2[[#This Row],[Urban Sprawl]])-Tabelle2[[#This Row],[q-Wert (Indifferenz)]])/(Tabelle2[[#This Row],[p-Wert (Präferenz)]]-Tabelle2[[#This Row],[q-Wert (Indifferenz)]])))))))","v":0},{"$f":"IF(Tabelle2[[#This Row],[min/max]]=\"min\",-1*IF(Tabelle2[[#This Row],[Smart City]]-Tabelle2[[#This Row],[Business as usual]]<0,-1*IF(ABS(Tabelle2[[#This Row],[Smart City]]-Tabelle2[[#This Row],[Business as usual]])<Tabelle2[[#This Row],[q-Wert (Indifferenz)]], 0,IF(ABS(Tabelle2[[#This Row],[Smart City]]-Tabelle2[[#This Row],[Business as usual]])>Tabelle2[[#This Row],[p-Wert (Präferenz)]],1,IF(AND(ABS(Tabelle2[[#This Row],[Smart City]]-Tabelle2[[#This Row],[Business as usual]])<=Tabelle2[[#This Row],[p-Wert (Präferenz)]],ABS(Tabelle2[[#This Row],[Smart City]]-Tabelle2[[#This Row],[Business as usual]])>=Tabelle2[[#This Row],[q-Wert (Indifferenz)]]),((ABS(Tabelle2[[#This Row],[Smart City]]-Tabelle2[[#This Row],[Business as usual]])-Tabelle2[[#This Row],[q-Wert (Indifferenz)]])/(Tabelle2[[#This Row],[p-Wert (Präferenz)]]-Tabelle2[[#This Row],[q-Wert (Indifferenz)]]))))),IF(ABS(Tabelle2[[#This Row],[Smart City]]-Tabelle2[[#This Row],[Business as usual]])<Tabelle2[[#This Row],[q-Wert (Indifferenz)]], 0,IF(ABS(Tabelle2[[#This Row],[Smart City]]-Tabelle2[[#This Row],[Business as usual]])>Tabelle2[[#This Row],[p-Wert (Präferenz)]],1,IF(AND(ABS(Tabelle2[[#This Row],[Smart City]]-Tabelle2[[#This Row],[Business as usual]])<=Tabelle2[[#This Row],[p-Wert (Präferenz)]],ABS(Tabelle2[[#This Row],[Smart City]]-Tabelle2[[#This Row],[Business as usual]])>=Tabelle2[[#This Row],[q-Wert (Indifferenz)]]),((ABS(Tabelle2[[#This Row],[Smart City]]-Tabelle2[[#This Row],[Business as usual]])-Tabelle2[[#This Row],[q-Wert (Indifferenz)]])/(Tabelle2[[#This Row],[p-Wert (Präferenz)]]-Tabelle2[[#This Row],[q-Wert (Indifferenz)]])))))),IF(Tabelle2[[#This Row],[Smart City]]-Tabelle2[[#This Row],[Business as usual]]<0,-1*IF(ABS(Tabelle2[[#This Row],[Smart City]]-Tabelle2[[#This Row],[Business as usual]])<Tabelle2[[#This Row],[q-Wert (Indifferenz)]], 0,IF(ABS(Tabelle2[[#This Row],[Smart City]]-Tabelle2[[#This Row],[Business as usual]])>Tabelle2[[#This Row],[p-Wert (Präferenz)]],1,IF(AND(ABS(Tabelle2[[#This Row],[Smart City]]-Tabelle2[[#This Row],[Business as usual]])<=Tabelle2[[#This Row],[p-Wert (Präferenz)]],ABS(Tabelle2[[#This Row],[Smart City]]-Tabelle2[[#This Row],[Business as usual]])>=Tabelle2[[#This Row],[q-Wert (Indifferenz)]]),((ABS(Tabelle2[[#This Row],[Smart City]]-Tabelle2[[#This Row],[Business as usual]])-Tabelle2[[#This Row],[q-Wert (Indifferenz)]])/(Tabelle2[[#This Row],[p-Wert (Präferenz)]]-Tabelle2[[#This Row],[q-Wert (Indifferenz)]]))))),IF(ABS(Tabelle2[[#This Row],[Smart City]]-Tabelle2[[#This Row],[Business as usual]])<Tabelle2[[#This Row],[q-Wert (Indifferenz)]], 0,IF(ABS(Tabelle2[[#This Row],[Smart City]]-Tabelle2[[#This Row],[Business as usual]])>Tabelle2[[#This Row],[p-Wert (Präferenz)]],1,IF(AND(ABS(Tabelle2[[#This Row],[Smart City]]-Tabelle2[[#This Row],[Business as usual]])<=Tabelle2[[#This Row],[p-Wert (Präferenz)]],ABS(Tabelle2[[#This Row],[Smart City]]-Tabelle2[[#This Row],[Business as usual]])>=Tabelle2[[#This Row],[q-Wert (Indifferenz)]]),((ABS(Tabelle2[[#This Row],[Smart City]]-Tabelle2[[#This Row],[Business as usual]])-Tabelle2[[#This Row],[q-Wert (Indifferenz)]])/(Tabelle2[[#This Row],[p-Wert (Präferenz)]]-Tabelle2[[#This Row],[q-Wert (Indifferenz)]])))))))","v":1},null,{"$f":"IF(Tabelle2[[#This Row],[min/max]]=\"min\",-1*IF(Tabelle2[[#This Row],[Healthy City]]-Tabelle2[[#This Row],[Smart City]]<0,-1*IF(ABS(Tabelle2[[#This Row],[Healthy City]]-Tabelle2[[#This Row],[Smart City]])<Tabelle2[[#This Row],[q-Wert (Indifferenz)]], 0,IF(ABS(Tabelle2[[#This Row],[Healthy City]]-Tabelle2[[#This Row],[Smart City]])>Tabelle2[[#This Row],[p-Wert (Präferenz)]],1,IF(AND(ABS(Tabelle2[[#This Row],[Healthy City]]-Tabelle2[[#This Row],[Smart City]])<=Tabelle2[[#This Row],[p-Wert (Präferenz)]],ABS(Tabelle2[[#This Row],[Healthy City]]-Tabelle2[[#This Row],[Smart City]])>=Tabelle2[[#This Row],[q-Wert (Indifferenz)]]),((ABS(Tabelle2[[#This Row],[Healthy City]]-Tabelle2[[#This Row],[Smart City]])-Tabelle2[[#This Row],[q-Wert (Indifferenz)]])/(Tabelle2[[#This Row],[p-Wert (Präferenz)]]-Tabelle2[[#This Row],[q-Wert (Indifferenz)]]))))),IF(ABS(Tabelle2[[#This Row],[Healthy City]]-Tabelle2[[#This Row],[Smart City]])<Tabelle2[[#This Row],[q-Wert (Indifferenz)]], 0,IF(ABS(Tabelle2[[#This Row],[Healthy City]]-Tabelle2[[#This Row],[Smart City]])>Tabelle2[[#This Row],[p-Wert (Präferenz)]],1,IF(AND(ABS(Tabelle2[[#This Row],[Healthy City]]-Tabelle2[[#This Row],[Smart City]])<=Tabelle2[[#This Row],[p-Wert (Präferenz)]],ABS(Tabelle2[[#This Row],[Healthy City]]-Tabelle2[[#This Row],[Smart City]])>=Tabelle2[[#This Row],[q-Wert (Indifferenz)]]),((ABS(Tabelle2[[#This Row],[Healthy City]]-Tabelle2[[#This Row],[Smart City]])-Tabelle2[[#This Row],[q-Wert (Indifferenz)]])/(Tabelle2[[#This Row],[p-Wert (Präferenz)]]-Tabelle2[[#This Row],[q-Wert (Indifferenz)]])))))),IF(Tabelle2[[#This Row],[Healthy City]]-Tabelle2[[#This Row],[Smart City]]<0,-1*IF(ABS(Tabelle2[[#This Row],[Healthy City]]-Tabelle2[[#This Row],[Smart City]])<Tabelle2[[#This Row],[q-Wert (Indifferenz)]], 0,IF(ABS(Tabelle2[[#This Row],[Healthy City]]-Tabelle2[[#This Row],[Smart City]])>Tabelle2[[#This Row],[p-Wert (Präferenz)]],1,IF(AND(ABS(Tabelle2[[#This Row],[Healthy City]]-Tabelle2[[#This Row],[Smart City]])<=Tabelle2[[#This Row],[p-Wert (Präferenz)]],ABS(Tabelle2[[#This Row],[Healthy City]]-Tabelle2[[#This Row],[Smart City]])>=Tabelle2[[#This Row],[q-Wert (Indifferenz)]]),((ABS(Tabelle2[[#This Row],[Healthy City]]-Tabelle2[[#This Row],[Smart City]])-Tabelle2[[#This Row],[q-Wert (Indifferenz)]])/(Tabelle2[[#This Row],[p-Wert (Präferenz)]]-Tabelle2[[#This Row],[q-Wert (Indifferenz)]]))))),IF(ABS(Tabelle2[[#This Row],[Healthy City]]-Tabelle2[[#This Row],[Smart City]])<Tabelle2[[#This Row],[q-Wert (Indifferenz)]], 0,IF(ABS(Tabelle2[[#This Row],[Healthy City]]-Tabelle2[[#This Row],[Smart City]])>Tabelle2[[#This Row],[p-Wert (Präferenz)]],1,IF(AND(ABS(Tabelle2[[#This Row],[Healthy City]]-Tabelle2[[#This Row],[Smart City]])<=Tabelle2[[#This Row],[p-Wert (Präferenz)]],ABS(Tabelle2[[#This Row],[Healthy City]]-Tabelle2[[#This Row],[Smart City]])>=Tabelle2[[#This Row],[q-Wert (Indifferenz)]]),((ABS(Tabelle2[[#This Row],[Healthy City]]-Tabelle2[[#This Row],[Smart City]])-Tabelle2[[#This Row],[q-Wert (Indifferenz)]])/(Tabelle2[[#This Row],[p-Wert (Präferenz)]]-Tabelle2[[#This Row],[q-Wert (Indifferenz)]])))))))","v":-0.87520273528251435},{"$f":"IF(Tabelle2[[#This Row],[min/max]]=\"min\",-1*IF(Tabelle2[[#This Row],[Healthy City]]-Tabelle2[[#This Row],[Urban Sprawl]]<0,-1*IF(ABS(Tabelle2[[#This Row],[Healthy City]]-Tabelle2[[#This Row],[Urban Sprawl]])<Tabelle2[[#This Row],[q-Wert (Indifferenz)]], 0,IF(ABS(Tabelle2[[#This Row],[Healthy City]]-Tabelle2[[#This Row],[Urban Sprawl]])>Tabelle2[[#This Row],[p-Wert (Präferenz)]],1,IF(AND(ABS(Tabelle2[[#This Row],[Healthy City]]-Tabelle2[[#This Row],[Urban Sprawl]])<=Tabelle2[[#This Row],[p-Wert (Präferenz)]],ABS(Tabelle2[[#This Row],[Healthy City]]-Tabelle2[[#This Row],[Urban Sprawl]])>=Tabelle2[[#This Row],[q-Wert (Indifferenz)]]),((ABS(Tabelle2[[#This Row],[Healthy City]]-Tabelle2[[#This Row],[Urban Sprawl]])-Tabelle2[[#This Row],[q-Wert (Indifferenz)]])/(Tabelle2[[#This Row],[p-Wert (Präferenz)]]-Tabelle2[[#This Row],[q-Wert (Indifferenz)]]))))),IF(ABS(Tabelle2[[#This Row],[Healthy City]]-Tabelle2[[#This Row],[Urban Sprawl]])<Tabelle2[[#This Row],[q-Wert (Indifferenz)]], 0,IF(ABS(Tabelle2[[#This Row],[Healthy City]]-Tabelle2[[#This Row],[Urban Sprawl]])>Tabelle2[[#This Row],[p-Wert (Präferenz)]],1,IF(AND(ABS(Tabelle2[[#This Row],[Healthy City]]-Tabelle2[[#This Row],[Urban Sprawl]])<=Tabelle2[[#This Row],[p-Wert (Präferenz)]],ABS(Tabelle2[[#This Row],[Healthy City]]-Tabelle2[[#This Row],[Urban Sprawl]])>=Tabelle2[[#This Row],[q-Wert (Indifferenz)]]),((ABS(Tabelle2[[#This Row],[Healthy City]]-Tabelle2[[#This Row],[Urban Sprawl]])-Tabelle2[[#This Row],[q-Wert (Indifferenz)]])/(Tabelle2[[#This Row],[p-Wert (Präferenz)]]-Tabelle2[[#This Row],[q-Wert (Indifferenz)]])))))),IF(Tabelle2[[#This Row],[Healthy City]]-Tabelle2[[#This Row],[Urban Sprawl]]<0,-1*IF(ABS(Tabelle2[[#This Row],[Healthy City]]-Tabelle2[[#This Row],[Urban Sprawl]])<Tabelle2[[#This Row],[q-Wert (Indifferenz)]], 0,IF(ABS(Tabelle2[[#This Row],[Healthy City]]-Tabelle2[[#This Row],[Urban Sprawl]])>Tabelle2[[#This Row],[p-Wert (Präferenz)]],1,IF(AND(ABS(Tabelle2[[#This Row],[Healthy City]]-Tabelle2[[#This Row],[Urban Sprawl]])<=Tabelle2[[#This Row],[p-Wert (Präferenz)]],ABS(Tabelle2[[#This Row],[Healthy City]]-Tabelle2[[#This Row],[Urban Sprawl]])>=Tabelle2[[#This Row],[q-Wert (Indifferenz)]]),((ABS(Tabelle2[[#This Row],[Healthy City]]-Tabelle2[[#This Row],[Urban Sprawl]])-Tabelle2[[#This Row],[q-Wert (Indifferenz)]])/(Tabelle2[[#This Row],[p-Wert (Präferenz)]]-Tabelle2[[#This Row],[q-Wert (Indifferenz)]]))))),IF(ABS(Tabelle2[[#This Row],[Healthy City]]-Tabelle2[[#This Row],[Urban Sprawl]])<Tabelle2[[#This Row],[q-Wert (Indifferenz)]], 0,IF(ABS(Tabelle2[[#This Row],[Healthy City]]-Tabelle2[[#This Row],[Urban Sprawl]])>Tabelle2[[#This Row],[p-Wert (Präferenz)]],1,IF(AND(ABS(Tabelle2[[#This Row],[Healthy City]]-Tabelle2[[#This Row],[Urban Sprawl]])<=Tabelle2[[#This Row],[p-Wert (Präferenz)]],ABS(Tabelle2[[#This Row],[Healthy City]]-Tabelle2[[#This Row],[Urban Sprawl]])>=Tabelle2[[#This Row],[q-Wert (Indifferenz)]]),((ABS(Tabelle2[[#This Row],[Healthy City]]-Tabelle2[[#This Row],[Urban Sprawl]])-Tabelle2[[#This Row],[q-Wert (Indifferenz)]])/(Tabelle2[[#This Row],[p-Wert (Präferenz)]]-Tabelle2[[#This Row],[q-Wert (Indifferenz)]])))))))","v":-0.75614781045894885},{"$f":"IF(Tabelle2[[#This Row],[min/max]]=\"min\",-1*IF(Tabelle2[[#This Row],[Healthy City]]-Tabelle2[[#This Row],[Business as usual]]<0,-1*IF(ABS(Tabelle2[[#This Row],[Healthy City]]-Tabelle2[[#This Row],[Business as usual]])<Tabelle2[[#This Row],[q-Wert (Indifferenz)]], 0,IF(ABS(Tabelle2[[#This Row],[Healthy City]]-Tabelle2[[#This Row],[Business as usual]])>Tabelle2[[#This Row],[p-Wert (Präferenz)]],1,IF(AND(ABS(Tabelle2[[#This Row],[Healthy City]]-Tabelle2[[#This Row],[Business as usual]])<=Tabelle2[[#This Row],[p-Wert (Präferenz)]],ABS(Tabelle2[[#This Row],[Healthy City]]-Tabelle2[[#This Row],[Business as usual]])>=Tabelle2[[#This Row],[q-Wert (Indifferenz)]]),((ABS(Tabelle2[[#This Row],[Healthy City]]-Tabelle2[[#This Row],[Business as usual]])-Tabelle2[[#This Row],[q-Wert (Indifferenz)]])/(Tabelle2[[#This Row],[p-Wert (Präferenz)]]-Tabelle2[[#This Row],[q-Wert (Indifferenz)]]))))),IF(ABS(Tabelle2[[#This Row],[Healthy City]]-Tabelle2[[#This Row],[Business as usual]])<Tabelle2[[#This Row],[q-Wert (Indifferenz)]], 0,IF(ABS(Tabelle2[[#This Row],[Healthy City]]-Tabelle2[[#This Row],[Business as usual]])>Tabelle2[[#This Row],[p-Wert (Präferenz)]],1,IF(AND(ABS(Tabelle2[[#This Row],[Healthy City]]-Tabelle2[[#This Row],[Business as usual]])<=Tabelle2[[#This Row],[p-Wert (Präferenz)]],ABS(Tabelle2[[#This Row],[Healthy City]]-Tabelle2[[#This Row],[Business as usual]])>=Tabelle2[[#This Row],[q-Wert (Indifferenz)]]),((ABS(Tabelle2[[#This Row],[Healthy City]]-Tabelle2[[#This Row],[Business as usual]])-Tabelle2[[#This Row],[q-Wert (Indifferenz)]])/(Tabelle2[[#This Row],[p-Wert (Präferenz)]]-Tabelle2[[#This Row],[q-Wert (Indifferenz)]])))))),IF(Tabelle2[[#This Row],[Healthy City]]-Tabelle2[[#This Row],[Business as usual]]<0,-1*IF(ABS(Tabelle2[[#This Row],[Healthy City]]-Tabelle2[[#This Row],[Business as usual]])<Tabelle2[[#This Row],[q-Wert (Indifferenz)]], 0,IF(ABS(Tabelle2[[#This Row],[Healthy City]]-Tabelle2[[#This Row],[Business as usual]])>Tabelle2[[#This Row],[p-Wert (Präferenz)]],1,IF(AND(ABS(Tabelle2[[#This Row],[Healthy City]]-Tabelle2[[#This Row],[Business as usual]])<=Tabelle2[[#This Row],[p-Wert (Präferenz)]],ABS(Tabelle2[[#This Row],[Healthy City]]-Tabelle2[[#This Row],[Business as usual]])>=Tabelle2[[#This Row],[q-Wert (Indifferenz)]]),((ABS(Tabelle2[[#This Row],[Healthy City]]-Tabelle2[[#This Row],[Business as usual]])-Tabelle2[[#This Row],[q-Wert (Indifferenz)]])/(Tabelle2[[#This Row],[p-Wert (Präferenz)]]-Tabelle2[[#This Row],[q-Wert (Indifferenz)]]))))),IF(ABS(Tabelle2[[#This Row],[Healthy City]]-Tabelle2[[#This Row],[Business as usual]])<Tabelle2[[#This Row],[q-Wert (Indifferenz)]], 0,IF(ABS(Tabelle2[[#This Row],[Healthy City]]-Tabelle2[[#This Row],[Business as usual]])>Tabelle2[[#This Row],[p-Wert (Präferenz)]],1,IF(AND(ABS(Tabelle2[[#This Row],[Healthy City]]-Tabelle2[[#This Row],[Business as usual]])<=Tabelle2[[#This Row],[p-Wert (Präferenz)]],ABS(Tabelle2[[#This Row],[Healthy City]]-Tabelle2[[#This Row],[Business as usual]])>=Tabelle2[[#This Row],[q-Wert (Indifferenz)]]),((ABS(Tabelle2[[#This Row],[Healthy City]]-Tabelle2[[#This Row],[Business as usual]])-Tabelle2[[#This Row],[q-Wert (Indifferenz)]])/(Tabelle2[[#This Row],[p-Wert (Präferenz)]]-Tabelle2[[#This Row],[q-Wert (Indifferenz)]])))))))","v":1},null,{"$f":"IF(Tabelle2[[#This Row],[min/max]]=\"min\",-1*IF(Tabelle2[[#This Row],[Urban Sprawl]]-Tabelle2[[#This Row],[Smart City]]<0,-1*IF(ABS(Tabelle2[[#This Row],[Urban Sprawl]]-Tabelle2[[#This Row],[Smart City]])<Tabelle2[[#This Row],[q-Wert (Indifferenz)]], 0,IF(ABS(Tabelle2[[#This Row],[Urban Sprawl]]-Tabelle2[[#This Row],[Smart City]])>Tabelle2[[#This Row],[p-Wert (Präferenz)]],1,IF(AND(ABS(Tabelle2[[#This Row],[Urban Sprawl]]-Tabelle2[[#This Row],[Smart City]])<=Tabelle2[[#This Row],[p-Wert (Präferenz)]],ABS(Tabelle2[[#This Row],[Urban Sprawl]]-Tabelle2[[#This Row],[Smart City]])>=Tabelle2[[#This Row],[q-Wert (Indifferenz)]]),((ABS(Tabelle2[[#This Row],[Urban Sprawl]]-Tabelle2[[#This Row],[Smart City]])-Tabelle2[[#This Row],[q-Wert (Indifferenz)]])/(Tabelle2[[#This Row],[p-Wert (Präferenz)]]-Tabelle2[[#This Row],[q-Wert (Indifferenz)]]))))),IF(ABS(Tabelle2[[#This Row],[Urban Sprawl]]-Tabelle2[[#This Row],[Smart City]])<Tabelle2[[#This Row],[q-Wert (Indifferenz)]], 0,IF(ABS(Tabelle2[[#This Row],[Urban Sprawl]]-Tabelle2[[#This Row],[Smart City]])>Tabelle2[[#This Row],[p-Wert (Präferenz)]],1,IF(AND(ABS(Tabelle2[[#This Row],[Urban Sprawl]]-Tabelle2[[#This Row],[Smart City]])<=Tabelle2[[#This Row],[p-Wert (Präferenz)]],ABS(Tabelle2[[#This Row],[Urban Sprawl]]-Tabelle2[[#This Row],[Smart City]])>=Tabelle2[[#This Row],[q-Wert (Indifferenz)]]),((ABS(Tabelle2[[#This Row],[Urban Sprawl]]-Tabelle2[[#This Row],[Smart City]])-Tabelle2[[#This Row],[q-Wert (Indifferenz)]])/(Tabelle2[[#This Row],[p-Wert (Präferenz)]]-Tabelle2[[#This Row],[q-Wert (Indifferenz)]])))))),IF(Tabelle2[[#This Row],[Urban Sprawl]]-Tabelle2[[#This Row],[Smart City]]<0,-1*IF(ABS(Tabelle2[[#This Row],[Urban Sprawl]]-Tabelle2[[#This Row],[Smart City]])<Tabelle2[[#This Row],[q-Wert (Indifferenz)]], 0,IF(ABS(Tabelle2[[#This Row],[Urban Sprawl]]-Tabelle2[[#This Row],[Smart City]])>Tabelle2[[#This Row],[p-Wert (Präferenz)]],1,IF(AND(ABS(Tabelle2[[#This Row],[Urban Sprawl]]-Tabelle2[[#This Row],[Smart City]])<=Tabelle2[[#This Row],[p-Wert (Präferenz)]],ABS(Tabelle2[[#This Row],[Urban Sprawl]]-Tabelle2[[#This Row],[Smart City]])>=Tabelle2[[#This Row],[q-Wert (Indifferenz)]]),((ABS(Tabelle2[[#This Row],[Urban Sprawl]]-Tabelle2[[#This Row],[Smart City]])-Tabelle2[[#This Row],[q-Wert (Indifferenz)]])/(Tabelle2[[#This Row],[p-Wert (Präferenz)]]-Tabelle2[[#This Row],[q-Wert (Indifferenz)]]))))),IF(ABS(Tabelle2[[#This Row],[Urban Sprawl]]-Tabelle2[[#This Row],[Smart City]])<Tabelle2[[#This Row],[q-Wert (Indifferenz)]], 0,IF(ABS(Tabelle2[[#This Row],[Urban Sprawl]]-Tabelle2[[#This Row],[Smart City]])>Tabelle2[[#This Row],[p-Wert (Präferenz)]],1,IF(AND(ABS(Tabelle2[[#This Row],[Urban Sprawl]]-Tabelle2[[#This Row],[Smart City]])<=Tabelle2[[#This Row],[p-Wert (Präferenz)]],ABS(Tabelle2[[#This Row],[Urban Sprawl]]-Tabelle2[[#This Row],[Smart City]])>=Tabelle2[[#This Row],[q-Wert (Indifferenz)]]),((ABS(Tabelle2[[#This Row],[Urban Sprawl]]-Tabelle2[[#This Row],[Smart City]])-Tabelle2[[#This Row],[q-Wert (Indifferenz)]])/(Tabelle2[[#This Row],[p-Wert (Präferenz)]]-Tabelle2[[#This Row],[q-Wert (Indifferenz)]])))))))","v":0},{"$f":"IF(Tabelle2[[#This Row],[min/max]]=\"min\",-1*IF(Tabelle2[[#This Row],[Urban Sprawl]]-Tabelle2[[#This Row],[Healthy City]]<0,-1*IF(ABS(Tabelle2[[#This Row],[Urban Sprawl]]-Tabelle2[[#This Row],[Healthy City]])<Tabelle2[[#This Row],[q-Wert (Indifferenz)]], 0,IF(ABS(Tabelle2[[#This Row],[Urban Sprawl]]-Tabelle2[[#This Row],[Healthy City]])>Tabelle2[[#This Row],[p-Wert (Präferenz)]],1,IF(AND(ABS(Tabelle2[[#This Row],[Urban Sprawl]]-Tabelle2[[#This Row],[Healthy City]])<=Tabelle2[[#This Row],[p-Wert (Präferenz)]],ABS(Tabelle2[[#This Row],[Urban Sprawl]]-Tabelle2[[#This Row],[Healthy City]])>=Tabelle2[[#This Row],[q-Wert (Indifferenz)]]),((ABS(Tabelle2[[#This Row],[Urban Sprawl]]-Tabelle2[[#This Row],[Healthy City]])-Tabelle2[[#This Row],[q-Wert (Indifferenz)]])/(Tabelle2[[#This Row],[p-Wert (Präferenz)]]-Tabelle2[[#This Row],[q-Wert (Indifferenz)]]))))),IF(ABS(Tabelle2[[#This Row],[Urban Sprawl]]-Tabelle2[[#This Row],[Healthy City]])<Tabelle2[[#This Row],[q-Wert (Indifferenz)]], 0,IF(ABS(Tabelle2[[#This Row],[Urban Sprawl]]-Tabelle2[[#This Row],[Healthy City]])>Tabelle2[[#This Row],[p-Wert (Präferenz)]],1,IF(AND(ABS(Tabelle2[[#This Row],[Urban Sprawl]]-Tabelle2[[#This Row],[Healthy City]])<=Tabelle2[[#This Row],[p-Wert (Präferenz)]],ABS(Tabelle2[[#This Row],[Urban Sprawl]]-Tabelle2[[#This Row],[Healthy City]])>=Tabelle2[[#This Row],[q-Wert (Indifferenz)]]),((ABS(Tabelle2[[#This Row],[Urban Sprawl]]-Tabelle2[[#This Row],[Healthy City]])-Tabelle2[[#This Row],[q-Wert (Indifferenz)]])/(Tabelle2[[#This Row],[p-Wert (Präferenz)]]-Tabelle2[[#This Row],[q-Wert (Indifferenz)]])))))),IF(Tabelle2[[#This Row],[Urban Sprawl]]-Tabelle2[[#This Row],[Healthy City]]<0,-1*IF(ABS(Tabelle2[[#This Row],[Urban Sprawl]]-Tabelle2[[#This Row],[Healthy City]])<Tabelle2[[#This Row],[q-Wert (Indifferenz)]], 0,IF(ABS(Tabelle2[[#This Row],[Urban Sprawl]]-Tabelle2[[#This Row],[Healthy City]])>Tabelle2[[#This Row],[p-Wert (Präferenz)]],1,IF(AND(ABS(Tabelle2[[#This Row],[Urban Sprawl]]-Tabelle2[[#This Row],[Healthy City]])<=Tabelle2[[#This Row],[p-Wert (Präferenz)]],ABS(Tabelle2[[#This Row],[Urban Sprawl]]-Tabelle2[[#This Row],[Healthy City]])>=Tabelle2[[#This Row],[q-Wert (Indifferenz)]]),((ABS(Tabelle2[[#This Row],[Urban Sprawl]]-Tabelle2[[#This Row],[Healthy City]])-Tabelle2[[#This Row],[q-Wert (Indifferenz)]])/(Tabelle2[[#This Row],[p-Wert (Präferenz)]]-Tabelle2[[#This Row],[q-Wert (Indifferenz)]]))))),IF(ABS(Tabelle2[[#This Row],[Urban Sprawl]]-Tabelle2[[#This Row],[Healthy City]])<Tabelle2[[#This Row],[q-Wert (Indifferenz)]], 0,IF(ABS(Tabelle2[[#This Row],[Urban Sprawl]]-Tabelle2[[#This Row],[Healthy City]])>Tabelle2[[#This Row],[p-Wert (Präferenz)]],1,IF(AND(ABS(Tabelle2[[#This Row],[Urban Sprawl]]-Tabelle2[[#This Row],[Healthy City]])<=Tabelle2[[#This Row],[p-Wert (Präferenz)]],ABS(Tabelle2[[#This Row],[Urban Sprawl]]-Tabelle2[[#This Row],[Healthy City]])>=Tabelle2[[#This Row],[q-Wert (Indifferenz)]]),((ABS(Tabelle2[[#This Row],[Urban Sprawl]]-Tabelle2[[#This Row],[Healthy City]])-Tabelle2[[#This Row],[q-Wert (Indifferenz)]])/(Tabelle2[[#This Row],[p-Wert (Präferenz)]]-Tabelle2[[#This Row],[q-Wert (Indifferenz)]])))))))","v":0.75614781045894885},{"$f":"IF(Tabelle2[[#This Row],[min/max]]=\"min\",-1*IF(Tabelle2[[#This Row],[Urban Sprawl]]-Tabelle2[[#This Row],[Business as usual]]<0,-1*IF(ABS(Tabelle2[[#This Row],[Urban Sprawl]]-Tabelle2[[#This Row],[Business as usual]])<Tabelle2[[#This Row],[q-Wert (Indifferenz)]], 0,IF(ABS(Tabelle2[[#This Row],[Urban Sprawl]]-Tabelle2[[#This Row],[Business as usual]])>Tabelle2[[#This Row],[p-Wert (Präferenz)]],1,IF(AND(ABS(Tabelle2[[#This Row],[Urban Sprawl]]-Tabelle2[[#This Row],[Business as usual]])<=Tabelle2[[#This Row],[p-Wert (Präferenz)]],ABS(Tabelle2[[#This Row],[Urban Sprawl]]-Tabelle2[[#This Row],[Business as usual]])>=Tabelle2[[#This Row],[q-Wert (Indifferenz)]]),((ABS(Tabelle2[[#This Row],[Urban Sprawl]]-Tabelle2[[#This Row],[Business as usual]])-Tabelle2[[#This Row],[q-Wert (Indifferenz)]])/(Tabelle2[[#This Row],[p-Wert (Präferenz)]]-Tabelle2[[#This Row],[q-Wert (Indifferenz)]]))))),IF(ABS(Tabelle2[[#This Row],[Urban Sprawl]]-Tabelle2[[#This Row],[Business as usual]])<Tabelle2[[#This Row],[q-Wert (Indifferenz)]], 0,IF(ABS(Tabelle2[[#This Row],[Urban Sprawl]]-Tabelle2[[#This Row],[Business as usual]])>Tabelle2[[#This Row],[p-Wert (Präferenz)]],1,IF(AND(ABS(Tabelle2[[#This Row],[Urban Sprawl]]-Tabelle2[[#This Row],[Business as usual]])<=Tabelle2[[#This Row],[p-Wert (Präferenz)]],ABS(Tabelle2[[#This Row],[Urban Sprawl]]-Tabelle2[[#This Row],[Business as usual]])>=Tabelle2[[#This Row],[q-Wert (Indifferenz)]]),((ABS(Tabelle2[[#This Row],[Urban Sprawl]]-Tabelle2[[#This Row],[Business as usual]])-Tabelle2[[#This Row],[q-Wert (Indifferenz)]])/(Tabelle2[[#This Row],[p-Wert (Präferenz)]]-Tabelle2[[#This Row],[q-Wert (Indifferenz)]])))))),IF(Tabelle2[[#This Row],[Urban Sprawl]]-Tabelle2[[#This Row],[Business as usual]]<0,-1*IF(ABS(Tabelle2[[#This Row],[Urban Sprawl]]-Tabelle2[[#This Row],[Business as usual]])<Tabelle2[[#This Row],[q-Wert (Indifferenz)]], 0,IF(ABS(Tabelle2[[#This Row],[Urban Sprawl]]-Tabelle2[[#This Row],[Business as usual]])>Tabelle2[[#This Row],[p-Wert (Präferenz)]],1,IF(AND(ABS(Tabelle2[[#This Row],[Urban Sprawl]]-Tabelle2[[#This Row],[Business as usual]])<=Tabelle2[[#This Row],[p-Wert (Präferenz)]],ABS(Tabelle2[[#This Row],[Urban Sprawl]]-Tabelle2[[#This Row],[Business as usual]])>=Tabelle2[[#This Row],[q-Wert (Indifferenz)]]),((ABS(Tabelle2[[#This Row],[Urban Sprawl]]-Tabelle2[[#This Row],[Business as usual]])-Tabelle2[[#This Row],[q-Wert (Indifferenz)]])/(Tabelle2[[#This Row],[p-Wert (Präferenz)]]-Tabelle2[[#This Row],[q-Wert (Indifferenz)]]))))),IF(ABS(Tabelle2[[#This Row],[Urban Sprawl]]-Tabelle2[[#This Row],[Business as usual]])<Tabelle2[[#This Row],[q-Wert (Indifferenz)]], 0,IF(ABS(Tabelle2[[#This Row],[Urban Sprawl]]-Tabelle2[[#This Row],[Business as usual]])>Tabelle2[[#This Row],[p-Wert (Präferenz)]],1,IF(AND(ABS(Tabelle2[[#This Row],[Urban Sprawl]]-Tabelle2[[#This Row],[Business as usual]])<=Tabelle2[[#This Row],[p-Wert (Präferenz)]],ABS(Tabelle2[[#This Row],[Urban Sprawl]]-Tabelle2[[#This Row],[Business as usual]])>=Tabelle2[[#This Row],[q-Wert (Indifferenz)]]),((ABS(Tabelle2[[#This Row],[Urban Sprawl]]-Tabelle2[[#This Row],[Business as usual]])-Tabelle2[[#This Row],[q-Wert (Indifferenz)]])/(Tabelle2[[#This Row],[p-Wert (Präferenz)]]-Tabelle2[[#This Row],[q-Wert (Indifferenz)]])))))))","v":1},null,{"$f":"IF(Tabelle2[[#This Row],[min/max]]=\"min\",-1*IF(Tabelle2[[#This Row],[Business as usual]]-Tabelle2[[#This Row],[Smart City]]<0,-1*IF(ABS(Tabelle2[[#This Row],[Business as usual]]-Tabelle2[[#This Row],[Smart City]])<Tabelle2[[#This Row],[q-Wert (Indifferenz)]], 0,IF(ABS(Tabelle2[[#This Row],[Business as usual]]-Tabelle2[[#This Row],[Smart City]])>Tabelle2[[#This Row],[p-Wert (Präferenz)]],1,IF(AND(ABS(Tabelle2[[#This Row],[Business as usual]]-Tabelle2[[#This Row],[Smart City]])<=Tabelle2[[#This Row],[p-Wert (Präferenz)]],ABS(Tabelle2[[#This Row],[Business as usual]]-Tabelle2[[#This Row],[Smart City]])>=Tabelle2[[#This Row],[q-Wert (Indifferenz)]]),((ABS(Tabelle2[[#This Row],[Business as usual]]-Tabelle2[[#This Row],[Smart City]])-Tabelle2[[#This Row],[q-Wert (Indifferenz)]])/(Tabelle2[[#This Row],[p-Wert (Präferenz)]]-Tabelle2[[#This Row],[q-Wert (Indifferenz)]]))))),IF(ABS(Tabelle2[[#This Row],[Business as usual]]-Tabelle2[[#This Row],[Smart City]])<Tabelle2[[#This Row],[q-Wert (Indifferenz)]], 0,IF(ABS(Tabelle2[[#This Row],[Business as usual]]-Tabelle2[[#This Row],[Smart City]])>Tabelle2[[#This Row],[p-Wert (Präferenz)]],1,IF(AND(ABS(Tabelle2[[#This Row],[Business as usual]]-Tabelle2[[#This Row],[Smart City]])<=Tabelle2[[#This Row],[p-Wert (Präferenz)]],ABS(Tabelle2[[#This Row],[Business as usual]]-Tabelle2[[#This Row],[Smart City]])>=Tabelle2[[#This Row],[q-Wert (Indifferenz)]]),((ABS(Tabelle2[[#This Row],[Business as usual]]-Tabelle2[[#This Row],[Smart City]])-Tabelle2[[#This Row],[q-Wert (Indifferenz)]])/(Tabelle2[[#This Row],[p-Wert (Präferenz)]]-Tabelle2[[#This Row],[q-Wert (Indifferenz)]])))))),IF(Tabelle2[[#This Row],[Business as usual]]-Tabelle2[[#This Row],[Smart City]]<0,-1*IF(ABS(Tabelle2[[#This Row],[Business as usual]]-Tabelle2[[#This Row],[Smart City]])<Tabelle2[[#This Row],[q-Wert (Indifferenz)]], 0,IF(ABS(Tabelle2[[#This Row],[Business as usual]]-Tabelle2[[#This Row],[Smart City]])>Tabelle2[[#This Row],[p-Wert (Präferenz)]],1,IF(AND(ABS(Tabelle2[[#This Row],[Business as usual]]-Tabelle2[[#This Row],[Smart City]])<=Tabelle2[[#This Row],[p-Wert (Präferenz)]],ABS(Tabelle2[[#This Row],[Business as usual]]-Tabelle2[[#This Row],[Smart City]])>=Tabelle2[[#This Row],[q-Wert (Indifferenz)]]),((ABS(Tabelle2[[#This Row],[Business as usual]]-Tabelle2[[#This Row],[Smart City]])-Tabelle2[[#This Row],[q-Wert (Indifferenz)]])/(Tabelle2[[#This Row],[p-Wert (Präferenz)]]-Tabelle2[[#This Row],[q-Wert (Indifferenz)]]))))),IF(ABS(Tabelle2[[#This Row],[Business as usual]]-Tabelle2[[#This Row],[Smart City]])<Tabelle2[[#This Row],[q-Wert (Indifferenz)]], 0,IF(ABS(Tabelle2[[#This Row],[Business as usual]]-Tabelle2[[#This Row],[Smart City]])>Tabelle2[[#This Row],[p-Wert (Präferenz)]],1,IF(AND(ABS(Tabelle2[[#This Row],[Business as usual]]-Tabelle2[[#This Row],[Smart City]])<=Tabelle2[[#This Row],[p-Wert (Präferenz)]],ABS(Tabelle2[[#This Row],[Business as usual]]-Tabelle2[[#This Row],[Smart City]])>=Tabelle2[[#This Row],[q-Wert (Indifferenz)]]),((ABS(Tabelle2[[#This Row],[Business as usual]]-Tabelle2[[#This Row],[Smart City]])-Tabelle2[[#This Row],[q-Wert (Indifferenz)]])/(Tabelle2[[#This Row],[p-Wert (Präferenz)]]-Tabelle2[[#This Row],[q-Wert (Indifferenz)]])))))))","v":-1},{"$f":"IF(Tabelle2[[#This Row],[min/max]]=\"min\",-1*IF(Tabelle2[[#This Row],[Business as usual]]-Tabelle2[[#This Row],[Healthy City]]<0,-1*IF(ABS(Tabelle2[[#This Row],[Business as usual]]-Tabelle2[[#This Row],[Healthy City]])<Tabelle2[[#This Row],[q-Wert (Indifferenz)]], 0,IF(ABS(Tabelle2[[#This Row],[Business as usual]]-Tabelle2[[#This Row],[Healthy City]])>Tabelle2[[#This Row],[p-Wert (Präferenz)]],1,IF(AND(ABS(Tabelle2[[#This Row],[Business as usual]]-Tabelle2[[#This Row],[Healthy City]])<=Tabelle2[[#This Row],[p-Wert (Präferenz)]],ABS(Tabelle2[[#This Row],[Business as usual]]-Tabelle2[[#This Row],[Healthy City]])>=Tabelle2[[#This Row],[q-Wert (Indifferenz)]]),((ABS(Tabelle2[[#This Row],[Business as usual]]-Tabelle2[[#This Row],[Healthy City]])-Tabelle2[[#This Row],[q-Wert (Indifferenz)]])/(Tabelle2[[#This Row],[p-Wert (Präferenz)]]-Tabelle2[[#This Row],[q-Wert (Indifferenz)]]))))),IF(ABS(Tabelle2[[#This Row],[Business as usual]]-Tabelle2[[#This Row],[Healthy City]])<Tabelle2[[#This Row],[q-Wert (Indifferenz)]], 0,IF(ABS(Tabelle2[[#This Row],[Business as usual]]-Tabelle2[[#This Row],[Healthy City]])>Tabelle2[[#This Row],[p-Wert (Präferenz)]],1,IF(AND(ABS(Tabelle2[[#This Row],[Business as usual]]-Tabelle2[[#This Row],[Healthy City]])<=Tabelle2[[#This Row],[p-Wert (Präferenz)]],ABS(Tabelle2[[#This Row],[Business as usual]]-Tabelle2[[#This Row],[Healthy City]])>=Tabelle2[[#This Row],[q-Wert (Indifferenz)]]),((ABS(Tabelle2[[#This Row],[Business as usual]]-Tabelle2[[#This Row],[Healthy City]])-Tabelle2[[#This Row],[q-Wert (Indifferenz)]])/(Tabelle2[[#This Row],[p-Wert (Präferenz)]]-Tabelle2[[#This Row],[q-Wert (Indifferenz)]])))))),IF(Tabelle2[[#This Row],[Business as usual]]-Tabelle2[[#This Row],[Healthy City]]<0,-1*IF(ABS(Tabelle2[[#This Row],[Business as usual]]-Tabelle2[[#This Row],[Healthy City]])<Tabelle2[[#This Row],[q-Wert (Indifferenz)]], 0,IF(ABS(Tabelle2[[#This Row],[Business as usual]]-Tabelle2[[#This Row],[Healthy City]])>Tabelle2[[#This Row],[p-Wert (Präferenz)]],1,IF(AND(ABS(Tabelle2[[#This Row],[Business as usual]]-Tabelle2[[#This Row],[Healthy City]])<=Tabelle2[[#This Row],[p-Wert (Präferenz)]],ABS(Tabelle2[[#This Row],[Business as usual]]-Tabelle2[[#This Row],[Healthy City]])>=Tabelle2[[#This Row],[q-Wert (Indifferenz)]]),((ABS(Tabelle2[[#This Row],[Business as usual]]-Tabelle2[[#This Row],[Healthy City]])-Tabelle2[[#This Row],[q-Wert (Indifferenz)]])/(Tabelle2[[#This Row],[p-Wert (Präferenz)]]-Tabelle2[[#This Row],[q-Wert (Indifferenz)]]))))),IF(ABS(Tabelle2[[#This Row],[Business as usual]]-Tabelle2[[#This Row],[Healthy City]])<Tabelle2[[#This Row],[q-Wert (Indifferenz)]], 0,IF(ABS(Tabelle2[[#This Row],[Business as usual]]-Tabelle2[[#This Row],[Healthy City]])>Tabelle2[[#This Row],[p-Wert (Präferenz)]],1,IF(AND(ABS(Tabelle2[[#This Row],[Business as usual]]-Tabelle2[[#This Row],[Healthy City]])<=Tabelle2[[#This Row],[p-Wert (Präferenz)]],ABS(Tabelle2[[#This Row],[Business as usual]]-Tabelle2[[#This Row],[Healthy City]])>=Tabelle2[[#This Row],[q-Wert (Indifferenz)]]),((ABS(Tabelle2[[#This Row],[Business as usual]]-Tabelle2[[#This Row],[Healthy City]])-Tabelle2[[#This Row],[q-Wert (Indifferenz)]])/(Tabelle2[[#This Row],[p-Wert (Präferenz)]]-Tabelle2[[#This Row],[q-Wert (Indifferenz)]])))))))","v":-1},{"$f":"IF(Tabelle2[[#This Row],[min/max]]=\"min\",-1*IF(Tabelle2[[#This Row],[Business as usual]]-Tabelle2[[#This Row],[Urban Sprawl]]<0,-1*IF(ABS(Tabelle2[[#This Row],[Business as usual]]-Tabelle2[[#This Row],[Urban Sprawl]])<Tabelle2[[#This Row],[q-Wert (Indifferenz)]], 0,IF(ABS(Tabelle2[[#This Row],[Business as usual]]-Tabelle2[[#This Row],[Urban Sprawl]])>Tabelle2[[#This Row],[p-Wert (Präferenz)]],1,IF(AND(ABS(Tabelle2[[#This Row],[Business as usual]]-Tabelle2[[#This Row],[Urban Sprawl]])<=Tabelle2[[#This Row],[p-Wert (Präferenz)]],ABS(Tabelle2[[#This Row],[Business as usual]]-Tabelle2[[#This Row],[Urban Sprawl]])>=Tabelle2[[#This Row],[q-Wert (Indifferenz)]]),((ABS(Tabelle2[[#This Row],[Business as usual]]-Tabelle2[[#This Row],[Urban Sprawl]])-Tabelle2[[#This Row],[q-Wert (Indifferenz)]])/(Tabelle2[[#This Row],[p-Wert (Präferenz)]]-Tabelle2[[#This Row],[q-Wert (Indifferenz)]]))))),IF(ABS(Tabelle2[[#This Row],[Business as usual]]-Tabelle2[[#This Row],[Urban Sprawl]])<Tabelle2[[#This Row],[q-Wert (Indifferenz)]], 0,IF(ABS(Tabelle2[[#This Row],[Business as usual]]-Tabelle2[[#This Row],[Urban Sprawl]])>Tabelle2[[#This Row],[p-Wert (Präferenz)]],1,IF(AND(ABS(Tabelle2[[#This Row],[Business as usual]]-Tabelle2[[#This Row],[Urban Sprawl]])<=Tabelle2[[#This Row],[p-Wert (Präferenz)]],ABS(Tabelle2[[#This Row],[Business as usual]]-Tabelle2[[#This Row],[Urban Sprawl]])>=Tabelle2[[#This Row],[q-Wert (Indifferenz)]]),((ABS(Tabelle2[[#This Row],[Business as usual]]-Tabelle2[[#This Row],[Urban Sprawl]])-Tabelle2[[#This Row],[q-Wert (Indifferenz)]])/(Tabelle2[[#This Row],[p-Wert (Präferenz)]]-Tabelle2[[#This Row],[q-Wert (Indifferenz)]])))))),IF(Tabelle2[[#This Row],[Business as usual]]-Tabelle2[[#This Row],[Urban Sprawl]]<0,-1*IF(ABS(Tabelle2[[#This Row],[Business as usual]]-Tabelle2[[#This Row],[Urban Sprawl]])<Tabelle2[[#This Row],[q-Wert (Indifferenz)]], 0,IF(ABS(Tabelle2[[#This Row],[Business as usual]]-Tabelle2[[#This Row],[Urban Sprawl]])>Tabelle2[[#This Row],[p-Wert (Präferenz)]],1,IF(AND(ABS(Tabelle2[[#This Row],[Business as usual]]-Tabelle2[[#This Row],[Urban Sprawl]])<=Tabelle2[[#This Row],[p-Wert (Präferenz)]],ABS(Tabelle2[[#This Row],[Business as usual]]-Tabelle2[[#This Row],[Urban Sprawl]])>=Tabelle2[[#This Row],[q-Wert (Indifferenz)]]),((ABS(Tabelle2[[#This Row],[Business as usual]]-Tabelle2[[#This Row],[Urban Sprawl]])-Tabelle2[[#This Row],[q-Wert (Indifferenz)]])/(Tabelle2[[#This Row],[p-Wert (Präferenz)]]-Tabelle2[[#This Row],[q-Wert (Indifferenz)]]))))),IF(ABS(Tabelle2[[#This Row],[Business as usual]]-Tabelle2[[#This Row],[Urban Sprawl]])<Tabelle2[[#This Row],[q-Wert (Indifferenz)]], 0,IF(ABS(Tabelle2[[#This Row],[Business as usual]]-Tabelle2[[#This Row],[Urban Sprawl]])>Tabelle2[[#This Row],[p-Wert (Präferenz)]],1,IF(AND(ABS(Tabelle2[[#This Row],[Business as usual]]-Tabelle2[[#This Row],[Urban Sprawl]])<=Tabelle2[[#This Row],[p-Wert (Präferenz)]],ABS(Tabelle2[[#This Row],[Business as usual]]-Tabelle2[[#This Row],[Urban Sprawl]])>=Tabelle2[[#This Row],[q-Wert (Indifferenz)]]),((ABS(Tabelle2[[#This Row],[Business as usual]]-Tabelle2[[#This Row],[Urban Sprawl]])-Tabelle2[[#This Row],[q-Wert (Indifferenz)]])/(Tabelle2[[#This Row],[p-Wert (Präferenz)]]-Tabelle2[[#This Row],[q-Wert (Indifferenz)]])))))))","v":-1}]
[null,null,null,"Interkommunale Radwege",{"$f":"('\"Walking Weights\"'!D19)/100","v":5.5555555555555552E-2},"max","Ja/Nein","Ja","Ja","Ja","Nein","Typ 1",null,null,{"$f":"IF(Tabelle2[[#This Row],[Smart City]]=Tabelle2[[#This Row],[Healthy City]],0,IF(AND(Tabelle2[[#This Row],[Smart City]]=\"Ja\",Tabelle2[[#This Row],[Healthy City]]=\"Nein\"),1,IF(AND(Tabelle2[[#This Row],[Smart City]]=\"Nein\",Tabelle2[[#This Row],[Healthy City]]=\"Ja\"),-1)))","v":0},{"$f":"IF(Tabelle2[[#This Row],[Smart City]]=Tabelle2[[#This Row],[Urban Sprawl]],0,IF(AND(Tabelle2[[#This Row],[Smart City]]=\"Ja\",Tabelle2[[#This Row],[Urban Sprawl]]=\"Nein\"),1,IF(AND(Tabelle2[[#This Row],[Smart City]]=\"Nein\",Tabelle2[[#This Row],[Urban Sprawl]]=\"Ja\"),-1)))","v":0},{"$f":"IF(Tabelle2[[#This Row],[Smart City]]=Tabelle2[[#This Row],[Business as usual]],0,IF(AND(Tabelle2[[#This Row],[Smart City]]=\"Ja\",Tabelle2[[#This Row],[Business as usual]]=\"Nein\"),1,IF(AND(Tabelle2[[#This Row],[Smart City]]=\"Nein\",Tabelle2[[#This Row],[Business as usual]]=\"Ja\"),-1)))","v":1},null,{"$f":"IF(Tabelle2[[#This Row],[Healthy City]]=Tabelle2[[#This Row],[Smart City]],0,IF(AND(Tabelle2[[#This Row],[Healthy City]]=\"Ja\",Tabelle2[[#This Row],[Smart City]]=\"Nein\"),1,IF(AND(Tabelle2[[#This Row],[Healthy City]]=\"Nein\",Tabelle2[[#This Row],[Smart City]]=\"Ja\"),-1)))","v":0},{"$f":"IF(Tabelle2[[#This Row],[Healthy City]]=Tabelle2[[#This Row],[Urban Sprawl]],0,IF(AND(Tabelle2[[#This Row],[Healthy City]]=\"Ja\",Tabelle2[[#This Row],[Urban Sprawl]]=\"Nein\"),1,IF(AND(Tabelle2[[#This Row],[Healthy City]]=\"Nein\",Tabelle2[[#This Row],[Urban Sprawl]]=\"Ja\"),-1)))","v":0},{"$f":"IF(Tabelle2[[#This Row],[Healthy City]]=Tabelle2[[#This Row],[Business as usual]],0,IF(AND(Tabelle2[[#This Row],[Healthy City]]=\"Ja\",Tabelle2[[#This Row],[Business as usual]]=\"Nein\"),1,IF(AND(Tabelle2[[#This Row],[Healthy City]]=\"Nein\",Tabelle2[[#This Row],[Business as usual]]=\"Ja\"),-1)))","v":1},null,{"$f":"IF(Tabelle2[[#This Row],[Urban Sprawl]]=Tabelle2[[#This Row],[Smart City]],0,IF(AND(Tabelle2[[#This Row],[Urban Sprawl]]=\"Ja\",Tabelle2[[#This Row],[Smart City]]=\"Nein\"),1,IF(AND(Tabelle2[[#This Row],[Urban Sprawl]]=\"Nein\",Tabelle2[[#This Row],[Smart City]]=\"Ja\"),-1)))","v":0},{"$f":"IF(Tabelle2[[#This Row],[Urban Sprawl]]=Tabelle2[[#This Row],[Healthy City]],0,IF(AND(Tabelle2[[#This Row],[Urban Sprawl]]=\"Ja\",Tabelle2[[#This Row],[Healthy City]]=\"Nein\"),1,IF(AND(Tabelle2[[#This Row],[Urban Sprawl]]=\"Nein\",Tabelle2[[#This Row],[Healthy City]]=\"Ja\"),-1)))","v":0},{"$f":"IF(Tabelle2[[#This Row],[Urban Sprawl]]=Tabelle2[[#This Row],[Business as usual]],0,IF(AND(Tabelle2[[#This Row],[Urban Sprawl]]=\"Ja\",Tabelle2[[#This Row],[Business as usual]]=\"Nein\"),1,IF(AND(Tabelle2[[#This Row],[Urban Sprawl]]=\"Nein\",Tabelle2[[#This Row],[Business as usual]]=\"Ja\"),-1)))","v":1},null,{"$f":"IF(Tabelle2[[#This Row],[Business as usual]]=Tabelle2[[#This Row],[Smart City]],0,IF(AND(Tabelle2[[#This Row],[Business as usual]]=\"Ja\",Tabelle2[[#This Row],[Smart City]]=\"Nein\"),1,IF(AND(Tabelle2[[#This Row],[Business as usual]]=\"Nein\",Tabelle2[[#This Row],[Smart City]]=\"Ja\"),-1)))","v":-1},{"$f":"IF(Tabelle2[[#This Row],[Business as usual]]=Tabelle2[[#This Row],[Healthy City]],0,IF(AND(Tabelle2[[#This Row],[Business as usual]]=\"Ja\",Tabelle2[[#This Row],[Healthy City]]=\"Nein\"),1,IF(AND(Tabelle2[[#This Row],[Business as usual]]=\"Nein\",Tabelle2[[#This Row],[Healthy City]]=\"Ja\"),-1)))","v":-1},{"$f":"IF(Tabelle2[[#This Row],[Business as usual]]=Tabelle2[[#This Row],[Urban Sprawl]],0,IF(AND(Tabelle2[[#This Row],[Business as usual]]=\"Ja\",Tabelle2[[#This Row],[Urban Sprawl]]=\"Nein\"),1,IF(AND(Tabelle2[[#This Row],[Business as usual]]=\"Nein\",Tabelle2[[#This Row],[Urban Sprawl]]=\"Ja\"),-1)))","v":-1}]
[null,null,null,"Erhöhte Fahrradsicherheit",{"$f":"('\"Walking Weights\"'!D20)/100","v":5.5555555555555552E-2},"max","Ja/Nein","Ja","Ja","Ja","Nein","Typ 1",null,null,{"$f":"IF(Tabelle2[[#This Row],[Smart City]]=Tabelle2[[#This Row],[Healthy City]],0,IF(AND(Tabelle2[[#This Row],[Smart City]]=\"Ja\",Tabelle2[[#This Row],[Healthy City]]=\"Nein\"),1,IF(AND(Tabelle2[[#This Row],[Smart City]]=\"Nein\",Tabelle2[[#This Row],[Healthy City]]=\"Ja\"),-1)))","v":0},{"$f":"IF(Tabelle2[[#This Row],[Smart City]]=Tabelle2[[#This Row],[Urban Sprawl]],0,IF(AND(Tabelle2[[#This Row],[Smart City]]=\"Ja\",Tabelle2[[#This Row],[Urban Sprawl]]=\"Nein\"),1,IF(AND(Tabelle2[[#This Row],[Smart City]]=\"Nein\",Tabelle2[[#This Row],[Urban Sprawl]]=\"Ja\"),-1)))","v":0},{"$f":"IF(Tabelle2[[#This Row],[Smart City]]=Tabelle2[[#This Row],[Business as usual]],0,IF(AND(Tabelle2[[#This Row],[Smart City]]=\"Ja\",Tabelle2[[#This Row],[Business as usual]]=\"Nein\"),1,IF(AND(Tabelle2[[#This Row],[Smart City]]=\"Nein\",Tabelle2[[#This Row],[Business as usual]]=\"Ja\"),-1)))","v":1},null,{"$f":"IF(Tabelle2[[#This Row],[Healthy City]]=Tabelle2[[#This Row],[Smart City]],0,IF(AND(Tabelle2[[#This Row],[Healthy City]]=\"Ja\",Tabelle2[[#This Row],[Smart City]]=\"Nein\"),1,IF(AND(Tabelle2[[#This Row],[Healthy City]]=\"Nein\",Tabelle2[[#This Row],[Smart City]]=\"Ja\"),-1)))","v":0},{"$f":"IF(Tabelle2[[#This Row],[Healthy City]]=Tabelle2[[#This Row],[Urban Sprawl]],0,IF(AND(Tabelle2[[#This Row],[Healthy City]]=\"Ja\",Tabelle2[[#This Row],[Urban Sprawl]]=\"Nein\"),1,IF(AND(Tabelle2[[#This Row],[Healthy City]]=\"Nein\",Tabelle2[[#This Row],[Urban Sprawl]]=\"Ja\"),-1)))","v":0},{"$f":"IF(Tabelle2[[#This Row],[Healthy City]]=Tabelle2[[#This Row],[Business as usual]],0,IF(AND(Tabelle2[[#This Row],[Healthy City]]=\"Ja\",Tabelle2[[#This Row],[Business as usual]]=\"Nein\"),1,IF(AND(Tabelle2[[#This Row],[Healthy City]]=\"Nein\",Tabelle2[[#This Row],[Business as usual]]=\"Ja\"),-1)))","v":1},null,{"$f":"IF(Tabelle2[[#This Row],[Urban Sprawl]]=Tabelle2[[#This Row],[Smart City]],0,IF(AND(Tabelle2[[#This Row],[Urban Sprawl]]=\"Ja\",Tabelle2[[#This Row],[Smart City]]=\"Nein\"),1,IF(AND(Tabelle2[[#This Row],[Urban Sprawl]]=\"Nein\",Tabelle2[[#This Row],[Smart City]]=\"Ja\"),-1)))","v":0},{"$f":"IF(Tabelle2[[#This Row],[Urban Sprawl]]=Tabelle2[[#This Row],[Healthy City]],0,IF(AND(Tabelle2[[#This Row],[Urban Sprawl]]=\"Ja\",Tabelle2[[#This Row],[Healthy City]]=\"Nein\"),1,IF(AND(Tabelle2[[#This Row],[Urban Sprawl]]=\"Nein\",Tabelle2[[#This Row],[Healthy City]]=\"Ja\"),-1)))","v":0},{"$f":"IF(Tabelle2[[#This Row],[Urban Sprawl]]=Tabelle2[[#This Row],[Business as usual]],0,IF(AND(Tabelle2[[#This Row],[Urban Sprawl]]=\"Ja\",Tabelle2[[#This Row],[Business as usual]]=\"Nein\"),1,IF(AND(Tabelle2[[#This Row],[Urban Sprawl]]=\"Nein\",Tabelle2[[#This Row],[Business as usual]]=\"Ja\"),-1)))","v":1},null,{"$f":"IF(Tabelle2[[#This Row],[Business as usual]]=Tabelle2[[#This Row],[Smart City]],0,IF(AND(Tabelle2[[#This Row],[Business as usual]]=\"Ja\",Tabelle2[[#This Row],[Smart City]]=\"Nein\"),1,IF(AND(Tabelle2[[#This Row],[Business as usual]]=\"Nein\",Tabelle2[[#This Row],[Smart City]]=\"Ja\"),-1)))","v":-1},{"$f":"IF(Tabelle2[[#This Row],[Business as usual]]=Tabelle2[[#This Row],[Healthy City]],0,IF(AND(Tabelle2[[#This Row],[Business as usual]]=\"Ja\",Tabelle2[[#This Row],[Healthy City]]=\"Nein\"),1,IF(AND(Tabelle2[[#This Row],[Business as usual]]=\"Nein\",Tabelle2[[#This Row],[Healthy City]]=\"Ja\"),-1)))","v":-1},{"$f":"IF(Tabelle2[[#This Row],[Business as usual]]=Tabelle2[[#This Row],[Urban Sprawl]],0,IF(AND(Tabelle2[[#This Row],[Business as usual]]=\"Ja\",Tabelle2[[#This Row],[Urban Sprawl]]=\"Nein\"),1,IF(AND(Tabelle2[[#This Row],[Business as usual]]=\"Nein\",Tabelle2[[#This Row],[Urban Sprawl]]=\"Ja\"),-1)))","v":-1}]
[null,null,null,"E-Bike-Ladepunkte-Netz",{"$f":"('\"Walking Weights\"'!D21)/100","v":5.5555555555555552E-2},"max","Ja/Nein","Ja","Ja","Ja","Nein","Typ 1",null,null,{"$f":"IF(Tabelle2[[#This Row],[Smart City]]=Tabelle2[[#This Row],[Healthy City]],0,IF(AND(Tabelle2[[#This Row],[Smart City]]=\"Ja\",Tabelle2[[#This Row],[Healthy City]]=\"Nein\"),1,IF(AND(Tabelle2[[#This Row],[Smart City]]=\"Nein\",Tabelle2[[#This Row],[Healthy City]]=\"Ja\"),-1)))","v":0},{"$f":"IF(Tabelle2[[#This Row],[Smart City]]=Tabelle2[[#This Row],[Urban Sprawl]],0,IF(AND(Tabelle2[[#This Row],[Smart City]]=\"Ja\",Tabelle2[[#This Row],[Urban Sprawl]]=\"Nein\"),1,IF(AND(Tabelle2[[#This Row],[Smart City]]=\"Nein\",Tabelle2[[#This Row],[Urban Sprawl]]=\"Ja\"),-1)))","v":0},{"$f":"IF(Tabelle2[[#This Row],[Smart City]]=Tabelle2[[#This Row],[Business as usual]],0,IF(AND(Tabelle2[[#This Row],[Smart City]]=\"Ja\",Tabelle2[[#This Row],[Business as usual]]=\"Nein\"),1,IF(AND(Tabelle2[[#This Row],[Smart City]]=\"Nein\",Tabelle2[[#This Row],[Business as usual]]=\"Ja\"),-1)))","v":1},null,{"$f":"IF(Tabelle2[[#This Row],[Healthy City]]=Tabelle2[[#This Row],[Smart City]],0,IF(AND(Tabelle2[[#This Row],[Healthy City]]=\"Ja\",Tabelle2[[#This Row],[Smart City]]=\"Nein\"),1,IF(AND(Tabelle2[[#This Row],[Healthy City]]=\"Nein\",Tabelle2[[#This Row],[Smart City]]=\"Ja\"),-1)))","v":0},{"$f":"IF(Tabelle2[[#This Row],[Healthy City]]=Tabelle2[[#This Row],[Urban Sprawl]],0,IF(AND(Tabelle2[[#This Row],[Healthy City]]=\"Ja\",Tabelle2[[#This Row],[Urban Sprawl]]=\"Nein\"),1,IF(AND(Tabelle2[[#This Row],[Healthy City]]=\"Nein\",Tabelle2[[#This Row],[Urban Sprawl]]=\"Ja\"),-1)))","v":0},{"$f":"IF(Tabelle2[[#This Row],[Healthy City]]=Tabelle2[[#This Row],[Business as usual]],0,IF(AND(Tabelle2[[#This Row],[Healthy City]]=\"Ja\",Tabelle2[[#This Row],[Business as usual]]=\"Nein\"),1,IF(AND(Tabelle2[[#This Row],[Healthy City]]=\"Nein\",Tabelle2[[#This Row],[Business as usual]]=\"Ja\"),-1)))","v":1},null,{"$f":"IF(Tabelle2[[#This Row],[Urban Sprawl]]=Tabelle2[[#This Row],[Smart City]],0,IF(AND(Tabelle2[[#This Row],[Urban Sprawl]]=\"Ja\",Tabelle2[[#This Row],[Smart City]]=\"Nein\"),1,IF(AND(Tabelle2[[#This Row],[Urban Sprawl]]=\"Nein\",Tabelle2[[#This Row],[Smart City]]=\"Ja\"),-1)))","v":0},{"$f":"IF(Tabelle2[[#This Row],[Urban Sprawl]]=Tabelle2[[#This Row],[Healthy City]],0,IF(AND(Tabelle2[[#This Row],[Urban Sprawl]]=\"Ja\",Tabelle2[[#This Row],[Healthy City]]=\"Nein\"),1,IF(AND(Tabelle2[[#This Row],[Urban Sprawl]]=\"Nein\",Tabelle2[[#This Row],[Healthy City]]=\"Ja\"),-1)))","v":0},{"$f":"IF(Tabelle2[[#This Row],[Urban Sprawl]]=Tabelle2[[#This Row],[Business as usual]],0,IF(AND(Tabelle2[[#This Row],[Urban Sprawl]]=\"Ja\",Tabelle2[[#This Row],[Business as usual]]=\"Nein\"),1,IF(AND(Tabelle2[[#This Row],[Urban Sprawl]]=\"Nein\",Tabelle2[[#This Row],[Business as usual]]=\"Ja\"),-1)))","v":1},null,{"$f":"IF(Tabelle2[[#This Row],[Business as usual]]=Tabelle2[[#This Row],[Smart City]],0,IF(AND(Tabelle2[[#This Row],[Business as usual]]=\"Ja\",Tabelle2[[#This Row],[Smart City]]=\"Nein\"),1,IF(AND(Tabelle2[[#This Row],[Business as usual]]=\"Nein\",Tabelle2[[#This Row],[Smart City]]=\"Ja\"),-1)))","v":-1},{"$f":"IF(Tabelle2[[#This Row],[Business as usual]]=Tabelle2[[#This Row],[Healthy City]],0,IF(AND(Tabelle2[[#This Row],[Business as usual]]=\"Ja\",Tabelle2[[#This Row],[Healthy City]]=\"Nein\"),1,IF(AND(Tabelle2[[#This Row],[Business as usual]]=\"Nein\",Tabelle2[[#This Row],[Healthy City]]=\"Ja\"),-1)))","v":-1},{"$f":"IF(Tabelle2[[#This Row],[Business as usual]]=Tabelle2[[#This Row],[Urban Sprawl]],0,IF(AND(Tabelle2[[#This Row],[Business as usual]]=\"Ja\",Tabelle2[[#This Row],[Urban Sprawl]]=\"Nein\"),1,IF(AND(Tabelle2[[#This Row],[Business as usual]]=\"Nein\",Tabelle2[[#This Row],[Urban Sprawl]]=\"Ja\"),-1)))","v":-1}]
[null,null,null,"\"Smart Card\"",{"$f":"('\"Walking Weights\"'!D22)/100","v":5.5555555555555552E-2},"max","Ja/Nein","Ja","Nein","Ja","Nein","Typ 1",null,null,{"$f":"IF(Tabelle2[[#This Row],[Smart City]]=Tabelle2[[#This Row],[Healthy City]],0,IF(AND(Tabelle2[[#This Row],[Smart City]]=\"Ja\",Tabelle2[[#This Row],[Healthy City]]=\"Nein\"),1,IF(AND(Tabelle2[[#This Row],[Smart City]]=\"Nein\",Tabelle2[[#This Row],[Healthy City]]=\"Ja\"),-1)))","v":1},{"$f":"IF(Tabelle2[[#This Row],[Smart City]]=Tabelle2[[#This Row],[Urban Sprawl]],0,IF(AND(Tabelle2[[#This Row],[Smart City]]=\"Ja\",Tabelle2[[#This Row],[Urban Sprawl]]=\"Nein\"),1,IF(AND(Tabelle2[[#This Row],[Smart City]]=\"Nein\",Tabelle2[[#This Row],[Urban Sprawl]]=\"Ja\"),-1)))","v":0},{"$f":"IF(Tabelle2[[#This Row],[Smart City]]=Tabelle2[[#This Row],[Business as usual]],0,IF(AND(Tabelle2[[#This Row],[Smart City]]=\"Ja\",Tabelle2[[#This Row],[Business as usual]]=\"Nein\"),1,IF(AND(Tabelle2[[#This Row],[Smart City]]=\"Nein\",Tabelle2[[#This Row],[Business as usual]]=\"Ja\"),-1)))","v":1},null,{"$f":"IF(Tabelle2[[#This Row],[Healthy City]]=Tabelle2[[#This Row],[Smart City]],0,IF(AND(Tabelle2[[#This Row],[Healthy City]]=\"Ja\",Tabelle2[[#This Row],[Smart City]]=\"Nein\"),1,IF(AND(Tabelle2[[#This Row],[Healthy City]]=\"Nein\",Tabelle2[[#This Row],[Smart City]]=\"Ja\"),-1)))","v":-1},{"$f":"IF(Tabelle2[[#This Row],[Healthy City]]=Tabelle2[[#This Row],[Urban Sprawl]],0,IF(AND(Tabelle2[[#This Row],[Healthy City]]=\"Ja\",Tabelle2[[#This Row],[Urban Sprawl]]=\"Nein\"),1,IF(AND(Tabelle2[[#This Row],[Healthy City]]=\"Nein\",Tabelle2[[#This Row],[Urban Sprawl]]=\"Ja\"),-1)))","v":-1},{"$f":"IF(Tabelle2[[#This Row],[Healthy City]]=Tabelle2[[#This Row],[Business as usual]],0,IF(AND(Tabelle2[[#This Row],[Healthy City]]=\"Ja\",Tabelle2[[#This Row],[Business as usual]]=\"Nein\"),1,IF(AND(Tabelle2[[#This Row],[Healthy City]]=\"Nein\",Tabelle2[[#This Row],[Business as usual]]=\"Ja\"),-1)))","v":0},null,{"$f":"IF(Tabelle2[[#This Row],[Urban Sprawl]]=Tabelle2[[#This Row],[Smart City]],0,IF(AND(Tabelle2[[#This Row],[Urban Sprawl]]=\"Ja\",Tabelle2[[#This Row],[Smart City]]=\"Nein\"),1,IF(AND(Tabelle2[[#This Row],[Urban Sprawl]]=\"Nein\",Tabelle2[[#This Row],[Smart City]]=\"Ja\"),-1)))","v":0},{"$f":"IF(Tabelle2[[#This Row],[Urban Sprawl]]=Tabelle2[[#This Row],[Healthy City]],0,IF(AND(Tabelle2[[#This Row],[Urban Sprawl]]=\"Ja\",Tabelle2[[#This Row],[Healthy City]]=\"Nein\"),1,IF(AND(Tabelle2[[#This Row],[Urban Sprawl]]=\"Nein\",Tabelle2[[#This Row],[Healthy City]]=\"Ja\"),-1)))","v":1},{"$f":"IF(Tabelle2[[#This Row],[Urban Sprawl]]=Tabelle2[[#This Row],[Business as usual]],0,IF(AND(Tabelle2[[#This Row],[Urban Sprawl]]=\"Ja\",Tabelle2[[#This Row],[Business as usual]]=\"Nein\"),1,IF(AND(Tabelle2[[#This Row],[Urban Sprawl]]=\"Nein\",Tabelle2[[#This Row],[Business as usual]]=\"Ja\"),-1)))","v":1},null,{"$f":"IF(Tabelle2[[#This Row],[Business as usual]]=Tabelle2[[#This Row],[Smart City]],0,IF(AND(Tabelle2[[#This Row],[Business as usual]]=\"Ja\",Tabelle2[[#This Row],[Smart City]]=\"Nein\"),1,IF(AND(Tabelle2[[#This Row],[Business as usual]]=\"Nein\",Tabelle2[[#This Row],[Smart City]]=\"Ja\"),-1)))","v":-1},{"$f":"IF(Tabelle2[[#This Row],[Business as usual]]=Tabelle2[[#This Row],[Healthy City]],0,IF(AND(Tabelle2[[#This Row],[Business as usual]]=\"Ja\",Tabelle2[[#This Row],[Healthy City]]=\"Nein\"),1,IF(AND(Tabelle2[[#This Row],[Business as usual]]=\"Nein\",Tabelle2[[#This Row],[Healthy City]]=\"Ja\"),-1)))","v":0},{"$f":"IF(Tabelle2[[#This Row],[Business as usual]]=Tabelle2[[#This Row],[Urban Sprawl]],0,IF(AND(Tabelle2[[#This Row],[Business as usual]]=\"Ja\",Tabelle2[[#This Row],[Urban Sprawl]]=\"Nein\"),1,IF(AND(Tabelle2[[#This Row],[Business as usual]]=\"Nein\",Tabelle2[[#This Row],[Urban Sprawl]]=\"Ja\"),-1)))","v":-1}]
[null,null,null,"CO2 Mobilität",{"$f":"('\"Walking Weights\"'!D23)/100","v":5.5555555555555552E-2},"min","Gramm/km",9,7,12,12,"Typ 5",1.73,4.7300000000000004,{"$f":"IF(Tabelle2[[#This Row],[min/max]]=\"min\",-1*IF(Tabelle2[[#This Row],[Smart City]]-Tabelle2[[#This Row],[Healthy City]]<0,-1*IF(ABS(Tabelle2[[#This Row],[Smart City]]-Tabelle2[[#This Row],[Healthy City]])<Tabelle2[[#This Row],[q-Wert (Indifferenz)]], 0,IF(ABS(Tabelle2[[#This Row],[Smart City]]-Tabelle2[[#This Row],[Healthy City]])>Tabelle2[[#This Row],[p-Wert (Präferenz)]],1,IF(AND(ABS(Tabelle2[[#This Row],[Smart City]]-Tabelle2[[#This Row],[Healthy City]])<=Tabelle2[[#This Row],[p-Wert (Präferenz)]],ABS(Tabelle2[[#This Row],[Smart City]]-Tabelle2[[#This Row],[Healthy City]])>=Tabelle2[[#This Row],[q-Wert (Indifferenz)]]),((ABS(Tabelle2[[#This Row],[Smart City]]-Tabelle2[[#This Row],[Healthy City]])-Tabelle2[[#This Row],[q-Wert (Indifferenz)]])/(Tabelle2[[#This Row],[p-Wert (Präferenz)]]-Tabelle2[[#This Row],[q-Wert (Indifferenz)]]))))),IF(ABS(Tabelle2[[#This Row],[Smart City]]-Tabelle2[[#This Row],[Healthy City]])<Tabelle2[[#This Row],[q-Wert (Indifferenz)]], 0,IF(ABS(Tabelle2[[#This Row],[Smart City]]-Tabelle2[[#This Row],[Healthy City]])>Tabelle2[[#This Row],[p-Wert (Präferenz)]],1,IF(AND(ABS(Tabelle2[[#This Row],[Smart City]]-Tabelle2[[#This Row],[Healthy City]])<=Tabelle2[[#This Row],[p-Wert (Präferenz)]],ABS(Tabelle2[[#This Row],[Smart City]]-Tabelle2[[#This Row],[Healthy City]])>=Tabelle2[[#This Row],[q-Wert (Indifferenz)]]),((ABS(Tabelle2[[#This Row],[Smart City]]-Tabelle2[[#This Row],[Healthy City]])-Tabelle2[[#This Row],[q-Wert (Indifferenz)]])/(Tabelle2[[#This Row],[p-Wert (Präferenz)]]-Tabelle2[[#This Row],[q-Wert (Indifferenz)]])))))),IF(Tabelle2[[#This Row],[Smart City]]-Tabelle2[[#This Row],[Healthy City]]<0,-1*IF(ABS(Tabelle2[[#This Row],[Smart City]]-Tabelle2[[#This Row],[Healthy City]])<Tabelle2[[#This Row],[q-Wert (Indifferenz)]], 0,IF(ABS(Tabelle2[[#This Row],[Smart City]]-Tabelle2[[#This Row],[Healthy City]])>Tabelle2[[#This Row],[p-Wert (Präferenz)]],1,IF(AND(ABS(Tabelle2[[#This Row],[Smart City]]-Tabelle2[[#This Row],[Healthy City]])<=Tabelle2[[#This Row],[p-Wert (Präferenz)]],ABS(Tabelle2[[#This Row],[Smart City]]-Tabelle2[[#This Row],[Healthy City]])>=Tabelle2[[#This Row],[q-Wert (Indifferenz)]]),((ABS(Tabelle2[[#This Row],[Smart City]]-Tabelle2[[#This Row],[Healthy City]])-Tabelle2[[#This Row],[q-Wert (Indifferenz)]])/(Tabelle2[[#This Row],[p-Wert (Präferenz)]]-Tabelle2[[#This Row],[q-Wert (Indifferenz)]]))))),IF(ABS(Tabelle2[[#This Row],[Smart City]]-Tabelle2[[#This Row],[Healthy City]])<Tabelle2[[#This Row],[q-Wert (Indifferenz)]], 0,IF(ABS(Tabelle2[[#This Row],[Smart City]]-Tabelle2[[#This Row],[Healthy City]])>Tabelle2[[#This Row],[p-Wert (Präferenz)]],1,IF(AND(ABS(Tabelle2[[#This Row],[Smart City]]-Tabelle2[[#This Row],[Healthy City]])<=Tabelle2[[#This Row],[p-Wert (Präferenz)]],ABS(Tabelle2[[#This Row],[Smart City]]-Tabelle2[[#This Row],[Healthy City]])>=Tabelle2[[#This Row],[q-Wert (Indifferenz)]]),((ABS(Tabelle2[[#This Row],[Smart City]]-Tabelle2[[#This Row],[Healthy City]])-Tabelle2[[#This Row],[q-Wert (Indifferenz)]])/(Tabelle2[[#This Row],[p-Wert (Präferenz)]]-Tabelle2[[#This Row],[q-Wert (Indifferenz)]])))))))","v":-0.09},{"$f":"IF(Tabelle2[[#This Row],[min/max]]=\"min\",-1*IF(Tabelle2[[#This Row],[Smart City]]-Tabelle2[[#This Row],[Urban Sprawl]]<0,-1*IF(ABS(Tabelle2[[#This Row],[Smart City]]-Tabelle2[[#This Row],[Urban Sprawl]])<Tabelle2[[#This Row],[q-Wert (Indifferenz)]], 0,IF(ABS(Tabelle2[[#This Row],[Smart City]]-Tabelle2[[#This Row],[Urban Sprawl]])>Tabelle2[[#This Row],[p-Wert (Präferenz)]],1,IF(AND(ABS(Tabelle2[[#This Row],[Smart City]]-Tabelle2[[#This Row],[Urban Sprawl]])<=Tabelle2[[#This Row],[p-Wert (Präferenz)]],ABS(Tabelle2[[#This Row],[Smart City]]-Tabelle2[[#This Row],[Urban Sprawl]])>=Tabelle2[[#This Row],[q-Wert (Indifferenz)]]),((ABS(Tabelle2[[#This Row],[Smart City]]-Tabelle2[[#This Row],[Urban Sprawl]])-Tabelle2[[#This Row],[q-Wert (Indifferenz)]])/(Tabelle2[[#This Row],[p-Wert (Präferenz)]]-Tabelle2[[#This Row],[q-Wert (Indifferenz)]]))))),IF(ABS(Tabelle2[[#This Row],[Smart City]]-Tabelle2[[#This Row],[Urban Sprawl]])<Tabelle2[[#This Row],[q-Wert (Indifferenz)]], 0,IF(ABS(Tabelle2[[#This Row],[Smart City]]-Tabelle2[[#This Row],[Urban Sprawl]])>Tabelle2[[#This Row],[p-Wert (Präferenz)]],1,IF(AND(ABS(Tabelle2[[#This Row],[Smart City]]-Tabelle2[[#This Row],[Urban Sprawl]])<=Tabelle2[[#This Row],[p-Wert (Präferenz)]],ABS(Tabelle2[[#This Row],[Smart City]]-Tabelle2[[#This Row],[Urban Sprawl]])>=Tabelle2[[#This Row],[q-Wert (Indifferenz)]]),((ABS(Tabelle2[[#This Row],[Smart City]]-Tabelle2[[#This Row],[Urban Sprawl]])-Tabelle2[[#This Row],[q-Wert (Indifferenz)]])/(Tabelle2[[#This Row],[p-Wert (Präferenz)]]-Tabelle2[[#This Row],[q-Wert (Indifferenz)]])))))),IF(Tabelle2[[#This Row],[Smart City]]-Tabelle2[[#This Row],[Urban Sprawl]]<0,-1*IF(ABS(Tabelle2[[#This Row],[Smart City]]-Tabelle2[[#This Row],[Urban Sprawl]])<Tabelle2[[#This Row],[q-Wert (Indifferenz)]], 0,IF(ABS(Tabelle2[[#This Row],[Smart City]]-Tabelle2[[#This Row],[Urban Sprawl]])>Tabelle2[[#This Row],[p-Wert (Präferenz)]],1,IF(AND(ABS(Tabelle2[[#This Row],[Smart City]]-Tabelle2[[#This Row],[Urban Sprawl]])<=Tabelle2[[#This Row],[p-Wert (Präferenz)]],ABS(Tabelle2[[#This Row],[Smart City]]-Tabelle2[[#This Row],[Urban Sprawl]])>=Tabelle2[[#This Row],[q-Wert (Indifferenz)]]),((ABS(Tabelle2[[#This Row],[Smart City]]-Tabelle2[[#This Row],[Urban Sprawl]])-Tabelle2[[#This Row],[q-Wert (Indifferenz)]])/(Tabelle2[[#This Row],[p-Wert (Präferenz)]]-Tabelle2[[#This Row],[q-Wert (Indifferenz)]]))))),IF(ABS(Tabelle2[[#This Row],[Smart City]]-Tabelle2[[#This Row],[Urban Sprawl]])<Tabelle2[[#This Row],[q-Wert (Indifferenz)]], 0,IF(ABS(Tabelle2[[#This Row],[Smart City]]-Tabelle2[[#This Row],[Urban Sprawl]])>Tabelle2[[#This Row],[p-Wert (Präferenz)]],1,IF(AND(ABS(Tabelle2[[#This Row],[Smart City]]-Tabelle2[[#This Row],[Urban Sprawl]])<=Tabelle2[[#This Row],[p-Wert (Präferenz)]],ABS(Tabelle2[[#This Row],[Smart City]]-Tabelle2[[#This Row],[Urban Sprawl]])>=Tabelle2[[#This Row],[q-Wert (Indifferenz)]]),((ABS(Tabelle2[[#This Row],[Smart City]]-Tabelle2[[#This Row],[Urban Sprawl]])-Tabelle2[[#This Row],[q-Wert (Indifferenz)]])/(Tabelle2[[#This Row],[p-Wert (Präferenz)]]-Tabelle2[[#This Row],[q-Wert (Indifferenz)]])))))))","v":0.42333333333333328},{"$f":"IF(Tabelle2[[#This Row],[min/max]]=\"min\",-1*IF(Tabelle2[[#This Row],[Smart City]]-Tabelle2[[#This Row],[Business as usual]]<0,-1*IF(ABS(Tabelle2[[#This Row],[Smart City]]-Tabelle2[[#This Row],[Business as usual]])<Tabelle2[[#This Row],[q-Wert (Indifferenz)]], 0,IF(ABS(Tabelle2[[#This Row],[Smart City]]-Tabelle2[[#This Row],[Business as usual]])>Tabelle2[[#This Row],[p-Wert (Präferenz)]],1,IF(AND(ABS(Tabelle2[[#This Row],[Smart City]]-Tabelle2[[#This Row],[Business as usual]])<=Tabelle2[[#This Row],[p-Wert (Präferenz)]],ABS(Tabelle2[[#This Row],[Smart City]]-Tabelle2[[#This Row],[Business as usual]])>=Tabelle2[[#This Row],[q-Wert (Indifferenz)]]),((ABS(Tabelle2[[#This Row],[Smart City]]-Tabelle2[[#This Row],[Business as usual]])-Tabelle2[[#This Row],[q-Wert (Indifferenz)]])/(Tabelle2[[#This Row],[p-Wert (Präferenz)]]-Tabelle2[[#This Row],[q-Wert (Indifferenz)]]))))),IF(ABS(Tabelle2[[#This Row],[Smart City]]-Tabelle2[[#This Row],[Business as usual]])<Tabelle2[[#This Row],[q-Wert (Indifferenz)]], 0,IF(ABS(Tabelle2[[#This Row],[Smart City]]-Tabelle2[[#This Row],[Business as usual]])>Tabelle2[[#This Row],[p-Wert (Präferenz)]],1,IF(AND(ABS(Tabelle2[[#This Row],[Smart City]]-Tabelle2[[#This Row],[Business as usual]])<=Tabelle2[[#This Row],[p-Wert (Präferenz)]],ABS(Tabelle2[[#This Row],[Smart City]]-Tabelle2[[#This Row],[Business as usual]])>=Tabelle2[[#This Row],[q-Wert (Indifferenz)]]),((ABS(Tabelle2[[#This Row],[Smart City]]-Tabelle2[[#This Row],[Business as usual]])-Tabelle2[[#This Row],[q-Wert (Indifferenz)]])/(Tabelle2[[#This Row],[p-Wert (Präferenz)]]-Tabelle2[[#This Row],[q-Wert (Indifferenz)]])))))),IF(Tabelle2[[#This Row],[Smart City]]-Tabelle2[[#This Row],[Business as usual]]<0,-1*IF(ABS(Tabelle2[[#This Row],[Smart City]]-Tabelle2[[#This Row],[Business as usual]])<Tabelle2[[#This Row],[q-Wert (Indifferenz)]], 0,IF(ABS(Tabelle2[[#This Row],[Smart City]]-Tabelle2[[#This Row],[Business as usual]])>Tabelle2[[#This Row],[p-Wert (Präferenz)]],1,IF(AND(ABS(Tabelle2[[#This Row],[Smart City]]-Tabelle2[[#This Row],[Business as usual]])<=Tabelle2[[#This Row],[p-Wert (Präferenz)]],ABS(Tabelle2[[#This Row],[Smart City]]-Tabelle2[[#This Row],[Business as usual]])>=Tabelle2[[#This Row],[q-Wert (Indifferenz)]]),((ABS(Tabelle2[[#This Row],[Smart City]]-Tabelle2[[#This Row],[Business as usual]])-Tabelle2[[#This Row],[q-Wert (Indifferenz)]])/(Tabelle2[[#This Row],[p-Wert (Präferenz)]]-Tabelle2[[#This Row],[q-Wert (Indifferenz)]]))))),IF(ABS(Tabelle2[[#This Row],[Smart City]]-Tabelle2[[#This Row],[Business as usual]])<Tabelle2[[#This Row],[q-Wert (Indifferenz)]], 0,IF(ABS(Tabelle2[[#This Row],[Smart City]]-Tabelle2[[#This Row],[Business as usual]])>Tabelle2[[#This Row],[p-Wert (Präferenz)]],1,IF(AND(ABS(Tabelle2[[#This Row],[Smart City]]-Tabelle2[[#This Row],[Business as usual]])<=Tabelle2[[#This Row],[p-Wert (Präferenz)]],ABS(Tabelle2[[#This Row],[Smart City]]-Tabelle2[[#This Row],[Business as usual]])>=Tabelle2[[#This Row],[q-Wert (Indifferenz)]]),((ABS(Tabelle2[[#This Row],[Smart City]]-Tabelle2[[#This Row],[Business as usual]])-Tabelle2[[#This Row],[q-Wert (Indifferenz)]])/(Tabelle2[[#This Row],[p-Wert (Präferenz)]]-Tabelle2[[#This Row],[q-Wert (Indifferenz)]])))))))","v":0.42333333333333328},null,{"$f":"IF(Tabelle2[[#This Row],[min/max]]=\"min\",-1*IF(Tabelle2[[#This Row],[Healthy City]]-Tabelle2[[#This Row],[Smart City]]<0,-1*IF(ABS(Tabelle2[[#This Row],[Healthy City]]-Tabelle2[[#This Row],[Smart City]])<Tabelle2[[#This Row],[q-Wert (Indifferenz)]], 0,IF(ABS(Tabelle2[[#This Row],[Healthy City]]-Tabelle2[[#This Row],[Smart City]])>Tabelle2[[#This Row],[p-Wert (Präferenz)]],1,IF(AND(ABS(Tabelle2[[#This Row],[Healthy City]]-Tabelle2[[#This Row],[Smart City]])<=Tabelle2[[#This Row],[p-Wert (Präferenz)]],ABS(Tabelle2[[#This Row],[Healthy City]]-Tabelle2[[#This Row],[Smart City]])>=Tabelle2[[#This Row],[q-Wert (Indifferenz)]]),((ABS(Tabelle2[[#This Row],[Healthy City]]-Tabelle2[[#This Row],[Smart City]])-Tabelle2[[#This Row],[q-Wert (Indifferenz)]])/(Tabelle2[[#This Row],[p-Wert (Präferenz)]]-Tabelle2[[#This Row],[q-Wert (Indifferenz)]]))))),IF(ABS(Tabelle2[[#This Row],[Healthy City]]-Tabelle2[[#This Row],[Smart City]])<Tabelle2[[#This Row],[q-Wert (Indifferenz)]], 0,IF(ABS(Tabelle2[[#This Row],[Healthy City]]-Tabelle2[[#This Row],[Smart City]])>Tabelle2[[#This Row],[p-Wert (Präferenz)]],1,IF(AND(ABS(Tabelle2[[#This Row],[Healthy City]]-Tabelle2[[#This Row],[Smart City]])<=Tabelle2[[#This Row],[p-Wert (Präferenz)]],ABS(Tabelle2[[#This Row],[Healthy City]]-Tabelle2[[#This Row],[Smart City]])>=Tabelle2[[#This Row],[q-Wert (Indifferenz)]]),((ABS(Tabelle2[[#This Row],[Healthy City]]-Tabelle2[[#This Row],[Smart City]])-Tabelle2[[#This Row],[q-Wert (Indifferenz)]])/(Tabelle2[[#This Row],[p-Wert (Präferenz)]]-Tabelle2[[#This Row],[q-Wert (Indifferenz)]])))))),IF(Tabelle2[[#This Row],[Healthy City]]-Tabelle2[[#This Row],[Smart City]]<0,-1*IF(ABS(Tabelle2[[#This Row],[Healthy City]]-Tabelle2[[#This Row],[Smart City]])<Tabelle2[[#This Row],[q-Wert (Indifferenz)]], 0,IF(ABS(Tabelle2[[#This Row],[Healthy City]]-Tabelle2[[#This Row],[Smart City]])>Tabelle2[[#This Row],[p-Wert (Präferenz)]],1,IF(AND(ABS(Tabelle2[[#This Row],[Healthy City]]-Tabelle2[[#This Row],[Smart City]])<=Tabelle2[[#This Row],[p-Wert (Präferenz)]],ABS(Tabelle2[[#This Row],[Healthy City]]-Tabelle2[[#This Row],[Smart City]])>=Tabelle2[[#This Row],[q-Wert (Indifferenz)]]),((ABS(Tabelle2[[#This Row],[Healthy City]]-Tabelle2[[#This Row],[Smart City]])-Tabelle2[[#This Row],[q-Wert (Indifferenz)]])/(Tabelle2[[#This Row],[p-Wert (Präferenz)]]-Tabelle2[[#This Row],[q-Wert (Indifferenz)]]))))),IF(ABS(Tabelle2[[#This Row],[Healthy City]]-Tabelle2[[#This Row],[Smart City]])<Tabelle2[[#This Row],[q-Wert (Indifferenz)]], 0,IF(ABS(Tabelle2[[#This Row],[Healthy City]]-Tabelle2[[#This Row],[Smart City]])>Tabelle2[[#This Row],[p-Wert (Präferenz)]],1,IF(AND(ABS(Tabelle2[[#This Row],[Healthy City]]-Tabelle2[[#This Row],[Smart City]])<=Tabelle2[[#This Row],[p-Wert (Präferenz)]],ABS(Tabelle2[[#This Row],[Healthy City]]-Tabelle2[[#This Row],[Smart City]])>=Tabelle2[[#This Row],[q-Wert (Indifferenz)]]),((ABS(Tabelle2[[#This Row],[Healthy City]]-Tabelle2[[#This Row],[Smart City]])-Tabelle2[[#This Row],[q-Wert (Indifferenz)]])/(Tabelle2[[#This Row],[p-Wert (Präferenz)]]-Tabelle2[[#This Row],[q-Wert (Indifferenz)]])))))))","v":0.09},{"$f":"IF(Tabelle2[[#This Row],[min/max]]=\"min\",-1*IF(Tabelle2[[#This Row],[Healthy City]]-Tabelle2[[#This Row],[Urban Sprawl]]<0,-1*IF(ABS(Tabelle2[[#This Row],[Healthy City]]-Tabelle2[[#This Row],[Urban Sprawl]])<Tabelle2[[#This Row],[q-Wert (Indifferenz)]], 0,IF(ABS(Tabelle2[[#This Row],[Healthy City]]-Tabelle2[[#This Row],[Urban Sprawl]])>Tabelle2[[#This Row],[p-Wert (Präferenz)]],1,IF(AND(ABS(Tabelle2[[#This Row],[Healthy City]]-Tabelle2[[#This Row],[Urban Sprawl]])<=Tabelle2[[#This Row],[p-Wert (Präferenz)]],ABS(Tabelle2[[#This Row],[Healthy City]]-Tabelle2[[#This Row],[Urban Sprawl]])>=Tabelle2[[#This Row],[q-Wert (Indifferenz)]]),((ABS(Tabelle2[[#This Row],[Healthy City]]-Tabelle2[[#This Row],[Urban Sprawl]])-Tabelle2[[#This Row],[q-Wert (Indifferenz)]])/(Tabelle2[[#This Row],[p-Wert (Präferenz)]]-Tabelle2[[#This Row],[q-Wert (Indifferenz)]]))))),IF(ABS(Tabelle2[[#This Row],[Healthy City]]-Tabelle2[[#This Row],[Urban Sprawl]])<Tabelle2[[#This Row],[q-Wert (Indifferenz)]], 0,IF(ABS(Tabelle2[[#This Row],[Healthy City]]-Tabelle2[[#This Row],[Urban Sprawl]])>Tabelle2[[#This Row],[p-Wert (Präferenz)]],1,IF(AND(ABS(Tabelle2[[#This Row],[Healthy City]]-Tabelle2[[#This Row],[Urban Sprawl]])<=Tabelle2[[#This Row],[p-Wert (Präferenz)]],ABS(Tabelle2[[#This Row],[Healthy City]]-Tabelle2[[#This Row],[Urban Sprawl]])>=Tabelle2[[#This Row],[q-Wert (Indifferenz)]]),((ABS(Tabelle2[[#This Row],[Healthy City]]-Tabelle2[[#This Row],[Urban Sprawl]])-Tabelle2[[#This Row],[q-Wert (Indifferenz)]])/(Tabelle2[[#This Row],[p-Wert (Präferenz)]]-Tabelle2[[#This Row],[q-Wert (Indifferenz)]])))))),IF(Tabelle2[[#This Row],[Healthy City]]-Tabelle2[[#This Row],[Urban Sprawl]]<0,-1*IF(ABS(Tabelle2[[#This Row],[Healthy City]]-Tabelle2[[#This Row],[Urban Sprawl]])<Tabelle2[[#This Row],[q-Wert (Indifferenz)]], 0,IF(ABS(Tabelle2[[#This Row],[Healthy City]]-Tabelle2[[#This Row],[Urban Sprawl]])>Tabelle2[[#This Row],[p-Wert (Präferenz)]],1,IF(AND(ABS(Tabelle2[[#This Row],[Healthy City]]-Tabelle2[[#This Row],[Urban Sprawl]])<=Tabelle2[[#This Row],[p-Wert (Präferenz)]],ABS(Tabelle2[[#This Row],[Healthy City]]-Tabelle2[[#This Row],[Urban Sprawl]])>=Tabelle2[[#This Row],[q-Wert (Indifferenz)]]),((ABS(Tabelle2[[#This Row],[Healthy City]]-Tabelle2[[#This Row],[Urban Sprawl]])-Tabelle2[[#This Row],[q-Wert (Indifferenz)]])/(Tabelle2[[#This Row],[p-Wert (Präferenz)]]-Tabelle2[[#This Row],[q-Wert (Indifferenz)]]))))),IF(ABS(Tabelle2[[#This Row],[Healthy City]]-Tabelle2[[#This Row],[Urban Sprawl]])<Tabelle2[[#This Row],[q-Wert (Indifferenz)]], 0,IF(ABS(Tabelle2[[#This Row],[Healthy City]]-Tabelle2[[#This Row],[Urban Sprawl]])>Tabelle2[[#This Row],[p-Wert (Präferenz)]],1,IF(AND(ABS(Tabelle2[[#This Row],[Healthy City]]-Tabelle2[[#This Row],[Urban Sprawl]])<=Tabelle2[[#This Row],[p-Wert (Präferenz)]],ABS(Tabelle2[[#This Row],[Healthy City]]-Tabelle2[[#This Row],[Urban Sprawl]])>=Tabelle2[[#This Row],[q-Wert (Indifferenz)]]),((ABS(Tabelle2[[#This Row],[Healthy City]]-Tabelle2[[#This Row],[Urban Sprawl]])-Tabelle2[[#This Row],[q-Wert (Indifferenz)]])/(Tabelle2[[#This Row],[p-Wert (Präferenz)]]-Tabelle2[[#This Row],[q-Wert (Indifferenz)]])))))))","v":1},{"$f":"IF(Tabelle2[[#This Row],[min/max]]=\"min\",-1*IF(Tabelle2[[#This Row],[Healthy City]]-Tabelle2[[#This Row],[Business as usual]]<0,-1*IF(ABS(Tabelle2[[#This Row],[Healthy City]]-Tabelle2[[#This Row],[Business as usual]])<Tabelle2[[#This Row],[q-Wert (Indifferenz)]], 0,IF(ABS(Tabelle2[[#This Row],[Healthy City]]-Tabelle2[[#This Row],[Business as usual]])>Tabelle2[[#This Row],[p-Wert (Präferenz)]],1,IF(AND(ABS(Tabelle2[[#This Row],[Healthy City]]-Tabelle2[[#This Row],[Business as usual]])<=Tabelle2[[#This Row],[p-Wert (Präferenz)]],ABS(Tabelle2[[#This Row],[Healthy City]]-Tabelle2[[#This Row],[Business as usual]])>=Tabelle2[[#This Row],[q-Wert (Indifferenz)]]),((ABS(Tabelle2[[#This Row],[Healthy City]]-Tabelle2[[#This Row],[Business as usual]])-Tabelle2[[#This Row],[q-Wert (Indifferenz)]])/(Tabelle2[[#This Row],[p-Wert (Präferenz)]]-Tabelle2[[#This Row],[q-Wert (Indifferenz)]]))))),IF(ABS(Tabelle2[[#This Row],[Healthy City]]-Tabelle2[[#This Row],[Business as usual]])<Tabelle2[[#This Row],[q-Wert (Indifferenz)]], 0,IF(ABS(Tabelle2[[#This Row],[Healthy City]]-Tabelle2[[#This Row],[Business as usual]])>Tabelle2[[#This Row],[p-Wert (Präferenz)]],1,IF(AND(ABS(Tabelle2[[#This Row],[Healthy City]]-Tabelle2[[#This Row],[Business as usual]])<=Tabelle2[[#This Row],[p-Wert (Präferenz)]],ABS(Tabelle2[[#This Row],[Healthy City]]-Tabelle2[[#This Row],[Business as usual]])>=Tabelle2[[#This Row],[q-Wert (Indifferenz)]]),((ABS(Tabelle2[[#This Row],[Healthy City]]-Tabelle2[[#This Row],[Business as usual]])-Tabelle2[[#This Row],[q-Wert (Indifferenz)]])/(Tabelle2[[#This Row],[p-Wert (Präferenz)]]-Tabelle2[[#This Row],[q-Wert (Indifferenz)]])))))),IF(Tabelle2[[#This Row],[Healthy City]]-Tabelle2[[#This Row],[Business as usual]]<0,-1*IF(ABS(Tabelle2[[#This Row],[Healthy City]]-Tabelle2[[#This Row],[Business as usual]])<Tabelle2[[#This Row],[q-Wert (Indifferenz)]], 0,IF(ABS(Tabelle2[[#This Row],[Healthy City]]-Tabelle2[[#This Row],[Business as usual]])>Tabelle2[[#This Row],[p-Wert (Präferenz)]],1,IF(AND(ABS(Tabelle2[[#This Row],[Healthy City]]-Tabelle2[[#This Row],[Business as usual]])<=Tabelle2[[#This Row],[p-Wert (Präferenz)]],ABS(Tabelle2[[#This Row],[Healthy City]]-Tabelle2[[#This Row],[Business as usual]])>=Tabelle2[[#This Row],[q-Wert (Indifferenz)]]),((ABS(Tabelle2[[#This Row],[Healthy City]]-Tabelle2[[#This Row],[Business as usual]])-Tabelle2[[#This Row],[q-Wert (Indifferenz)]])/(Tabelle2[[#This Row],[p-Wert (Präferenz)]]-Tabelle2[[#This Row],[q-Wert (Indifferenz)]]))))),IF(ABS(Tabelle2[[#This Row],[Healthy City]]-Tabelle2[[#This Row],[Business as usual]])<Tabelle2[[#This Row],[q-Wert (Indifferenz)]], 0,IF(ABS(Tabelle2[[#This Row],[Healthy City]]-Tabelle2[[#This Row],[Business as usual]])>Tabelle2[[#This Row],[p-Wert (Präferenz)]],1,IF(AND(ABS(Tabelle2[[#This Row],[Healthy City]]-Tabelle2[[#This Row],[Business as usual]])<=Tabelle2[[#This Row],[p-Wert (Präferenz)]],ABS(Tabelle2[[#This Row],[Healthy City]]-Tabelle2[[#This Row],[Business as usual]])>=Tabelle2[[#This Row],[q-Wert (Indifferenz)]]),((ABS(Tabelle2[[#This Row],[Healthy City]]-Tabelle2[[#This Row],[Business as usual]])-Tabelle2[[#This Row],[q-Wert (Indifferenz)]])/(Tabelle2[[#This Row],[p-Wert (Präferenz)]]-Tabelle2[[#This Row],[q-Wert (Indifferenz)]])))))))","v":1},null,{"$f":"IF(Tabelle2[[#This Row],[min/max]]=\"min\",-1*IF(Tabelle2[[#This Row],[Urban Sprawl]]-Tabelle2[[#This Row],[Smart City]]<0,-1*IF(ABS(Tabelle2[[#This Row],[Urban Sprawl]]-Tabelle2[[#This Row],[Smart City]])<Tabelle2[[#This Row],[q-Wert (Indifferenz)]], 0,IF(ABS(Tabelle2[[#This Row],[Urban Sprawl]]-Tabelle2[[#This Row],[Smart City]])>Tabelle2[[#This Row],[p-Wert (Präferenz)]],1,IF(AND(ABS(Tabelle2[[#This Row],[Urban Sprawl]]-Tabelle2[[#This Row],[Smart City]])<=Tabelle2[[#This Row],[p-Wert (Präferenz)]],ABS(Tabelle2[[#This Row],[Urban Sprawl]]-Tabelle2[[#This Row],[Smart City]])>=Tabelle2[[#This Row],[q-Wert (Indifferenz)]]),((ABS(Tabelle2[[#This Row],[Urban Sprawl]]-Tabelle2[[#This Row],[Smart City]])-Tabelle2[[#This Row],[q-Wert (Indifferenz)]])/(Tabelle2[[#This Row],[p-Wert (Präferenz)]]-Tabelle2[[#This Row],[q-Wert (Indifferenz)]]))))),IF(ABS(Tabelle2[[#This Row],[Urban Sprawl]]-Tabelle2[[#This Row],[Smart City]])<Tabelle2[[#This Row],[q-Wert (Indifferenz)]], 0,IF(ABS(Tabelle2[[#This Row],[Urban Sprawl]]-Tabelle2[[#This Row],[Smart City]])>Tabelle2[[#This Row],[p-Wert (Präferenz)]],1,IF(AND(ABS(Tabelle2[[#This Row],[Urban Sprawl]]-Tabelle2[[#This Row],[Smart City]])<=Tabelle2[[#This Row],[p-Wert (Präferenz)]],ABS(Tabelle2[[#This Row],[Urban Sprawl]]-Tabelle2[[#This Row],[Smart City]])>=Tabelle2[[#This Row],[q-Wert (Indifferenz)]]),((ABS(Tabelle2[[#This Row],[Urban Sprawl]]-Tabelle2[[#This Row],[Smart City]])-Tabelle2[[#This Row],[q-Wert (Indifferenz)]])/(Tabelle2[[#This Row],[p-Wert (Präferenz)]]-Tabelle2[[#This Row],[q-Wert (Indifferenz)]])))))),IF(Tabelle2[[#This Row],[Urban Sprawl]]-Tabelle2[[#This Row],[Smart City]]<0,-1*IF(ABS(Tabelle2[[#This Row],[Urban Sprawl]]-Tabelle2[[#This Row],[Smart City]])<Tabelle2[[#This Row],[q-Wert (Indifferenz)]], 0,IF(ABS(Tabelle2[[#This Row],[Urban Sprawl]]-Tabelle2[[#This Row],[Smart City]])>Tabelle2[[#This Row],[p-Wert (Präferenz)]],1,IF(AND(ABS(Tabelle2[[#This Row],[Urban Sprawl]]-Tabelle2[[#This Row],[Smart City]])<=Tabelle2[[#This Row],[p-Wert (Präferenz)]],ABS(Tabelle2[[#This Row],[Urban Sprawl]]-Tabelle2[[#This Row],[Smart City]])>=Tabelle2[[#This Row],[q-Wert (Indifferenz)]]),((ABS(Tabelle2[[#This Row],[Urban Sprawl]]-Tabelle2[[#This Row],[Smart City]])-Tabelle2[[#This Row],[q-Wert (Indifferenz)]])/(Tabelle2[[#This Row],[p-Wert (Präferenz)]]-Tabelle2[[#This Row],[q-Wert (Indifferenz)]]))))),IF(ABS(Tabelle2[[#This Row],[Urban Sprawl]]-Tabelle2[[#This Row],[Smart City]])<Tabelle2[[#This Row],[q-Wert (Indifferenz)]], 0,IF(ABS(Tabelle2[[#This Row],[Urban Sprawl]]-Tabelle2[[#This Row],[Smart City]])>Tabelle2[[#This Row],[p-Wert (Präferenz)]],1,IF(AND(ABS(Tabelle2[[#This Row],[Urban Sprawl]]-Tabelle2[[#This Row],[Smart City]])<=Tabelle2[[#This Row],[p-Wert (Präferenz)]],ABS(Tabelle2[[#This Row],[Urban Sprawl]]-Tabelle2[[#This Row],[Smart City]])>=Tabelle2[[#This Row],[q-Wert (Indifferenz)]]),((ABS(Tabelle2[[#This Row],[Urban Sprawl]]-Tabelle2[[#This Row],[Smart City]])-Tabelle2[[#This Row],[q-Wert (Indifferenz)]])/(Tabelle2[[#This Row],[p-Wert (Präferenz)]]-Tabelle2[[#This Row],[q-Wert (Indifferenz)]])))))))","v":-0.42333333333333328},{"$f":"IF(Tabelle2[[#This Row],[min/max]]=\"min\",-1*IF(Tabelle2[[#This Row],[Urban Sprawl]]-Tabelle2[[#This Row],[Healthy City]]<0,-1*IF(ABS(Tabelle2[[#This Row],[Urban Sprawl]]-Tabelle2[[#This Row],[Healthy City]])<Tabelle2[[#This Row],[q-Wert (Indifferenz)]], 0,IF(ABS(Tabelle2[[#This Row],[Urban Sprawl]]-Tabelle2[[#This Row],[Healthy City]])>Tabelle2[[#This Row],[p-Wert (Präferenz)]],1,IF(AND(ABS(Tabelle2[[#This Row],[Urban Sprawl]]-Tabelle2[[#This Row],[Healthy City]])<=Tabelle2[[#This Row],[p-Wert (Präferenz)]],ABS(Tabelle2[[#This Row],[Urban Sprawl]]-Tabelle2[[#This Row],[Healthy City]])>=Tabelle2[[#This Row],[q-Wert (Indifferenz)]]),((ABS(Tabelle2[[#This Row],[Urban Sprawl]]-Tabelle2[[#This Row],[Healthy City]])-Tabelle2[[#This Row],[q-Wert (Indifferenz)]])/(Tabelle2[[#This Row],[p-Wert (Präferenz)]]-Tabelle2[[#This Row],[q-Wert (Indifferenz)]]))))),IF(ABS(Tabelle2[[#This Row],[Urban Sprawl]]-Tabelle2[[#This Row],[Healthy City]])<Tabelle2[[#This Row],[q-Wert (Indifferenz)]], 0,IF(ABS(Tabelle2[[#This Row],[Urban Sprawl]]-Tabelle2[[#This Row],[Healthy City]])>Tabelle2[[#This Row],[p-Wert (Präferenz)]],1,IF(AND(ABS(Tabelle2[[#This Row],[Urban Sprawl]]-Tabelle2[[#This Row],[Healthy City]])<=Tabelle2[[#This Row],[p-Wert (Präferenz)]],ABS(Tabelle2[[#This Row],[Urban Sprawl]]-Tabelle2[[#This Row],[Healthy City]])>=Tabelle2[[#This Row],[q-Wert (Indifferenz)]]),((ABS(Tabelle2[[#This Row],[Urban Sprawl]]-Tabelle2[[#This Row],[Healthy City]])-Tabelle2[[#This Row],[q-Wert (Indifferenz)]])/(Tabelle2[[#This Row],[p-Wert (Präferenz)]]-Tabelle2[[#This Row],[q-Wert (Indifferenz)]])))))),IF(Tabelle2[[#This Row],[Urban Sprawl]]-Tabelle2[[#This Row],[Healthy City]]<0,-1*IF(ABS(Tabelle2[[#This Row],[Urban Sprawl]]-Tabelle2[[#This Row],[Healthy City]])<Tabelle2[[#This Row],[q-Wert (Indifferenz)]], 0,IF(ABS(Tabelle2[[#This Row],[Urban Sprawl]]-Tabelle2[[#This Row],[Healthy City]])>Tabelle2[[#This Row],[p-Wert (Präferenz)]],1,IF(AND(ABS(Tabelle2[[#This Row],[Urban Sprawl]]-Tabelle2[[#This Row],[Healthy City]])<=Tabelle2[[#This Row],[p-Wert (Präferenz)]],ABS(Tabelle2[[#This Row],[Urban Sprawl]]-Tabelle2[[#This Row],[Healthy City]])>=Tabelle2[[#This Row],[q-Wert (Indifferenz)]]),((ABS(Tabelle2[[#This Row],[Urban Sprawl]]-Tabelle2[[#This Row],[Healthy City]])-Tabelle2[[#This Row],[q-Wert (Indifferenz)]])/(Tabelle2[[#This Row],[p-Wert (Präferenz)]]-Tabelle2[[#This Row],[q-Wert (Indifferenz)]]))))),IF(ABS(Tabelle2[[#This Row],[Urban Sprawl]]-Tabelle2[[#This Row],[Healthy City]])<Tabelle2[[#This Row],[q-Wert (Indifferenz)]], 0,IF(ABS(Tabelle2[[#This Row],[Urban Sprawl]]-Tabelle2[[#This Row],[Healthy City]])>Tabelle2[[#This Row],[p-Wert (Präferenz)]],1,IF(AND(ABS(Tabelle2[[#This Row],[Urban Sprawl]]-Tabelle2[[#This Row],[Healthy City]])<=Tabelle2[[#This Row],[p-Wert (Präferenz)]],ABS(Tabelle2[[#This Row],[Urban Sprawl]]-Tabelle2[[#This Row],[Healthy City]])>=Tabelle2[[#This Row],[q-Wert (Indifferenz)]]),((ABS(Tabelle2[[#This Row],[Urban Sprawl]]-Tabelle2[[#This Row],[Healthy City]])-Tabelle2[[#This Row],[q-Wert (Indifferenz)]])/(Tabelle2[[#This Row],[p-Wert (Präferenz)]]-Tabelle2[[#This Row],[q-Wert (Indifferenz)]])))))))","v":-1},{"$f":"IF(Tabelle2[[#This Row],[min/max]]=\"min\",-1*IF(Tabelle2[[#This Row],[Urban Sprawl]]-Tabelle2[[#This Row],[Business as usual]]<0,-1*IF(ABS(Tabelle2[[#This Row],[Urban Sprawl]]-Tabelle2[[#This Row],[Business as usual]])<Tabelle2[[#This Row],[q-Wert (Indifferenz)]], 0,IF(ABS(Tabelle2[[#This Row],[Urban Sprawl]]-Tabelle2[[#This Row],[Business as usual]])>Tabelle2[[#This Row],[p-Wert (Präferenz)]],1,IF(AND(ABS(Tabelle2[[#This Row],[Urban Sprawl]]-Tabelle2[[#This Row],[Business as usual]])<=Tabelle2[[#This Row],[p-Wert (Präferenz)]],ABS(Tabelle2[[#This Row],[Urban Sprawl]]-Tabelle2[[#This Row],[Business as usual]])>=Tabelle2[[#This Row],[q-Wert (Indifferenz)]]),((ABS(Tabelle2[[#This Row],[Urban Sprawl]]-Tabelle2[[#This Row],[Business as usual]])-Tabelle2[[#This Row],[q-Wert (Indifferenz)]])/(Tabelle2[[#This Row],[p-Wert (Präferenz)]]-Tabelle2[[#This Row],[q-Wert (Indifferenz)]]))))),IF(ABS(Tabelle2[[#This Row],[Urban Sprawl]]-Tabelle2[[#This Row],[Business as usual]])<Tabelle2[[#This Row],[q-Wert (Indifferenz)]], 0,IF(ABS(Tabelle2[[#This Row],[Urban Sprawl]]-Tabelle2[[#This Row],[Business as usual]])>Tabelle2[[#This Row],[p-Wert (Präferenz)]],1,IF(AND(ABS(Tabelle2[[#This Row],[Urban Sprawl]]-Tabelle2[[#This Row],[Business as usual]])<=Tabelle2[[#This Row],[p-Wert (Präferenz)]],ABS(Tabelle2[[#This Row],[Urban Sprawl]]-Tabelle2[[#This Row],[Business as usual]])>=Tabelle2[[#This Row],[q-Wert (Indifferenz)]]),((ABS(Tabelle2[[#This Row],[Urban Sprawl]]-Tabelle2[[#This Row],[Business as usual]])-Tabelle2[[#This Row],[q-Wert (Indifferenz)]])/(Tabelle2[[#This Row],[p-Wert (Präferenz)]]-Tabelle2[[#This Row],[q-Wert (Indifferenz)]])))))),IF(Tabelle2[[#This Row],[Urban Sprawl]]-Tabelle2[[#This Row],[Business as usual]]<0,-1*IF(ABS(Tabelle2[[#This Row],[Urban Sprawl]]-Tabelle2[[#This Row],[Business as usual]])<Tabelle2[[#This Row],[q-Wert (Indifferenz)]], 0,IF(ABS(Tabelle2[[#This Row],[Urban Sprawl]]-Tabelle2[[#This Row],[Business as usual]])>Tabelle2[[#This Row],[p-Wert (Präferenz)]],1,IF(AND(ABS(Tabelle2[[#This Row],[Urban Sprawl]]-Tabelle2[[#This Row],[Business as usual]])<=Tabelle2[[#This Row],[p-Wert (Präferenz)]],ABS(Tabelle2[[#This Row],[Urban Sprawl]]-Tabelle2[[#This Row],[Business as usual]])>=Tabelle2[[#This Row],[q-Wert (Indifferenz)]]),((ABS(Tabelle2[[#This Row],[Urban Sprawl]]-Tabelle2[[#This Row],[Business as usual]])-Tabelle2[[#This Row],[q-Wert (Indifferenz)]])/(Tabelle2[[#This Row],[p-Wert (Präferenz)]]-Tabelle2[[#This Row],[q-Wert (Indifferenz)]]))))),IF(ABS(Tabelle2[[#This Row],[Urban Sprawl]]-Tabelle2[[#This Row],[Business as usual]])<Tabelle2[[#This Row],[q-Wert (Indifferenz)]], 0,IF(ABS(Tabelle2[[#This Row],[Urban Sprawl]]-Tabelle2[[#This Row],[Business as usual]])>Tabelle2[[#This Row],[p-Wert (Präferenz)]],1,IF(AND(ABS(Tabelle2[[#This Row],[Urban Sprawl]]-Tabelle2[[#This Row],[Business as usual]])<=Tabelle2[[#This Row],[p-Wert (Präferenz)]],ABS(Tabelle2[[#This Row],[Urban Sprawl]]-Tabelle2[[#This Row],[Business as usual]])>=Tabelle2[[#This Row],[q-Wert (Indifferenz)]]),((ABS(Tabelle2[[#This Row],[Urban Sprawl]]-Tabelle2[[#This Row],[Business as usual]])-Tabelle2[[#This Row],[q-Wert (Indifferenz)]])/(Tabelle2[[#This Row],[p-Wert (Präferenz)]]-Tabelle2[[#This Row],[q-Wert (Indifferenz)]])))))))","v":0},null,{"$f":"IF(Tabelle2[[#This Row],[min/max]]=\"min\",-1*IF(Tabelle2[[#This Row],[Business as usual]]-Tabelle2[[#This Row],[Smart City]]<0,-1*IF(ABS(Tabelle2[[#This Row],[Business as usual]]-Tabelle2[[#This Row],[Smart City]])<Tabelle2[[#This Row],[q-Wert (Indifferenz)]], 0,IF(ABS(Tabelle2[[#This Row],[Business as usual]]-Tabelle2[[#This Row],[Smart City]])>Tabelle2[[#This Row],[p-Wert (Präferenz)]],1,IF(AND(ABS(Tabelle2[[#This Row],[Business as usual]]-Tabelle2[[#This Row],[Smart City]])<=Tabelle2[[#This Row],[p-Wert (Präferenz)]],ABS(Tabelle2[[#This Row],[Business as usual]]-Tabelle2[[#This Row],[Smart City]])>=Tabelle2[[#This Row],[q-Wert (Indifferenz)]]),((ABS(Tabelle2[[#This Row],[Business as usual]]-Tabelle2[[#This Row],[Smart City]])-Tabelle2[[#This Row],[q-Wert (Indifferenz)]])/(Tabelle2[[#This Row],[p-Wert (Präferenz)]]-Tabelle2[[#This Row],[q-Wert (Indifferenz)]]))))),IF(ABS(Tabelle2[[#This Row],[Business as usual]]-Tabelle2[[#This Row],[Smart City]])<Tabelle2[[#This Row],[q-Wert (Indifferenz)]], 0,IF(ABS(Tabelle2[[#This Row],[Business as usual]]-Tabelle2[[#This Row],[Smart City]])>Tabelle2[[#This Row],[p-Wert (Präferenz)]],1,IF(AND(ABS(Tabelle2[[#This Row],[Business as usual]]-Tabelle2[[#This Row],[Smart City]])<=Tabelle2[[#This Row],[p-Wert (Präferenz)]],ABS(Tabelle2[[#This Row],[Business as usual]]-Tabelle2[[#This Row],[Smart City]])>=Tabelle2[[#This Row],[q-Wert (Indifferenz)]]),((ABS(Tabelle2[[#This Row],[Business as usual]]-Tabelle2[[#This Row],[Smart City]])-Tabelle2[[#This Row],[q-Wert (Indifferenz)]])/(Tabelle2[[#This Row],[p-Wert (Präferenz)]]-Tabelle2[[#This Row],[q-Wert (Indifferenz)]])))))),IF(Tabelle2[[#This Row],[Business as usual]]-Tabelle2[[#This Row],[Smart City]]<0,-1*IF(ABS(Tabelle2[[#This Row],[Business as usual]]-Tabelle2[[#This Row],[Smart City]])<Tabelle2[[#This Row],[q-Wert (Indifferenz)]], 0,IF(ABS(Tabelle2[[#This Row],[Business as usual]]-Tabelle2[[#This Row],[Smart City]])>Tabelle2[[#This Row],[p-Wert (Präferenz)]],1,IF(AND(ABS(Tabelle2[[#This Row],[Business as usual]]-Tabelle2[[#This Row],[Smart City]])<=Tabelle2[[#This Row],[p-Wert (Präferenz)]],ABS(Tabelle2[[#This Row],[Business as usual]]-Tabelle2[[#This Row],[Smart City]])>=Tabelle2[[#This Row],[q-Wert (Indifferenz)]]),((ABS(Tabelle2[[#This Row],[Business as usual]]-Tabelle2[[#This Row],[Smart City]])-Tabelle2[[#This Row],[q-Wert (Indifferenz)]])/(Tabelle2[[#This Row],[p-Wert (Präferenz)]]-Tabelle2[[#This Row],[q-Wert (Indifferenz)]]))))),IF(ABS(Tabelle2[[#This Row],[Business as usual]]-Tabelle2[[#This Row],[Smart City]])<Tabelle2[[#This Row],[q-Wert (Indifferenz)]], 0,IF(ABS(Tabelle2[[#This Row],[Business as usual]]-Tabelle2[[#This Row],[Smart City]])>Tabelle2[[#This Row],[p-Wert (Präferenz)]],1,IF(AND(ABS(Tabelle2[[#This Row],[Business as usual]]-Tabelle2[[#This Row],[Smart City]])<=Tabelle2[[#This Row],[p-Wert (Präferenz)]],ABS(Tabelle2[[#This Row],[Business as usual]]-Tabelle2[[#This Row],[Smart City]])>=Tabelle2[[#This Row],[q-Wert (Indifferenz)]]),((ABS(Tabelle2[[#This Row],[Business as usual]]-Tabelle2[[#This Row],[Smart City]])-Tabelle2[[#This Row],[q-Wert (Indifferenz)]])/(Tabelle2[[#This Row],[p-Wert (Präferenz)]]-Tabelle2[[#This Row],[q-Wert (Indifferenz)]])))))))","v":-0.42333333333333328},{"$f":"IF(Tabelle2[[#This Row],[min/max]]=\"min\",-1*IF(Tabelle2[[#This Row],[Business as usual]]-Tabelle2[[#This Row],[Healthy City]]<0,-1*IF(ABS(Tabelle2[[#This Row],[Business as usual]]-Tabelle2[[#This Row],[Healthy City]])<Tabelle2[[#This Row],[q-Wert (Indifferenz)]], 0,IF(ABS(Tabelle2[[#This Row],[Business as usual]]-Tabelle2[[#This Row],[Healthy City]])>Tabelle2[[#This Row],[p-Wert (Präferenz)]],1,IF(AND(ABS(Tabelle2[[#This Row],[Business as usual]]-Tabelle2[[#This Row],[Healthy City]])<=Tabelle2[[#This Row],[p-Wert (Präferenz)]],ABS(Tabelle2[[#This Row],[Business as usual]]-Tabelle2[[#This Row],[Healthy City]])>=Tabelle2[[#This Row],[q-Wert (Indifferenz)]]),((ABS(Tabelle2[[#This Row],[Business as usual]]-Tabelle2[[#This Row],[Healthy City]])-Tabelle2[[#This Row],[q-Wert (Indifferenz)]])/(Tabelle2[[#This Row],[p-Wert (Präferenz)]]-Tabelle2[[#This Row],[q-Wert (Indifferenz)]]))))),IF(ABS(Tabelle2[[#This Row],[Business as usual]]-Tabelle2[[#This Row],[Healthy City]])<Tabelle2[[#This Row],[q-Wert (Indifferenz)]], 0,IF(ABS(Tabelle2[[#This Row],[Business as usual]]-Tabelle2[[#This Row],[Healthy City]])>Tabelle2[[#This Row],[p-Wert (Präferenz)]],1,IF(AND(ABS(Tabelle2[[#This Row],[Business as usual]]-Tabelle2[[#This Row],[Healthy City]])<=Tabelle2[[#This Row],[p-Wert (Präferenz)]],ABS(Tabelle2[[#This Row],[Business as usual]]-Tabelle2[[#This Row],[Healthy City]])>=Tabelle2[[#This Row],[q-Wert (Indifferenz)]]),((ABS(Tabelle2[[#This Row],[Business as usual]]-Tabelle2[[#This Row],[Healthy City]])-Tabelle2[[#This Row],[q-Wert (Indifferenz)]])/(Tabelle2[[#This Row],[p-Wert (Präferenz)]]-Tabelle2[[#This Row],[q-Wert (Indifferenz)]])))))),IF(Tabelle2[[#This Row],[Business as usual]]-Tabelle2[[#This Row],[Healthy City]]<0,-1*IF(ABS(Tabelle2[[#This Row],[Business as usual]]-Tabelle2[[#This Row],[Healthy City]])<Tabelle2[[#This Row],[q-Wert (Indifferenz)]], 0,IF(ABS(Tabelle2[[#This Row],[Business as usual]]-Tabelle2[[#This Row],[Healthy City]])>Tabelle2[[#This Row],[p-Wert (Präferenz)]],1,IF(AND(ABS(Tabelle2[[#This Row],[Business as usual]]-Tabelle2[[#This Row],[Healthy City]])<=Tabelle2[[#This Row],[p-Wert (Präferenz)]],ABS(Tabelle2[[#This Row],[Business as usual]]-Tabelle2[[#This Row],[Healthy City]])>=Tabelle2[[#This Row],[q-Wert (Indifferenz)]]),((ABS(Tabelle2[[#This Row],[Business as usual]]-Tabelle2[[#This Row],[Healthy City]])-Tabelle2[[#This Row],[q-Wert (Indifferenz)]])/(Tabelle2[[#This Row],[p-Wert (Präferenz)]]-Tabelle2[[#This Row],[q-Wert (Indifferenz)]]))))),IF(ABS(Tabelle2[[#This Row],[Business as usual]]-Tabelle2[[#This Row],[Healthy City]])<Tabelle2[[#This Row],[q-Wert (Indifferenz)]], 0,IF(ABS(Tabelle2[[#This Row],[Business as usual]]-Tabelle2[[#This Row],[Healthy City]])>Tabelle2[[#This Row],[p-Wert (Präferenz)]],1,IF(AND(ABS(Tabelle2[[#This Row],[Business as usual]]-Tabelle2[[#This Row],[Healthy City]])<=Tabelle2[[#This Row],[p-Wert (Präferenz)]],ABS(Tabelle2[[#This Row],[Business as usual]]-Tabelle2[[#This Row],[Healthy City]])>=Tabelle2[[#This Row],[q-Wert (Indifferenz)]]),((ABS(Tabelle2[[#This Row],[Business as usual]]-Tabelle2[[#This Row],[Healthy City]])-Tabelle2[[#This Row],[q-Wert (Indifferenz)]])/(Tabelle2[[#This Row],[p-Wert (Präferenz)]]-Tabelle2[[#This Row],[q-Wert (Indifferenz)]])))))))","v":-1},{"$f":"IF(Tabelle2[[#This Row],[min/max]]=\"min\",-1*IF(Tabelle2[[#This Row],[Business as usual]]-Tabelle2[[#This Row],[Urban Sprawl]]<0,-1*IF(ABS(Tabelle2[[#This Row],[Business as usual]]-Tabelle2[[#This Row],[Urban Sprawl]])<Tabelle2[[#This Row],[q-Wert (Indifferenz)]], 0,IF(ABS(Tabelle2[[#This Row],[Business as usual]]-Tabelle2[[#This Row],[Urban Sprawl]])>Tabelle2[[#This Row],[p-Wert (Präferenz)]],1,IF(AND(ABS(Tabelle2[[#This Row],[Business as usual]]-Tabelle2[[#This Row],[Urban Sprawl]])<=Tabelle2[[#This Row],[p-Wert (Präferenz)]],ABS(Tabelle2[[#This Row],[Business as usual]]-Tabelle2[[#This Row],[Urban Sprawl]])>=Tabelle2[[#This Row],[q-Wert (Indifferenz)]]),((ABS(Tabelle2[[#This Row],[Business as usual]]-Tabelle2[[#This Row],[Urban Sprawl]])-Tabelle2[[#This Row],[q-Wert (Indifferenz)]])/(Tabelle2[[#This Row],[p-Wert (Präferenz)]]-Tabelle2[[#This Row],[q-Wert (Indifferenz)]]))))),IF(ABS(Tabelle2[[#This Row],[Business as usual]]-Tabelle2[[#This Row],[Urban Sprawl]])<Tabelle2[[#This Row],[q-Wert (Indifferenz)]], 0,IF(ABS(Tabelle2[[#This Row],[Business as usual]]-Tabelle2[[#This Row],[Urban Sprawl]])>Tabelle2[[#This Row],[p-Wert (Präferenz)]],1,IF(AND(ABS(Tabelle2[[#This Row],[Business as usual]]-Tabelle2[[#This Row],[Urban Sprawl]])<=Tabelle2[[#This Row],[p-Wert (Präferenz)]],ABS(Tabelle2[[#This Row],[Business as usual]]-Tabelle2[[#This Row],[Urban Sprawl]])>=Tabelle2[[#This Row],[q-Wert (Indifferenz)]]),((ABS(Tabelle2[[#This Row],[Business as usual]]-Tabelle2[[#This Row],[Urban Sprawl]])-Tabelle2[[#This Row],[q-Wert (Indifferenz)]])/(Tabelle2[[#This Row],[p-Wert (Präferenz)]]-Tabelle2[[#This Row],[q-Wert (Indifferenz)]])))))),IF(Tabelle2[[#This Row],[Business as usual]]-Tabelle2[[#This Row],[Urban Sprawl]]<0,-1*IF(ABS(Tabelle2[[#This Row],[Business as usual]]-Tabelle2[[#This Row],[Urban Sprawl]])<Tabelle2[[#This Row],[q-Wert (Indifferenz)]], 0,IF(ABS(Tabelle2[[#This Row],[Business as usual]]-Tabelle2[[#This Row],[Urban Sprawl]])>Tabelle2[[#This Row],[p-Wert (Präferenz)]],1,IF(AND(ABS(Tabelle2[[#This Row],[Business as usual]]-Tabelle2[[#This Row],[Urban Sprawl]])<=Tabelle2[[#This Row],[p-Wert (Präferenz)]],ABS(Tabelle2[[#This Row],[Business as usual]]-Tabelle2[[#This Row],[Urban Sprawl]])>=Tabelle2[[#This Row],[q-Wert (Indifferenz)]]),((ABS(Tabelle2[[#This Row],[Business as usual]]-Tabelle2[[#This Row],[Urban Sprawl]])-Tabelle2[[#This Row],[q-Wert (Indifferenz)]])/(Tabelle2[[#This Row],[p-Wert (Präferenz)]]-Tabelle2[[#This Row],[q-Wert (Indifferenz)]]))))),IF(ABS(Tabelle2[[#This Row],[Business as usual]]-Tabelle2[[#This Row],[Urban Sprawl]])<Tabelle2[[#This Row],[q-Wert (Indifferenz)]], 0,IF(ABS(Tabelle2[[#This Row],[Business as usual]]-Tabelle2[[#This Row],[Urban Sprawl]])>Tabelle2[[#This Row],[p-Wert (Präferenz)]],1,IF(AND(ABS(Tabelle2[[#This Row],[Business as usual]]-Tabelle2[[#This Row],[Urban Sprawl]])<=Tabelle2[[#This Row],[p-Wert (Präferenz)]],ABS(Tabelle2[[#This Row],[Business as usual]]-Tabelle2[[#This Row],[Urban Sprawl]])>=Tabelle2[[#This Row],[q-Wert (Indifferenz)]]),((ABS(Tabelle2[[#This Row],[Business as usual]]-Tabelle2[[#This Row],[Urban Sprawl]])-Tabelle2[[#This Row],[q-Wert (Indifferenz)]])/(Tabelle2[[#This Row],[p-Wert (Präferenz)]]-Tabelle2[[#This Row],[q-Wert (Indifferenz)]])))))))","v":0}]
[null,null,null,null,null,null,null,"Im Projekt erhobene Daten"]
[]
[]
[null,null,null,null,null,null,"Score",{"$f":"Tabelle2[[#Headers],[Smart City]]","v":"Smart City"},{"$f":"Tabelle2[[#Headers],[Healthy City]]","v":"Healthy City"},{"$f":"Tabelle2[[#Headers],[Urban Sprawl]]","v":"Urban Sprawl"},{"$f":"Tabelle2[[#Headers],[Business as usual]]","v":"Business as usual"}]
[null,null,null,null,null,null,null,{"$f":"SUM(O48:Q48)/(COUNTA(H23:K23)-1)","v":0.26702910112429473},{"$f":"SUM(S40:V48)/(COUNTA(H23:K23)-1)","v":0.38481502304177129},{"$f":"SUM(W48:Y48)/(COUNTA(H23:K23)-1)","v":3.1268445662765154E-2},{"$f":"SUM(AA48:AC48)/(COUNTA(H23:K23)-1)","v":-0.58549235409840095}]
[]
[]
[]
[null,null,null,null,null,null,null,null,null,null,null,null,null,null,"Spalte1","Spalte2","Spalte3","Smart City","Spalte4","Spalte5","Spalte6","Healthy City","Spalte7","Spalte8","Spalte9","Urban Sprawl","Spalte10","Spalte11","Spalte12","Business as usual"]
[null,null,null,null,null,null,null,null,null,null,null,null,"Gewichtungen",null,{"$f":"$E2*O2","v":0},3.5999999999999997E-2,0.06,{"$f":"SUM(O29:Q29)","v":9.6000000000000002E-2},{"$f":"$E2*S2","v":0},3.5999999999999997E-2,0.06,{"$f":"SUM(S29:U29)","v":9.6000000000000002E-2},{"$f":"$E2*W2","v":-3.5999999999999997E-2},-3.5999999999999997E-2,0,{"$f":"SUM(W29:Y29)","v":-7.1999999999999995E-2},{"$f":"$E2*AA2","v":-0.06},-0.06,0,{"$f":"SUM(AA29:AC29)","v":-0.12}]
[null,null,null,null,null,null,null,null,null,null,null,null,null,null,-1.4900504617728268E-2,1.4900504617728268E-2,1.4900504617728268E-2,{"$f":"SUM(O30:Q30)","v":1.4900504617728268E-2},1.4900504617728268E-2,5.5555555555555552E-2,5.5555555555555552E-2,{"$f":"SUM(S30:U30)","v":0.12601161572883937},-1.4900504617728268E-2,-5.5555555555555552E-2,0,{"$f":"SUM(W30:Y30)","v":-7.0456060173283819E-2},-1.4900504617728268E-2,-5.5555555555555552E-2,0,{"$f":"SUM(AA30:AC30)","v":-7.0456060173283819E-2}]
[null,null,null,null,null,null,null,null,null,null,null,null,null,null,0,3.7037037037037035E-2,3.7037037037037035E-2,{"$f":"SUM(O31:Q31)","v":7.407407407407407E-2},0,3.7037037037037035E-2,3.7037037037037035E-2,7.407407407407407E-2,-3.7037037037037035E-2,-3.7037037037037035E-2,0,-7.407407407407407E-2,-3.7037037037037035E-2,-3.7037037037037035E-2,0,-7.407407407407407E-2]
[null,null,null,null,null,null,null,null,null,null,null,null,null,null,0,0,5.5555555555555552E-2,5.5555555555555552E-2,0,0,5.5555555555555552E-2,5.5555555555555552E-2,0,0,5.5555555555555552E-2,5.5555555555555552E-2,-5.5555555555555552E-2,-5.5555555555555552E-2,-5.5555555555555552E-2,-0.16666666666666666]
[null,null,null,null,null,null,null,null,null,null,null,null,null,null,-1.4891179839633447E-2,1.4891179839633447E-2,1.4891179839633447E-2,1.4891179839633447E-2,1.4891179839633447E-2,5.5555555555555552E-2,5.5555555555555552E-2,0.12600229095074456,-1.4891179839633447E-2,-5.5555555555555552E-2,0,-7.0446735395189003E-2,-1.4891179839633447E-2,-5.5555555555555552E-2,0,-7.0446735395189003E-2]
[null,null,null,null,null,null,null,null,null,null,null,null,null,null,-3.8518518518518514E-2,0,1.4814814814814827E-3,-3.7037037037037035E-2,3.8518518518518514E-2,3.8518518518518514E-2,5.5555555555555552E-2,0.1325925925925926,0,-3.8518518518518514E-2,1.4814814814814827E-3,-3.7037037037037035E-2,-1.4814814814814827E-3,-5.5555555555555552E-2,-1.4814814814814827E-3,-5.8518518518518511E-2]
[null,null,null,null,null,null,null,null,null,null,null,null,null,null,1.4687100893997445E-2,-1.4687100893997445E-2,-1.4687100893997445E-2,-1.4687100893997445E-2,-1.4687100893997445E-2,-5.5555555555555552E-2,-5.5555555555555552E-2,-0.12579821200510855,1.4687100893997445E-2,5.5555555555555552E-2,0,7.0242656449552993E-2,1.4687100893997445E-2,5.5555555555555552E-2,0,7.0242656449552993E-2]
[null,null,null,null,null,null,null,null,null,null,null,null,null,null,0,3.6307961504811893E-2,3.6307961504811893E-2,7.2615923009623787E-2,0,5.2930883639545054E-2,5.2930883639545054E-2,0.10586176727909011,-3.6307961504811893E-2,-5.2930883639545054E-2,0,-8.9238845144356954E-2,-3.6307961504811893E-2,-5.2930883639545054E-2,0,-8.9238845144356954E-2]
[null,null,null,null,null,null,null,null,null,null,null,null,null,null,3.7037037037037035E-2,3.7037037037037035E-2,5.5555555555555552E-2,0.12962962962962962,-3.7037037037037035E-2,0,0,-3.7037037037037035E-2,-3.7037037037037035E-2,0,0,-3.7037037037037035E-2,-5.5555555555555552E-2,0,0,-5.5555555555555552E-2]
[null,null,null,null,null,null,null,null,null,null,null,null,null,null,0,3.4990002856326731E-2,4.9557269351613829E-2,8.454727220794056E-2,0,5.5555555555555552E-2,5.5555555555555552E-2,0.1111111111111111,-3.4990002856326731E-2,-5.5555555555555552E-2,0,-9.0545558411882276E-2,-4.9557269351613829E-2,-5.5555555555555552E-2,0,-0.10511282490716939]
[null,null,null,null,null,null,null,null,null,null,null,null,null,null,-4.2045189843931977E-2,-4.8509201024924294E-2,0,-9.0554390868856277E-2,4.2045189843931977E-2,0,8.7351502445842059E-3,5.0780340088516181E-2,4.8509201024924294E-2,0,1.5199161425576519E-2,6.3708362450500808E-2,0,-8.7351502445842059E-3,-1.5199161425576519E-2,-2.3934311670160725E-2]
[null,null,null,null,null,null,null,null,null,null,null,null,null,null,0,-5.4825476289806697E-2,3.1984424975664019E-2,-2.2841051314142678E-2,0,-3.8485607008760948E-2,4.8324294256709775E-2,9.8386872479488269E-3,5.4825476289806697E-2,3.8485607008760948E-2,5.5555555555555552E-2,0.14886663885412321,-3.1984424975664019E-2,-4.8324294256709775E-2,-5.5555555555555552E-2,-0.13586427478792934]
[null,null,null,null,null,null,null,null,null,null,null,null,null,null,4.8622374182361906E-2,0,5.5555555555555552E-2,0.10417792973791745,-4.8622374182361906E-2,-4.2008211692163823E-2,5.5555555555555552E-2,-3.5075030318970177E-2,0,4.2008211692163823E-2,5.5555555555555552E-2,9.7563767247719368E-2,-5.5555555555555552E-2,-5.5555555555555552E-2,-5.5555555555555552E-2,-0.16666666666666666]
[null,null,null,null,null,null,null,null,null,null,null,null,null,null,0,0,5.5555555555555552E-2,5.5555555555555552E-2,0,0,5.5555555555555552E-2,5.5555555555555552E-2,0,0,5.5555555555555552E-2,5.5555555555555552E-2,-5.5555555555555552E-2,-5.5555555555555552E-2,-5.5555555555555552E-2,-0.16666666666666666]
[null,null,null,null,null,null,null,null,null,null,null,null,null,null,0,0,5.5555555555555552E-2,5.5555555555555552E-2,0,0,5.5555555555555552E-2,5.5555555555555552E-2,0,0,5.5555555555555552E-2,5.5555555555555552E-2,-5.5555555555555552E-2,-5.5555555555555552E-2,-5.5555555555555552E-2,-0.16666666666666666]
[null,null,null,null,null,null,null,null,null,null,null,null,null,null,0,0,5.5555555555555552E-2,5.5555555555555552E-2,0,0,5.5555555555555552E-2,5.5555555555555552E-2,0,0,5.5555555555555552E-2,5.5555555555555552E-2,-5.5555555555555552E-2,-5.5555555555555552E-2,-5.5555555555555552E-2,-0.16666666666666666]
[null,null,null,null,null,null,null,null,null,null,null,null,null,null,5.5555555555555552E-2,0,5.5555555555555552E-2,0.1111111111111111,-5.5555555555555552E-2,-5.5555555555555552E-2,0,-0.1111111111111111,0,5.5555555555555552E-2,5.5555555555555552E-2,0.1111111111111111,-5.5555555555555552E-2,0,-5.5555555555555552E-2,-0.1111111111111111]
[null,null,null,null,null,null,null,null,null,null,null,null,null,null,-4.9999999999999992E-3,2.3518518518518515E-2,2.3518518518518515E-2,4.2037037037037032E-2,4.9999999999999992E-3,5.5555555555555552E-2,5.5555555555555552E-2,0.11611111111111111,-2.3518518518518515E-2,-5.5555555555555552E-2,0,-7.9074074074074074E-2,-2.3518518518518515E-2,-5.5555555555555552E-2,0,-7.9074074074074074E-2]
[]
[null,null,null,null,null,null,null,null,null,null,null,null,null,"Summe",{"$f":"SUM(O29:O46)","v":4.0546674849139742E-2},{"$f":"SUM(P29:P46)","v":0.11666046320236451},{"$f":"SUM(Q29:Q46)","v":0.64388016532137993},null,{"$f":"SUM(S29:S46)","v":-4.0546674849139742E-2},{"$f":"SUM(T29:T46)","v":0.19510373160528693},{"$f":"SUM(U29:U46)","v":0.70702736517787612},null,{"$f":"SUM(W29:W46)","v":-0.11666046320236451},{"$f":"SUM(X29:X46)","v":-0.19510373160528693},{"$f":"SUM(Y29:Y46)","v":0.4055695317959469},null,{"$f":"SUM(AA29:AA46)","v":-0.64388016532137993},{"$f":"SUM(AB29:AB46)","v":-0.70702736517787612},{"$f":"SUM(AC29:AC46)","v":-0.4055695317959469}]

{"sheet":"Ergebnisse","index":6,"n_rows":40,"n_cols":6,"rows_kept":40,"cut":false,"hidden":false,"merged":[[29,5,33,5],[0,4,0,5]]}
[null,null,null,null,"Entscheidungsunterstützung"]
[]
[]
[]
[]
[]
[null,null,null,null,{"$f":"'\"Walking Weights\"'!C5","v":"Maßnahme"},{"$f":"'\"Walking Weights\"'!D5","v":"Gewichtung in %"}]
[null,null,null,null,{"$f":"'\"Walking Weights\"'!C6","v":"Investmentanteil urbane Gebiete"},{"$f":"'\"Walking Weights\"'!D6","v":6}]
[null,null,null,null,{"$f":"'\"Walking Weights\"'!C7","v":"Durchschnittliches Investment pro Kopf in Infrastruktur"},{"$f":"'\"Walking Weights\"'!D7","v":5.5555555555555554}]
[null,null,null,null,{"$f":"'\"Walking Weights\"'!C8","v":"Qualität Parkmanagement"},{"$f":"'\"Walking Weights\"'!D8","v":5.5555555555555554}]
[null,null,null,null,{"$f":"'\"Walking Weights\"'!C9","v":"Qualität ÖPNV"},{"$f":"'\"Walking Weights\"'!D9","v":5.5555555555555554}]
[null,null,null,null,{"$f":"'\"Walking Weights\"'!C10","v":"City Maut"},{"$f":"'\"Walking Weights\"'!D10","v":5.5555555555555554}]
[null,null,null,null,{"$f":"'\"Walking Weights\"'!C11","v":"Parkpreis"},{"$f":"'\"Walking Weights\"'!D11","v":5.5555555555555554}]
[null,null,null,null,{"$f":"'\"Walking Weights\"'!C12","v":"Fahrtkosten"},{"$f":"'\"Walking Weights\"'!D12","v":5.5555555555555554}]
[null,null,null,null,{"$f":"'\"Walking Weights\"'!C13","v":"CO2-Preis"},{"$f":"'\"Walking Weights\"'!D13","v":5.5555555555555554}]
[null,null,null,null,{"$f":"'\"Walking Weights\"'!C14","v":"Internetabdeckung"},{"$f":"'\"Walking Weights\"'!D14","v":5.5555555555555554}]
[null,null,null,null,{"$f":"'\"Walking Weights\"'!C15","v":"Mietpreis-Index"},{"$f":"'\"Walking Weights\"'!D15","v":5.5555555555555554}]
[null,null,null,null,{"$f":"'\"Walking Weights\"'!C16","v":"Wohnflächen"},{"$f":"'\"Walking Weights\"'!D16","v":5.5555555555555554}]
[null,null,null,null,{"$f":"'\"Walking Weights\"'!C17","v":"Industrie-/Gewerbeflächen"},{"$f":"'\"Walking Weights\"'!D17","v":5.5555555555555554}]
[null,null,null,null,{"$f":"'\"Walking Weights\"'!C18","v":"Beschäftigte"},{"$f":"'\"Walking Weights\"'!D18","v":5.5555555555555554}]
[null,null,null,null,{"$f":"'\"Walking Weights\"'!C19","v":"Interkommunale Radwege"},{"$f":"'\"Walking Weights\"'!D19","v":5.5555555555555554}]
[null,null,null,null,{"$f":"'\"Walking Weights\"'!C20","v":"Erhöhte Fahrradsicherheit"},{"$f":"'\"Walking Weights\"'!D20","v":5.5555555555555554}]
[null,null,null,null,{"$f":"'\"Walking Weights\"'!C21","v":"E-Bike-Ladepunkte-Netz"},{"$f":"'\"Walking Weights\"'!D21","v":5.5555555555555554}]
[null,null,null,null,{"$f":"'\"Walking Weights\"'!C22","v":"\"Smart Card\""},{"$f":"'\"Walking Weights\"'!D22","v":5.5555555555555554}]
[null,null,null,null,{"$f":"'\"Walking Weights\"'!C23","v":"CO2 Mobilität"},{"$f":"'\"Walking Weights\"'!D23","v":5.5555555555555554}]
[]
[null,null,null,null,{"$f":"'\"Walking Weights\"'!I26","v":"Folgendes Szenario wird bei Ihrer Gewichtung bevorzugt:"},{"$f":"'\"Walking Weights\"'!J27","v":"Healthy City"}]
[]
[]
[null,null,null,null,null,{"$f":"'\"Walking Weights\"'!I28","v":"In diesem Szenario sind besonders folgende Maßnahmen stark vertreten:"}]
[]
[]
[]
[]
[]
[null,null,null,null,{"$f":"'\"Walking Weights\"'!J30","v":"Parkpreis"},{"$f":"'\"Walking Weights\"'!M30","v":"Begrenzung des Autoverkehrs durch erhöhte Parkpreise."}]
[null,null,null,null,{"$f":"'\"Walking Weights\"'!J31","v":"Durchschnittliches Investment pro Kopf in Infrastruktur"},{"$f":"'\"Walking Weights\"'!M31","v":"Der Anteil der Investitionen, der pro Kopf für Infrastruktur aufgewendet wird. Eng verknüpft mit dem Investitionsanteil in urbane Gebiete und wie dieser ein Türöffner für weitere Innovationen."}]
[null,null,null,null,{"$f":"'\"Walking Weights\"'!J32","v":"City Maut"},{"$f":"'\"Walking Weights\"'!M32","v":"Filterung der Verkehrsmodi durch Bepreisung der Nutzung von bestimmten Straßen oder sogar Quartieren."}]
[null,null,null,null,{"$f":"'\"Walking Weights\"'!J33","v":"CO2 Mobilität"},{"$f":"'\"Walking Weights\"'!M33","v":"Elektrifizierung in Individualverkehr, in ÖPNV und der Logistik für schnelle Reduktion. Langfristig auch Neuverteilung des Modal Split durch Sharing und Rufbusse."}]
[null,null,null,null,{"$f":"'\"Walking Weights\"'!J34","v":"Mietpreis-Index"},{"$f":"'\"Walking Weights\"'!M34","v":" Vergleichsgröße bezeichnet, welche sich auf die durchschnittliche Veränderung von Nettokaltmieten innerhalb eines Zeitrahmens bezieht."}]